"molecule_id","FCFP4_1024b936","FCFP4_1024b410","FCFP4_1024b314","FCFP4_1024b921","FCFP4_1024b556","FCFP4_1024b64","FCFP4_1024b235","FCFP4_1024b438","FCFP4_1024b284","FCFP4_1024b54","FCFP4_1024b25","FCFP4_1024b86","FCFP4_1024b519","FCFP4_1024b787","FCFP4_1024b400","FCFP4_1024b639","FCFP4_1024b121","FCFP4_1024b22","FCFP4_1024b1","FCFP4_1024b10","FCFP4_1024b100","FCFP4_1024b1000","FCFP4_1024b1001","FCFP4_1024b1002","FCFP4_1024b1003","FCFP4_1024b1004","FCFP4_1024b1005","FCFP4_1024b1006","FCFP4_1024b1007","FCFP4_1024b1008","FCFP4_1024b1009","FCFP4_1024b101","FCFP4_1024b1010","FCFP4_1024b1011","FCFP4_1024b1012","FCFP4_1024b1013","FCFP4_1024b1014","FCFP4_1024b1015","FCFP4_1024b1016","FCFP4_1024b1017","FCFP4_1024b1018","FCFP4_1024b1019","FCFP4_1024b102","FCFP4_1024b1020","FCFP4_1024b1021","FCFP4_1024b1022","FCFP4_1024b1023","FCFP4_1024b1024","FCFP4_1024b103","FCFP4_1024b104","FCFP4_1024b105","pXC50"
{11 1,14 1,16 1,19 1,34 1,42 1,52 5.2}
{0 CHEMBL101253,10 1,11 1,19 1,52 5.2}
{0 CHEMBL101311,1 1,10 1,19 1,20 1,52 5.4}
{0 CHEMBL103667,10 1,11 1,13 1,19 1,20 1,52 5.2}
{0 CHEMBL105442,10 1,11 1,19 1,52 5}
{0 CHEMBL1081312,7 1,9 1,19 1,44 1,52 5.7}
{0 CHEMBL1082440,11 1,19 1,20 1,48 1,52 5.1}
{0 CHEMBL1084546,1 1,10 1,11 1,19 1,52 6.3}
{0 CHEMBL1090089,11 1,19 1,52 6.523}
{0 CHEMBL1090356,1 1,2 1,3 1,4 1,6 1,8 1,10 1,11 1,14 1,15 1,16 1,18 1,19 1,52 5.1}
{0 CHEMBL1090360,1 1,2 1,3 1,4 1,6 1,8 1,10 1,11 1,14 1,15 1,16 1,18 1,19 1,52 5.1}
{0 CHEMBL109944,11 1,19 1,52 5.699}
{0 CHEMBL109981,11 1,19 1,52 6.194}
{0 CHEMBL116070,5 1,19 1,52 5.6}
{0 CHEMBL1162963,7 1,11 1,19 1,52 7.319}
{0 CHEMBL1164180,7 1,11 1,14 1,19 1,20 1,52 5.8}
{0 CHEMBL1164265,7 1,11 1,14 1,19 1,20 1,52 5.6}
{0 CHEMBL1173055,10 1,11 1,14 1,19 1,52 5.1}
{0 CHEMBL1173655,8 1,10 1,19 1,20 1,52 5}
{0 CHEMBL117697,10 1,19 1,52 4.4}
{0 CHEMBL1190711,8 1,11 1,14 1,15 1,16 1,19 1,52 5.1}
{0 CHEMBL119385,11 1,19 1,25 1,36 1,52 5.15}
{0 CHEMBL1221656,11 1,14 1,19 1,43 1,44 1,45 1,51 1,52 5.385}
{0 CHEMBL1221698,11 1,14 1,19 1,20 1,44 1,45 1,52 7.699}
{0 CHEMBL1230020,3 1,10 1,11 1,19 1,52 5}
{0 CHEMBL1230122,11 1,19 1,52 5.1}
{0 CHEMBL1232515,8 1,19 1,20 1,22 1,52 6.745}
{0 CHEMBL1233887,7 1,10 1,19 1,52 5.4}
{0 CHEMBL1236107,19 1,52 5}
{0 CHEMBL1236126,11 1,19 1,52 5.1}
{0 CHEMBL1240703,7 1,11 1,19 1,26 1,52 5}
{0 CHEMBL1241473,1 1,10 1,11 1,19 1,38 1,52 7.3}
{0 CHEMBL1241674,9 1,10 1,19 1,44 1,52 6.699}
{0 CHEMBL1242373,10 1,11 1,14 1,19 1,39 1,44 1,45 1,52 6.6}
{0 CHEMBL124660,10 1,19 1,20 1,52 5.15}
{0 CHEMBL1270399,8 1,19 1,20 1,22 1,44 1,52 6.481}
{0 CHEMBL1270795,8 1,19 1,22 1,52 5.884}
{0 CHEMBL127898,5 1,11 1,12 1,19 1,20 1,37 1,52 5.1}
{0 CHEMBL1287853,1 1,10 1,11 1,19 1,20 1,52 5.092}
{0 CHEMBL1289926,11 1,19 1,22 1,45 1,52 5}
{0 CHEMBL1336,10 1,11 1,19 1,52 5.2}
{0 CHEMBL1375418,7 1,11 1,14 1,19 1,52 5.1}
{0 CHEMBL1375640,16 1,19 1,44 1,52 5.1}
{0 CHEMBL1381197,7 1,11 1,14 1,19 1,52 5.1}
{0 CHEMBL1419458,9 1,11 1,14 1,16 1,19 1,42 1,44 1,52 5.1}
{0 CHEMBL1421,10 1,11 1,19 1,20 1,34 1,52 5.2}
{0 CHEMBL1421720,19 1,52 5.9}
{0 CHEMBL1461728,10 1,11 1,19 1,22 1,47 1,52 5.1}
{0 CHEMBL14762,9 1,11 1,19 1,52 5}
{0 CHEMBL1516890,1 1,7 1,10 1,11 1,19 1,52 5.5}
{0 CHEMBL1614701,10 1,11 1,19 1,52 5}
{0 CHEMBL1614705,14 1,19 1,22 1,52 5.1}
{0 CHEMBL162,7 1,11 1,19 1,52 7.192}
{0 CHEMBL1624529,11 1,19 1,29 1,52 5.1}
{0 CHEMBL1650533,8 1,19 1,20 1,22 1,52 7}
{0 CHEMBL1650545,8 1,19 1,20 1,22 1,52 7}
{0 CHEMBL1650551,8 1,19 1,20 1,22 1,52 7}
{0 CHEMBL1682341,10 1,11 1,12 1,19 1,22 1,47 1,52 5.4}
{0 CHEMBL1682345,10 1,11 1,14 1,16 1,19 1,22 1,47 1,52 5.1}
{0 CHEMBL1682346,11 1,14 1,16 1,19 1,22 1,44 1,52 5.6}
{0 CHEMBL1682357,10 1,11 1,14 1,16 1,19 1,22 1,47 1,52 5.1}
{0 CHEMBL1682359,10 1,14 1,16 1,19 1,22 1,47 1,52 5.1}
{0 CHEMBL1682360,10 1,14 1,16 1,19 1,20 1,22 1,47 1,52 5.2}
{0 CHEMBL1682540,2 1,3 1,4 1,8 1,10 1,14 1,16 1,22 1,47 1,52 5.2}
{0 CHEMBL1682545,1 1,10 1,14 1,16 1,22 1,47 1,52 5.1}
{0 CHEMBL1682546,10 1,11 1,14 1,16 1,19 1,22 1,38 1,47 1,52 5.2}
{0 CHEMBL1682552,2 1,3 1,4 1,8 1,10 1,14 1,16 1,19 1,22 1,47 1,52 5.4}
{0 CHEMBL1682553,2 1,3 1,4 1,8 1,10 1,14 1,16 1,19 1,22 1,47 1,52 5.4}
{0 CHEMBL1682558,6 1,10 1,14 1,16 1,19 1,20 1,22 1,47 1,52 5.1}
{0 CHEMBL1721885,1 1,10 1,11 1,19 1,20 1,52 5.678}
{0 CHEMBL1727312,10 1,11 1,19 1,52 5.1}
{0 CHEMBL17370,14 1,16 1,19 1,34 1,42 1,52 5.1}
{0 CHEMBL1739550,8 1,19 1,20 1,22 1,52 6.444}
{0 CHEMBL1775067,10 1,19 1,52 6.319}
{0 CHEMBL1775068,10 1,11 1,19 1,52 6.022}
{0 CHEMBL1775069,10 1,11 1,14 1,19 1,44 1,49 1,52 5.975}
{0 CHEMBL1775070,7 1,10 1,11 1,19 1,44 1,52 5.86}
{0 CHEMBL1775071,10 1,19 1,52 5.801}
{0 CHEMBL1775072,11 1,13 1,19 1,41 1,52 5.541}
{0 CHEMBL1775073,10 1,19 1,52 5.519}
{0 CHEMBL1775074,11 1,19 1,33 1,52 5.46}
{0 CHEMBL1775075,11 1,19 1,22 1,44 1,52 5.26}
{0 CHEMBL1775076,5 1,19 1,20 1,52 5.152}
{0 CHEMBL1775077,19 1,44 1,52 5}
{0 CHEMBL1775078,11 1,19 1,24 1,52 4.88}
{0 CHEMBL1775079,14 1,16 1,19 1,52 4.84}
{0 CHEMBL1775080,11 1,19 1,52 4.82}
{0 CHEMBL1775081,9 1,11 1,19 1,36 1,42 1,52 4.791}
{0 CHEMBL1778710,1 1,10 1,11 1,14 1,16 1,19 1,22 1,52 5.565}
{0 CHEMBL178737,8 1,11 1,19 1,49 1,52 5.6}
{0 CHEMBL1788116,10 1,11 1,19 1,20 1,52 5}
{0 CHEMBL1789941,9 1,19 1,20 1,52 5}
{0 CHEMBL180022,8 1,10 1,11 1,19 1,20 1,52 5}
{0 CHEMBL1825138,7 1,9 1,11 1,19 1,44 1,52 5.4}
{0 CHEMBL183844,10 1,11 1,14 1,19 1,24 1,52 5.1}
{0 CHEMBL184847,10 1,11 1,14 1,19 1,52 5.1}
{0 CHEMBL185569,10 1,11 1,14 1,19 1,52 5.1}
{0 CHEMBL1870106,7 1,11 1,19 1,44 1,52 7.4}
{0 CHEMBL1879463,7 1,11 1,14 1,19 1,20 1,52 5.5}
{0 CHEMBL189963,11 1,19 1,52 6.1}
{0 CHEMBL1908391,1 1,7 1,10 1,11 1,14 1,19 1,20 1,52 5}
{0 CHEMBL1908392,10 1,11 1,19 1,20 1,26 1,52 7.187}
{0 CHEMBL1908393,10 1,19 1,20 1,52 5}
{0 CHEMBL1908394,11 1,19 1,20 1,52 6.721}
{0 CHEMBL1908395,4 1,5 1,10 1,11 1,19 1,20 1,42 1,52 6.357}
{0 CHEMBL1908396,10 1,19 1,52 5}
{0 CHEMBL1908397,11 1,19 1,22 1,52 6.553}
{0 CHEMBL1909651,2 1,3 1,4 1,8 1,9 1,12 1,14 1,15 1,16 1,17 1,19 1,52 4.246}
{0 CHEMBL191003,1 1,10 1,11 1,19 1,41 1,44 1,52 5}
{0 CHEMBL1910371,2 1,3 1,4 1,8 1,9 1,12 1,17 1,19 1,52 5.083}
{0 CHEMBL1910372,2 1,3 1,4 1,8 1,9 1,12 1,14 1,16 1,17 1,19 1,52 4}
{0 CHEMBL1910373,2 1,3 1,4 1,8 1,9 1,12 1,14 1,16 1,17 1,19 1,52 4.066}
{0 CHEMBL1910374,2 1,3 1,4 1,8 1,9 1,12 1,14 1,16 1,17 1,19 1,52 5.406}
{0 CHEMBL1910375,2 1,3 1,4 1,8 1,9 1,11 1,12 1,14 1,16 1,17 1,19 1,20 1,52 5.068}
{0 CHEMBL1910376,3 1,4 1,9 1,19 1,25 1,52 4}
{0 CHEMBL1910595,3 1,4 1,9 1,19 1,25 1,52 4}
{0 CHEMBL1910597,2 1,3 1,4 1,8 1,9 1,12 1,14 1,15 1,16 1,17 1,19 1,52 4}
{0 CHEMBL1910598,2 1,3 1,4 1,8 1,9 1,12 1,14 1,15 1,17 1,19 1,52 4}
{0 CHEMBL1910599,2 1,3 1,4 1,8 1,9 1,12 1,15 1,17 1,19 1,52 4}
{0 CHEMBL1910600,2 1,3 1,4 1,8 1,9 1,12 1,14 1,15 1,16 1,17 1,19 1,52 4}
{0 CHEMBL1910601,2 1,3 1,4 1,8 1,9 1,12 1,15 1,17 1,19 1,52 4}
{0 CHEMBL1910602,2 1,3 1,4 1,8 1,9 1,12 1,14 1,15 1,16 1,17 1,19 1,52 4.27}
{0 CHEMBL1910603,2 1,3 1,4 1,8 1,9 1,12 1,14 1,15 1,17 1,19 1,52 4}
{0 CHEMBL1910604,2 1,3 1,4 1,8 1,9 1,11 1,12 1,14 1,15 1,16 1,17 1,19 1,24 1,52 4}
{0 CHEMBL1910605,2 1,3 1,4 1,8 1,9 1,12 1,14 1,16 1,19 1,25 1,52 4}
{0 CHEMBL1910606,2 1,3 1,4 1,8 1,9 1,12 1,14 1,16 1,19 1,25 1,52 4.513}
{0 CHEMBL1910607,2 1,3 1,4 1,8 1,9 1,12 1,14 1,16 1,17 1,19 1,52 5.668}
{0 CHEMBL1910608,2 1,3 1,4 1,8 1,9 1,12 1,14 1,16 1,17 1,19 1,52 5.91}
{0 CHEMBL1910609,2 1,3 1,4 1,8 1,9 1,12 1,19 1,52 4}
{0 CHEMBL1910610,3 1,4 1,9 1,14 1,16 1,19 1,52 4}
{0 CHEMBL1910614,2 1,3 1,4 1,8 1,9 1,19 1,25 1,52 4.994}
{0 CHEMBL1910616,2 1,3 1,4 1,8 1,9 1,17 1,19 1,52 4.921}
{0 CHEMBL1910617,2 1,3 1,4 1,8 1,9 1,19 1,52 4}
{0 CHEMBL1910622,8 1,9 1,17 1,19 1,52 4}
{0 CHEMBL1910623,8 1,9 1,19 1,25 1,52 5.108}
{0 CHEMBL1910624,8 1,9 1,19 1,52 4}
{0 CHEMBL1910625,2 1,3 1,4 1,8 1,9 1,12 1,14 1,16 1,17 1,19 1,52 6.013}
{0 CHEMBL1910626,2 1,3 1,4 1,8 1,9 1,12 1,14 1,16 1,19 1,25 1,52 5.553}
{0 CHEMBL1910627,8 1,9 1,14 1,16 1,17 1,19 1,52 5.539}
{0 CHEMBL1910628,2 1,3 1,4 1,8 1,9 1,10 1,12 1,14 1,15 1,16 1,17 1,19 1,44 1,52 5.523}
{0 CHEMBL1910629,2 1,3 1,4 1,8 1,9 1,12 1,14 1,15 1,16 1,17 1,19 1,52 5.504}
{0 CHEMBL1910630,2 1,3 1,4 1,8 1,9 1,12 1,15 1,19 1,25 1,52 5.446}
{0 CHEMBL1910631,2 1,3 1,4 1,8 1,9 1,12 1,14 1,16 1,19 1,25 1,52 5.425}
{0 CHEMBL1910632,2 1,3 1,4 1,8 1,9 1,12 1,19 1,25 1,52 5.344}
{0 CHEMBL1910633,2 1,3 1,4 1,8 1,9 1,12 1,14 1,15 1,16 1,17 1,19 1,52 5.247}
{0 CHEMBL1910634,2 1,3 1,4 1,8 1,9 1,12 1,14 1,16 1,17 1,19 1,52 5.233}
{0 CHEMBL1910635,2 1,3 1,4 1,8 1,9 1,12 1,15 1,17 1,19 1,52 5.227}
{0 CHEMBL1910636,2 1,3 1,4 1,8 1,9 1,12 1,19 1,25 1,52 5.224}
{0 CHEMBL1910637,2 1,3 1,4 1,8 1,9 1,12 1,14 1,16 1,17 1,19 1,52 5.22}
{0 CHEMBL1910744,2 1,3 1,4 1,8 1,9 1,12 1,14 1,16 1,19 1,25 1,52 5.192}
{0 CHEMBL1910745,2 1,3 1,4 1,8 1,9 1,14 1,16 1,17 1,19 1,52 5.135}
{0 CHEMBL1910746,2 1,3 1,4 1,8 1,9 1,12 1,19 1,52 4.943}
{0 CHEMBL1910747,2 1,3 1,4 1,8 1,9 1,12 1,14 1,16 1,19 1,25 1,52 4.878}
{0 CHEMBL1910748,2 1,3 1,4 1,8 1,9 1,14 1,16 1,19 1,25 1,52 4.856}
{0 CHEMBL1910749,2 1,3 1,4 1,8 1,9 1,12 1,14 1,16 1,17 1,19 1,52 4.854}
{0 CHEMBL1910750,2 1,3 1,4 1,8 1,9 1,12 1,14 1,16 1,19 1,25 1,52 4.757}
{0 CHEMBL1910751,2 1,3 1,4 1,8 1,9 1,12 1,14 1,16 1,19 1,25 1,52 4.745}
{0 CHEMBL1910752,2 1,3 1,4 1,8 1,9 1,12 1,14 1,15 1,16 1,17 1,19 1,52 4.733}
{0 CHEMBL1910753,2 1,3 1,4 1,8 1,9 1,12 1,14 1,16 1,19 1,52 4.688}
{0 CHEMBL1910754,2 1,3 1,4 1,8 1,9 1,12 1,14 1,16 1,19 1,25 1,52 4.679}
{0 CHEMBL1910755,2 1,3 1,4 1,8 1,9 1,12 1,19 1,25 1,52 4.577}
{0 CHEMBL1910756,2 1,3 1,4 1,8 1,9 1,14 1,16 1,19 1,25 1,52 4.349}
{0 CHEMBL1910757,2 1,3 1,4 1,8 1,9 1,12 1,15 1,17 1,19 1,52 4.102}
{0 CHEMBL1910758,2 1,3 1,4 1,8 1,9 1,12 1,19 1,25 1,52 4.081}
{0 CHEMBL1910759,3 1,4 1,9 1,14 1,16 1,19 1,25 1,52 4.027}
{0 CHEMBL1910760,2 1,3 1,4 1,8 1,9 1,19 1,25 1,52 4.007}
{0 CHEMBL1910761,2 1,3 1,4 1,7 1,8 1,9 1,14 1,19 1,25 1,52 4}
{0 CHEMBL1910762,2 1,3 1,4 1,7 1,8 1,9 1,14 1,19 1,25 1,52 4}
{0 CHEMBL1933068,1 1,5 1,7 1,11 1,19 1,52 6.602}
{0 CHEMBL1933143,1 1,5 1,7 1,11 1,19 1,52 6.699}
{0 CHEMBL1933144,1 1,5 1,7 1,11 1,19 1,52 5}
{0 CHEMBL1933145,1 1,5 1,7 1,11 1,19 1,52 6.337}
{0 CHEMBL1933146,1 1,5 1,7 1,11 1,14 1,16 1,19 1,52 6.444}
{0 CHEMBL1933147,1 1,5 1,7 1,11 1,19 1,52 6.886}
{0 CHEMBL1933148,1 1,5 1,7 1,10 1,11 1,19 1,52 6.102}
{0 CHEMBL1933149,1 1,5 1,7 1,10 1,11 1,19 1,52 6.921}
{0 CHEMBL1933277,1 1,5 1,7 1,10 1,11 1,19 1,52 6.337}
{0 CHEMBL1933278,1 1,5 1,7 1,10 1,11 1,19 1,52 7.046}
{0 CHEMBL1933279,1 1,5 1,7 1,11 1,19 1,52 6.699}
{0 CHEMBL1933280,1 1,5 1,7 1,11 1,19 1,52 7.398}
{0 CHEMBL1933281,1 1,5 1,7 1,9 1,11 1,19 1,52 6.745}
{0 CHEMBL1933282,1 1,5 1,7 1,11 1,19 1,33 1,52 6}
{0 CHEMBL1933283,1 1,5 1,7 1,11 1,19 1,20 1,52 6.699}
{0 CHEMBL1933284,1 1,5 1,7 1,11 1,19 1,29 1,52 6.886}
{0 CHEMBL1933285,1 1,5 1,7 1,11 1,19 1,29 1,52 7.484}
{0 CHEMBL1933286,1 1,5 1,7 1,11 1,19 1,20 1,29 1,52 6.796}
{0 CHEMBL1933287,1 1,5 1,7 1,11 1,19 1,52 7.097}
{0 CHEMBL1933288,1 1,5 1,7 1,9 1,11 1,19 1,20 1,52 7.699}
{0 CHEMBL1933289,1 1,5 1,7 1,9 1,11 1,19 1,20 1,52 7.427}
{0 CHEMBL1933290,1 1,5 1,7 1,11 1,19 1,20 1,52 6.538}
{0 CHEMBL1938765,1 1,5 1,7 1,9 1,10 1,11 1,19 1,52 6.051}
{0 CHEMBL1938766,1 1,5 1,7 1,9 1,10 1,11 1,19 1,52 6.62}
{0 CHEMBL1938767,1 1,5 1,7 1,9 1,10 1,11 1,19 1,52 5.959}
{0 CHEMBL1938768,1 1,5 1,7 1,10 1,11 1,19 1,52 5.337}
{0 CHEMBL1938769,1 1,5 1,7 1,10 1,11 1,19 1,52 5.77}
{0 CHEMBL1938770,1 1,5 1,7 1,10 1,11 1,19 1,52 6.387}
{0 CHEMBL1938771,1 1,5 1,7 1,10 1,11 1,19 1,52 5.481}
{0 CHEMBL1938772,1 1,5 1,7 1,10 1,11 1,19 1,52 5}
{0 CHEMBL1938773,1 1,5 1,7 1,10 1,11 1,19 1,52 5.602}
{0 CHEMBL1938774,1 1,5 1,7 1,9 1,10 1,11 1,19 1,52 5.788}
{0 CHEMBL1938775,1 1,5 1,7 1,10 1,11 1,19 1,52 5.81}
{0 CHEMBL1938776,1 1,5 1,7 1,9 1,10 1,11 1,19 1,36 1,52 6.076}
{0 CHEMBL1938777,1 1,5 1,7 1,9 1,10 1,11 1,19 1,36 1,52 6.06}
{0 CHEMBL1938778,1 1,5 1,7 1,10 1,11 1,19 1,20 1,52 6.013}
{0 CHEMBL1938779,1 1,5 1,7 1,11 1,19 1,52 5.041}
{0 CHEMBL1938780,1 1,5 1,7 1,11 1,19 1,52 5}
{0 CHEMBL1938781,1 1,5 1,7 1,10 1,11 1,19 1,52 5.714}
{0 CHEMBL1938782,1 1,5 1,7 1,10 1,11 1,19 1,52 6.745}
{0 CHEMBL1938783,1 1,5 1,7 1,10 1,11 1,19 1,52 6.569}
{0 CHEMBL1938784,1 1,5 1,7 1,10 1,11 1,19 1,52 5.222}
{0 CHEMBL1938785,1 1,5 1,7 1,10 1,11 1,19 1,52 6.398}
{0 CHEMBL1938786,1 1,5 1,7 1,10 1,11 1,19 1,52 6.252}
{0 CHEMBL1938787,1 1,5 1,7 1,10 1,11 1,19 1,52 6.208}
{0 CHEMBL1938788,1 1,5 1,7 1,11 1,19 1,52 5.58}
{0 CHEMBL1938789,1 1,5 1,7 1,11 1,19 1,52 5}
{0 CHEMBL1938790,1 1,5 1,7 1,11 1,19 1,52 5}
{0 CHEMBL1938791,1 1,5 1,7 1,10 1,11 1,14 1,16 1,19 1,52 7.284}
{0 CHEMBL1938792,1 1,5 1,7 1,11 1,19 1,52 6.538}
{0 CHEMBL1938793,1 1,5 1,7 1,11 1,19 1,52 5.658}
{0 CHEMBL1938794,1 1,5 1,7 1,10 1,11 1,19 1,22 1,52 5}
{0 CHEMBL1938795,1 1,5 1,7 1,11 1,19 1,52 6.268}
{0 CHEMBL1938796,1 1,5 1,7 1,11 1,19 1,22 1,52 7.032}
{0 CHEMBL1938797,1 1,5 1,7 1,11 1,19 1,52 6}
{0 CHEMBL1938798,1 1,5 1,7 1,10 1,11 1,19 1,52 6.469}
{0 CHEMBL1938799,1 1,5 1,7 1,9 1,10 1,11 1,19 1,52 6.076}
{0 CHEMBL1938800,1 1,5 1,7 1,11 1,19 1,52 5.947}
{0 CHEMBL1938801,1 1,5 1,7 1,11 1,19 1,52 5}
{0 CHEMBL1938802,1 1,5 1,7 1,11 1,19 1,52 5}
{0 CHEMBL1938803,1 1,5 1,7 1,10 1,11 1,19 1,49 1,52 5}
{0 CHEMBL1949851,11 1,19 1,52 5.3}
{0 CHEMBL1949855,11 1,19 1,52 4.5}
{0 CHEMBL1958401,11 1,19 1,52 5.1}
{0 CHEMBL196363,7 1,10 1,11 1,14 1,19 1,39 1,44 1,45 1,52 6.1}
{0 CHEMBL1964290,11 1,14 1,19 1,44 1,52 5.6}
{0 CHEMBL1964307,10 1,11 1,14 1,19 1,22 1,44 1,52 5.5}
{0 CHEMBL1964382,11 1,19 1,52 6.8}
{0 CHEMBL1964399,1 1,10 1,19 1,52 5.1}
{0 CHEMBL1964413,10 1,11 1,14 1,16 1,19 1,22 1,42 1,47 1,52 5.1}
{0 CHEMBL1964441,1 1,7 1,10 1,11 1,14 1,19 1,44 1,52 6.1}
{0 CHEMBL1964444,10 1,11 1,19 1,52 5.3}
{0 CHEMBL1964644,11 1,17 1,19 1,52 5.1}
{0 CHEMBL1964687,10 1,11 1,14 1,19 1,39 1,42 1,44 1,45 1,52 6.7}
{0 CHEMBL1964692,7 1,10 1,11 1,14 1,19 1,44 1,52 6.9}
{0 CHEMBL1964777,5 1,19 1,52 5.8}
{0 CHEMBL1964804,7 1,14 1,19 1,52 5.2}
{0 CHEMBL1964902,11 1,13 1,19 1,52 5.4}
{0 CHEMBL1964937,1 1,10 1,11 1,19 1,52 5.9}
{0 CHEMBL1964948,10 1,11 1,13 1,19 1,20 1,52 5.4}
{0 CHEMBL1965033,10 1,11 1,19 1,52 5.4}
{0 CHEMBL1965131,10 1,11 1,19 1,52 5.1}
{0 CHEMBL1965169,10 1,11 1,14 1,19 1,52 5.4}
{0 CHEMBL1965170,7 1,10 1,14 1,19 1,44 1,52 5.4}
{0 CHEMBL1965387,10 1,14 1,19 1,22 1,44 1,52 5.4}
{0 CHEMBL1965423,2 1,3 1,4 1,6 1,8 1,14 1,15 1,16 1,19 1,44 1,52 5.1}
{0 CHEMBL1965495,11 1,14 1,19 1,20 1,22 1,52 5.1}
{0 CHEMBL1965507,10 1,11 1,19 1,39 1,44 1,52 5.5}
{0 CHEMBL1965570,7 1,10 1,14 1,19 1,34 1,44 1,52 5.5}
{0 CHEMBL1965589,6 1,8 1,14 1,15 1,18 1,19 1,52 5.1}
{0 CHEMBL1965631,11 1,14 1,16 1,19 1,20 1,22 1,52 5.1}
{0 CHEMBL1965660,11 1,14 1,19 1,44 1,52 7.3}
{0 CHEMBL1965836,7 1,11 1,12 1,14 1,19 1,22 1,52 8.1}
{0 CHEMBL1965845,1 1,11 1,19 1,52 7.2}
{0 CHEMBL1965910,9 1,11 1,14 1,19 1,20 1,44 1,45 1,52 5.1}
{0 CHEMBL1965988,1 1,7 1,10 1,11 1,14 1,19 1,44 1,52 6.2}
{0 CHEMBL1966035,11 1,19 1,30 1,52 5.1}
{0 CHEMBL1966069,1 1,10 1,19 1,22 1,47 1,52 5.6}
{0 CHEMBL1966087,11 1,19 1,43 1,52 5.1}
{0 CHEMBL1966175,8 1,10 1,19 1,20 1,28 1,52 5.4}
{0 CHEMBL1966279,10 1,11 1,19 1,42 1,52 5.2}
{0 CHEMBL1966343,10 1,14 1,16 1,19 1,22 1,44 1,52 5.1}
{0 CHEMBL1966425,1 1,10 1,11 1,14 1,19 1,20 1,52 5.7}
{0 CHEMBL1966514,7 1,10 1,14 1,19 1,34 1,44 1,52 5.3}
{0 CHEMBL1966524,7 1,10 1,11 1,19 1,52 7.6}
{0 CHEMBL1966628,19 1,52 8.3}
{0 CHEMBL1966703,4 1,11 1,19 1,22 1,52 5.1}
{0 CHEMBL1966722,10 1,11 1,19 1,52 6.2}
{0 CHEMBL1966808,7 1,11 1,19 1,34 1,52 5.1}
{0 CHEMBL1966816,10 1,19 1,27 1,52 5.6}
{0 CHEMBL1966842,1 1,2 1,3 1,4 1,6 1,8 1,10 1,11 1,14 1,15 1,16 1,18 1,19 1,20 1,52 5.5}
{0 CHEMBL1967094,5 1,11 1,14 1,19 1,22 1,52 5.3}
{0 CHEMBL1967116,7 1,10 1,11 1,14 1,19 1,44 1,52 5.1}
{0 CHEMBL1967211,7 1,14 1,52 4.1}
{0 CHEMBL1967252,7 1,14 1,19 1,22 1,52 4.9}
{0 CHEMBL1967302,7 1,10 1,11 1,14 1,19 1,24 1,52 8}
{0 CHEMBL1967336,10 1,19 1,27 1,52 5.4}
{0 CHEMBL1967513,10 1,19 1,52 5.4}
{0 CHEMBL1967531,7 1,10 1,14 1,19 1,39 1,44 1,45 1,52 5.5}
{0 CHEMBL1967544,7 1,11 1,14 1,19 1,52 5.7}
{0 CHEMBL1967560,1 1,10 1,11 1,19 1,20 1,25 1,52 5.1}
{0 CHEMBL1967564,19 1,22 1,52 5.1}
{0 CHEMBL1967720,7 1,10 1,14 1,19 1,44 1,52 6.2}
{0 CHEMBL1967887,7 1,14 1,19 1,22 1,52 5.3}
{0 CHEMBL1967992,10 1,11 1,14 1,19 1,20 1,34 1,52 5.4}
{0 CHEMBL1967998,1 1,10 1,19 1,20 1,22 1,47 1,52 6.9}
{0 CHEMBL1968070,10 1,11 1,19 1,52 5.1}
{0 CHEMBL1968127,2 1,3 1,4 1,6 1,8 1,14 1,15 1,16 1,18 1,19 1,20 1,50 1,52 5.1}
{0 CHEMBL1968130,8 1,26 1,35 1,44 1,52 4.3}
{0 CHEMBL1968151,7 1,19 1,34 1,52 5.1}
{0 CHEMBL1968245,10 1,11 1,19 1,43 1,52 5.3}
{0 CHEMBL1968380,1 1,10 1,11 1,19 1,20 1,35 1,52 5.8}
{0 CHEMBL1968406,10 1,11 1,14 1,19 1,39 1,44 1,45 1,52 7.1}
{0 CHEMBL1968590,7 1,11 1,14 1,19 1,44 1,52 5.1}
{0 CHEMBL1968705,7 1,10 1,14 1,19 1,20 1,22 1,47 1,52 5.7}
{0 CHEMBL1968791,9 1,11 1,14 1,19 1,20 1,44 1,45 1,52 5.1}
{0 CHEMBL1968850,10 1,11 1,19 1,52 5.1}
{0 CHEMBL1968868,5 1,10 1,11 1,19 1,20 1,52 5.4}
{0 CHEMBL1968926,11 1,19 1,22 1,34 1,52 5.1}
{0 CHEMBL1969042,10 1,14 1,16 1,22 1,52 7.8}
{0 CHEMBL1969049,1 1,11 1,14 1,19 1,34 1,42 1,52 5.4}
{0 CHEMBL1969102,7 1,10 1,11 1,14 1,19 1,22 1,44 1,52 6.4}
{0 CHEMBL1969126,2 1,3 1,4 1,6 1,8 1,9 1,14 1,15 1,16 1,19 1,52 5.1}
{0 CHEMBL1969151,19 1,20 1,52 7.2}
{0 CHEMBL1969190,10 1,14 1,19 1,44 1,52 5.5}
{0 CHEMBL1969264,10 1,11 1,19 1,52 5.1}
{0 CHEMBL1969301,11 1,19 1,20 1,42 1,52 5.5}
{0 CHEMBL1969372,6 1,8 1,14 1,15 1,16 1,18 1,19 1,35 1,52 5.1}
{0 CHEMBL1969483,1 1,2 1,3 1,4 1,6 1,8 1,10 1,11 1,14 1,15 1,16 1,18 1,19 1,52 5.5}
{0 CHEMBL1969502,9 1,10 1,11 1,19 1,46 1,52 6.8}
{0 CHEMBL1969506,10 1,11 1,19 1,52 5.1}
{0 CHEMBL1969523,1 1,10 1,11 1,19 1,52 5.1}
{0 CHEMBL1969537,3 1,8 1,11 1,19 1,52 6.7}
{0 CHEMBL1969561,10 1,11 1,14 1,16 1,19 1,22 1,26 1,47 1,52 5.7}
{0 CHEMBL1969664,10 1,11 1,19 1,20 1,52 5.4}
{0 CHEMBL1969735,6 1,8 1,14 1,15 1,16 1,18 1,19 1,50 1,52 5.1}
{0 CHEMBL1969755,11 1,14 1,19 1,34 1,52 5.1}
{0 CHEMBL1969843,10 1,14 1,16 1,19 1,22 1,28 1,47 1,52 5.1}
{0 CHEMBL1969879,19 1,28 1,52 5.1}
{0 CHEMBL1969942,10 1,14 1,19 1,22 1,52 5.4}
{0 CHEMBL1970074,10 1,11 1,14 1,19 1,22 1,52 5.6}
{0 CHEMBL1970083,7 1,10 1,11 1,14 1,19 1,34 1,44 1,52 6.8}
{0 CHEMBL1970104,10 1,11 1,19 1,21 1,22 1,49 1,52 6.1}
{0 CHEMBL1970142,7 1,9 1,10 1,11 1,14 1,19 1,44 1,52 5.1}
{0 CHEMBL1970189,11 1,19 1,20 1,22 1,34 1,52 5.1}
{0 CHEMBL1970203,10 1,11 1,19 1,39 1,42 1,44 1,52 5.1}
{0 CHEMBL1970217,1 1,4 1,11 1,14 1,19 1,34 1,52 6.4}
{0 CHEMBL1970290,10 1,11 1,13 1,19 1,20 1,52 5.9}
{0 CHEMBL1970314,10 1,11 1,14 1,19 1,24 1,44 1,52 5.1}
{0 CHEMBL1970317,7 1,10 1,14 1,19 1,44 1,52 5.4}
{0 CHEMBL1970340,14 1,44 1,52 4.7}
{0 CHEMBL1970352,11 1,19 1,52 5.4}
{0 CHEMBL1970369,10 1,14 1,16 1,19 1,22 1,26 1,47 1,52 5.1}
{0 CHEMBL1970522,11 1,19 1,52 5.1}
{0 CHEMBL1970709,10 1,11 1,19 1,22 1,47 1,52 5.1}
{0 CHEMBL1970735,10 1,11 1,19 1,20 1,44 1,52 5.1}
{0 CHEMBL1970806,7 1,11 1,14 1,19 1,52 5.1}
{0 CHEMBL1970879,1 1,5 1,7 1,9 1,10 1,14 1,16 1,19 1,20 1,24 1,44 1,52 5.1}
{0 CHEMBL1970903,7 1,10 1,11 1,14 1,19 1,22 1,52 8.1}
{0 CHEMBL1970913,19 1,52 5.1}
{0 CHEMBL1971017,5 1,7 1,14 1,19 1,52 6.1}
{0 CHEMBL1971021,10 1,11 1,14 1,19 1,42 1,52 5.1}
{0 CHEMBL1971029,1 1,10 1,11 1,19 1,52 6.4}
{0 CHEMBL1971141,10 1,11 1,14 1,19 1,24 1,52 5.1}
{0 CHEMBL1971149,6 1,8 1,14 1,15 1,18 1,19 1,50 1,52 5.1}
{0 CHEMBL1971172,19 1,50 1,52 5.8}
{0 CHEMBL1971186,2 1,3 1,4 1,6 1,8 1,14 1,15 1,16 1,18 1,19 1,52 5.1}
{0 CHEMBL1971223,10 1,11 1,13 1,19 1,52 5.4}
{0 CHEMBL1971227,11 1,14 1,19 1,43 1,52 5.5}
{0 CHEMBL1971245,1 1,8 1,10 1,19 1,20 1,52 5.1}
{0 CHEMBL1971289,11 1,19 1,52 5.4}
{0 CHEMBL1971430,11 1,19 1,42 1,52 5.1}
{0 CHEMBL1971519,14 1,22 1,44 1,52 4.7}
{0 CHEMBL1971534,5 1,19 1,52 4.6}
{0 CHEMBL1971606,1 1,11 1,14 1,19 1,34 1,52 5.4}
{0 CHEMBL1971649,10 1,11 1,14 1,19 1,25 1,44 1,52 5.1}
{0 CHEMBL1971694,10 1,19 1,52 5.1}
{0 CHEMBL1971801,10 1,11 1,19 1,52 5.1}
{0 CHEMBL1971943,10 1,11 1,19 1,37 1,44 1,52 5.9}
{0 CHEMBL1971947,7 1,10 1,11 1,14 1,19 1,44 1,52 6}
{0 CHEMBL1972119,10 1,11 1,19 1,52 5.1}
{0 CHEMBL1972125,3 1,7 1,10 1,11 1,14 1,19 1,24 1,44 1,52 5.3}
{0 CHEMBL1972142,7 1,11 1,14 1,19 1,24 1,52 5.1}
{0 CHEMBL1972158,11 1,14 1,16 1,19 1,22 1,44 1,52 5.5}
{0 CHEMBL1972183,11 1,19 1,20 1,52 5.1}
{0 CHEMBL1972220,7 1,10 1,14 1,19 1,41 1,44 1,52 6.1}
{0 CHEMBL1972221,10 1,14 1,19 1,22 1,52 5.1}
{0 CHEMBL1972250,5 1,7 1,11 1,14 1,19 1,20 1,22 1,42 1,52 6.3}
{0 CHEMBL1972258,11 1,19 1,43 1,52 5.1}
{0 CHEMBL1972276,10 1,11 1,19 1,20 1,49 1,52 5.4}
{0 CHEMBL1972346,11 1,19 1,52 5.8}
{0 CHEMBL1972355,10 1,11 1,19 1,49 1,52 6.1}
{0 CHEMBL1972362,5 1,7 1,11 1,14 1,19 1,52 5.2}
{0 CHEMBL1972462,11 1,19 1,20 1,44 1,52 5.4}
{0 CHEMBL1972489,10 1,11 1,19 1,22 1,52 5.1}
{0 CHEMBL1972568,11 1,19 1,43 1,52 5.1}
{0 CHEMBL1972576,10 1,11 1,19 1,39 1,44 1,52 6.1}
{0 CHEMBL1972584,1 1,5 1,7 1,9 1,10 1,14 1,16 1,19 1,20 1,24 1,44 1,52 5.1}
{0 CHEMBL1972659,11 1,15 1,19 1,52 5.1}
{0 CHEMBL1972820,11 1,19 1,33 1,52 5.1}
{0 CHEMBL1972840,7 1,10 1,11 1,19 1,52 6.7}
{0 CHEMBL1972849,2 1,3 1,4 1,6 1,8 1,14 1,15 1,18 1,19 1,52 5.1}
{0 CHEMBL1972934,39 1,44 1,52 4.5}
{0 CHEMBL1972937,11 1,19 1,52 5.1}
{0 CHEMBL1973013,19 1,52 5.9}
{0 CHEMBL1973016,11 1,19 1,42 1,52 5.4}
{0 CHEMBL1973098,11 1,19 1,52 5.3}
{0 CHEMBL1973138,10 1,11 1,16 1,19 1,21 1,52 5.4}
{0 CHEMBL1973142,10 1,19 1,52 5.1}
{0 CHEMBL1973145,7 1,10 1,11 1,14 1,19 1,39 1,44 1,45 1,52 5.1}
{0 CHEMBL1973211,7 1,10 1,11 1,14 1,19 1,20 1,44 1,52 6.6}
{0 CHEMBL1973348,3 1,7 1,10 1,11 1,14 1,19 1,24 1,44 1,52 5.1}
{0 CHEMBL1973359,8 1,11 1,19 1,52 6.2}
{0 CHEMBL1973395,14 1,19 1,52 5.1}
{0 CHEMBL1973483,10 1,11 1,19 1,52 5.1}
{0 CHEMBL1973516,1 1,10 1,11 1,19 1,20 1,22 1,47 1,52 6.6}
{0 CHEMBL1973540,9 1,10 1,11 1,19 1,52 7.4}
{0 CHEMBL1973711,11 1,19 1,20 1,52 5.1}
{0 CHEMBL1973720,19 1,52 7.9}
{0 CHEMBL1973793,10 1,11 1,14 1,19 1,52 5.4}
{0 CHEMBL1973808,10 1,11 1,19 1,22 1,47 1,52 5.1}
{0 CHEMBL1973860,7 1,14 1,19 1,34 1,52 5.1}
{0 CHEMBL1973868,14 1,34 1,52 5.4}
{0 CHEMBL1973893,10 1,14 1,19 1,22 1,52 5.1}
{0 CHEMBL1973937,10 1,11 1,14 1,19 1,22 1,28 1,44 1,52 5.5}
{0 CHEMBL1973961,11 1,19 1,20 1,22 1,52 5.5}
{0 CHEMBL1974157,11 1,19 1,20 1,52 5.1}
{0 CHEMBL1974254,7 1,10 1,14 1,19 1,44 1,52 5.5}
{0 CHEMBL1974288,1 1,10 1,11 1,14 1,19 1,34 1,52 5.8}
{0 CHEMBL1974310,5 1,7 1,14 1,19 1,52 5.6}
{0 CHEMBL1974328,10 1,11 1,19 1,52 6.4}
{0 CHEMBL1974416,10 1,11 1,14 1,19 1,52 5.2}
{0 CHEMBL1974457,5 1,7 1,14 1,19 1,52 5.1}
{0 CHEMBL1974480,7 1,10 1,19 1,28 1,52 5.6}
{0 CHEMBL1974617,10 1,14 1,16 1,19 1,22 1,47 1,52 4.6}
{0 CHEMBL1974664,9 1,10 1,11 1,19 1,42 1,52 6.4}
{0 CHEMBL1974702,19 1,27 1,52 5.1}
{0 CHEMBL1974803,10 1,11 1,19 1,52 5.1}
{0 CHEMBL1974870,7 1,11 1,14 1,19 1,22 1,52 7.8}
{0 CHEMBL1974875,10 1,11 1,19 1,31 1,33 1,52 4.1}
{0 CHEMBL1974935,10 1,11 1,19 1,43 1,52 6.1}
{0 CHEMBL1974998,10 1,11 1,13 1,19 1,20 1,52 5.4}
{0 CHEMBL1975121,1 1,11 1,14 1,19 1,34 1,52 5.25}
{0 CHEMBL1975128,3 1,11 1,14 1,16 1,19 1,22 1,44 1,52 5.6}
{0 CHEMBL1975138,10 1,11 1,19 1,52 5.6}
{0 CHEMBL1975208,11 1,19 1,33 1,39 1,52 5.1}
{0 CHEMBL1975212,7 1,14 1,39 1,44 1,45 1,52 4.4}
{0 CHEMBL1975233,5 1,10 1,11 1,19 1,20 1,52 5.7}
{0 CHEMBL1975256,9 1,19 1,44 1,52 5.1}
{0 CHEMBL1975357,6 1,7 1,9 1,19 1,52 5.1}
{0 CHEMBL1975418,10 1,11 1,14 1,16 1,19 1,22 1,47 1,52 6.6}
{0 CHEMBL1975490,1 1,10 1,11 1,14 1,19 1,52 6.5}
{0 CHEMBL1975500,10 1,11 1,14 1,19 1,31 1,52 5.1}
{0 CHEMBL1975534,19 1,44 1,52 5.1}
{0 CHEMBL1975647,10 1,19 1,27 1,52 5.1}
{0 CHEMBL1975787,5 1,7 1,14 1,19 1,52 5.1}
{0 CHEMBL1975900,10 1,11 1,19 1,52 6.4}
{0 CHEMBL1975903,1 1,10 1,11 1,14 1,19 1,52 5.4}
{0 CHEMBL1975921,10 1,19 1,52 4.5}
{0 CHEMBL1975923,10 1,11 1,19 1,44 1,52 5.8}
{0 CHEMBL1975927,1 1,10 1,19 1,38 1,52 6.1}
{0 CHEMBL1976040,1 1,7 1,10 1,11 1,19 1,20 1,25 1,52 5.5}
{0 CHEMBL1976090,39 1,44 1,52 5.6}
{0 CHEMBL1976093,6 1,8 1,14 1,15 1,16 1,18 1,19 1,20 1,35 1,50 1,52 5.1}
{0 CHEMBL1976134,7 1,14 1,22 1,52 5.8}
{0 CHEMBL1976196,10 1,11 1,19 1,52 5.4}
{0 CHEMBL1976220,7 1,10 1,14 1,19 1,44 1,52 6}
{0 CHEMBL1976240,1 1,10 1,11 1,14 1,19 1,34 1,52 6.5}
{0 CHEMBL1976328,10 1,11 1,14 1,19 1,42 1,44 1,52 5.8}
{0 CHEMBL1976376,9 1,11 1,14 1,19 1,44 1,45 1,52 5.4}
{0 CHEMBL1976420,10 1,11 1,14 1,19 1,52 5.3}
{0 CHEMBL1976455,10 1,11 1,19 1,52 5.6}
{0 CHEMBL1976732,2 1,3 1,4 1,6 1,8 1,14 1,15 1,18 1,19 1,52 5.1}
{0 CHEMBL1977041,10 1,11 1,14 1,19 1,44 1,52 5.8}
{0 CHEMBL1977134,7 1,10 1,11 1,14 1,19 1,44 1,52 5.4}
{0 CHEMBL1977135,11 1,14 1,19 1,34 1,52 5.1}
{0 CHEMBL1977138,11 1,19 1,20 1,52 5.9}
{0 CHEMBL1977148,7 1,10 1,14 1,19 1,41 1,44 1,52 5.1}
{0 CHEMBL1977223,11 1,14 1,16 1,19 1,22 1,52 5.1}
{0 CHEMBL1977346,10 1,11 1,19 1,52 5.1}
{0 CHEMBL1977374,6 1,14 1,19 1,52 5.1}
{0 CHEMBL1977604,11 1,19 1,26 1,52 5.1}
{0 CHEMBL1977634,11 1,13 1,19 1,52 5.4}
{0 CHEMBL1977681,5 1,14 1,19 1,22 1,52 5.4}
{0 CHEMBL1977749,11 1,19 1,51 1,52 5.4}
{0 CHEMBL1977814,3 1,11 1,19 1,44 1,52 5.3}
{0 CHEMBL1977931,11 1,14 1,19 1,52 4.1}
{0 CHEMBL1978014,11 1,14 1,16 1,19 1,20 1,44 1,52 5.1}
{0 CHEMBL1978099,1 1,10 1,11 1,19 1,52 5.9}
{0 CHEMBL1978166,7 1,10 1,11 1,14 1,19 1,44 1,52 6.5}
{0 CHEMBL1978167,7 1,10 1,19 1,52 5.4}
{0 CHEMBL1978195,5 1,7 1,14 1,19 1,52 5.5}
{0 CHEMBL1978200,6 1,8 1,14 1,15 1,18 1,19 1,52 5.1}
{0 CHEMBL1978267,1 1,2 1,3 1,4 1,6 1,8 1,10 1,11 1,14 1,15 1,16 1,18 1,19 1,52 5.5}
{0 CHEMBL1978271,10 1,11 1,13 1,19 1,52 5.4}
{0 CHEMBL1978371,11 1,19 1,20 1,52 6}
{0 CHEMBL1978448,10 1,11 1,19 1,20 1,52 5.7}
{0 CHEMBL1978562,7 1,10 1,11 1,19 1,20 1,52 6}
{0 CHEMBL1978567,1 1,7 1,11 1,19 1,34 1,52 5.4}
{0 CHEMBL1978656,10 1,11 1,14 1,16 1,19 1,52 5.1}
{0 CHEMBL1979057,10 1,11 1,14 1,19 1,49 1,52 5.1}
{0 CHEMBL1979093,10 1,11 1,14 1,19 1,44 1,52 6.4}
{0 CHEMBL1979176,10 1,11 1,19 1,52 5.1}
{0 CHEMBL1979252,10 1,11 1,19 1,42 1,52 6.3}
{0 CHEMBL1979318,11 1,19 1,20 1,22 1,34 1,52 5.1}
{0 CHEMBL1979357,7 1,11 1,19 1,42 1,43 1,52 5.3}
{0 CHEMBL1979516,7 1,10 1,11 1,14 1,19 1,44 1,52 5.3}
{0 CHEMBL1979554,10 1,11 1,19 1,22 1,47 1,52 7.4}
{0 CHEMBL1979577,7 1,10 1,11 1,14 1,19 1,44 1,52 6.6}
{0 CHEMBL1979690,1 1,10 1,19 1,20 1,22 1,47 1,52 6.9}
{0 CHEMBL1979718,7 1,11 1,19 1,22 1,52 5.1}
{0 CHEMBL1979773,10 1,11 1,13 1,19 1,52 5.4}
{0 CHEMBL1979855,10 1,11 1,13 1,19 1,20 1,52 5.1}
{0 CHEMBL1979883,7 1,10 1,11 1,14 1,19 1,20 1,44 1,52 6.4}
{0 CHEMBL1979970,14 1,19 1,22 1,52 5.1}
{0 CHEMBL1980142,10 1,11 1,19 1,52 5.1}
{0 CHEMBL1980144,10 1,11 1,19 1,39 1,44 1,52 5.5}
{0 CHEMBL1980163,10 1,11 1,19 1,52 5.1}
{0 CHEMBL1980167,10 1,11 1,14 1,16 1,19 1,44 1,52 5.6}
{0 CHEMBL1980246,1 1,7 1,10 1,11 1,14 1,19 1,52 5.4}
{0 CHEMBL1980253,19 1,52 5.6}
{0 CHEMBL1980297,7 1,10 1,14 1,19 1,41 1,44 1,52 6.2}
{0 CHEMBL1980329,1 1,10 1,11 1,14 1,19 1,52 7.5}
{0 CHEMBL1980391,10 1,11 1,19 1,22 1,26 1,52 6.8}
{0 CHEMBL1980407,1 1,7 1,10 1,11 1,14 1,19 1,24 1,52 8.3}
{0 CHEMBL1980435,11 1,14 1,16 1,19 1,22 1,52 5.6}
{0 CHEMBL1980489,10 1,11 1,19 1,52 6}
{0 CHEMBL1980540,10 1,19 1,27 1,52 5.1}
{0 CHEMBL1980671,10 1,11 1,19 1,44 1,52 4.6}
{0 CHEMBL1980704,8 1,11 1,19 1,52 5.7}
{0 CHEMBL1980715,7 1,10 1,19 1,52 5.4}
{0 CHEMBL1980763,1 1,10 1,19 1,52 5.8}
{0 CHEMBL1980802,5 1,10 1,19 1,20 1,52 6.3}
{0 CHEMBL1980896,10 1,11 1,14 1,19 1,39 1,44 1,45 1,52 5.1}
{0 CHEMBL1980995,7 1,11 1,19 1,52 8.801}
{0 CHEMBL1981045,10 1,11 1,14 1,19 1,52 5.1}
{0 CHEMBL1981047,11 1,19 1,20 1,21 1,22 1,47 1,52 5.3}
{0 CHEMBL1981079,11 1,14 1,19 1,44 1,52 6.5}
{0 CHEMBL1981133,7 1,10 1,11 1,14 1,19 1,52 6.8}
{0 CHEMBL1981215,10 1,19 1,52 5.4}
{0 CHEMBL1981410,10 1,11 1,19 1,52 5.1}
{0 CHEMBL1981492,8 1,19 1,31 1,44 1,52 4.2}
{0 CHEMBL1981720,10 1,19 1,52 5.1}
{0 CHEMBL1981725,1 1,6 1,8 1,10 1,11 1,14 1,16 1,18 1,19 1,20 1,24 1,52 5.2}
{0 CHEMBL1981744,10 1,19 1,29 1,52 5.4}
{0 CHEMBL1981782,10 1,11 1,19 1,22 1,47 1,52 6.2}
{0 CHEMBL1981792,10 1,19 1,29 1,52 5.5}
{0 CHEMBL1982122,1 1,11 1,14 1,19 1,34 1,52 6}
{0 CHEMBL1982135,10 1,11 1,14 1,19 1,39 1,44 1,45 1,52 5.1}
{0 CHEMBL1982167,10 1,11 1,14 1,16 1,19 1,52 5.1}
{0 CHEMBL1982361,10 1,11 1,19 1,52 6.3}
{0 CHEMBL1982383,6 1,8 1,14 1,15 1,16 1,18 1,19 1,50 1,52 5.1}
{0 CHEMBL1982413,11 1,19 1,20 1,52 5.4}
{0 CHEMBL1982465,7 1,10 1,11 1,14 1,19 1,20 1,44 1,52 5.1}
{0 CHEMBL1982466,7 1,10 1,11 1,14 1,19 1,44 1,52 5.1}
{0 CHEMBL1982476,7 1,10 1,11 1,14 1,19 1,44 1,52 6.3}
{0 CHEMBL1982506,11 1,19 1,52 5.1}
{0 CHEMBL1982541,10 1,11 1,19 1,20 1,44 1,52 5.3}
{0 CHEMBL1982563,6 1,8 1,14 1,15 1,16 1,18 1,19 1,50 1,52 5.1}
{0 CHEMBL1982610,14 1,16 1,19 1,52 5.1}
{0 CHEMBL1982660,10 1,19 1,52 5.4}
{0 CHEMBL1982700,11 1,16 1,19 1,52 5.4}
{0 CHEMBL1982711,11 1,14 1,19 1,52 5.8}
{0 CHEMBL1982753,10 1,11 1,19 1,52 5.4}
{0 CHEMBL1982866,14 1,16 1,19 1,35 1,52 5.1}
{0 CHEMBL1982874,2 1,3 1,4 1,6 1,8 1,14 1,15 1,16 1,19 1,44 1,52 5.1}
{0 CHEMBL1982880,7 1,10 1,14 1,19 1,52 5.1}
{0 CHEMBL1982924,10 1,11 1,14 1,19 1,52 5.2}
{0 CHEMBL1982957,7 1,11 1,14 1,19 1,24 1,52 6}
{0 CHEMBL1982980,10 1,11 1,19 1,52 5.1}
{0 CHEMBL1982992,10 1,39 1,52 5.1}
{0 CHEMBL1983006,5 1,10 1,11 1,19 1,20 1,33 1,52 5.2}
{0 CHEMBL1983025,7 1,10 1,11 1,14 1,19 1,44 1,52 6.3}
{0 CHEMBL1983070,11 1,14 1,19 1,22 1,52 5.4}
{0 CHEMBL1983111,1 1,10 1,11 1,19 1,52 8}
{0 CHEMBL1983195,10 1,19 1,52 5.2}
{0 CHEMBL1983268,10 1,11 1,19 1,20 1,22 1,52 5.9}
{0 CHEMBL1983309,11 1,19 1,29 1,52 5.1}
{0 CHEMBL1983348,10 1,11 1,19 1,20 1,22 1,49 1,52 7}
{0 CHEMBL1983393,10 1,14 1,19 1,22 1,52 5.4}
{0 CHEMBL1983449,11 1,19 1,30 1,42 1,52 5.5}
{0 CHEMBL1983534,11 1,14 1,19 1,34 1,38 1,52 5.1}
{0 CHEMBL1983573,8 1,11 1,14 1,16 1,19 1,44 1,52 4}
{0 CHEMBL1983575,9 1,10 1,11 1,19 1,42 1,52 6.4}
{0 CHEMBL1983630,7 1,11 1,14 1,19 1,24 1,52 4.2}
{0 CHEMBL1983640,7 1,10 1,11 1,14 1,19 1,20 1,44 1,52 6.3}
{0 CHEMBL1983715,1 1,10 1,16 1,19 1,52 6.1}
{0 CHEMBL1983923,11 1,19 1,20 1,22 1,34 1,52 5.4}
{0 CHEMBL1983932,10 1,19 1,52 5.5}
{0 CHEMBL1983945,10 1,11 1,19 1,43 1,52 5.8}
{0 CHEMBL1983963,7 1,10 1,11 1,14 1,19 1,39 1,44 1,45 1,52 5.9}
{0 CHEMBL1983980,11 1,14 1,16 1,19 1,52 5.6}
{0 CHEMBL1984038,10 1,11 1,14 1,19 1,38 1,52 5.3}
{0 CHEMBL1984039,10 1,11 1,14 1,19 1,52 5.1}
{0 CHEMBL1984044,10 1,11 1,14 1,19 1,20 1,49 1,52 5.1}
{0 CHEMBL1984162,1 1,9 1,10 1,11 1,14 1,16 1,19 1,42 1,44 1,52 6.8}
{0 CHEMBL1984191,14 1,22 1,52 5.1}
{0 CHEMBL1984206,10 1,11 1,19 1,20 1,44 1,52 5.1}
{0 CHEMBL1984236,7 1,10 1,19 1,22 1,52 5.4}
{0 CHEMBL1984274,11 1,14 1,16 1,19 1,20 1,52 6}
{0 CHEMBL1984296,10 1,11 1,19 1,52 5.5}
{0 CHEMBL1984363,10 1,11 1,14 1,19 1,22 1,44 1,52 5.2}
{0 CHEMBL1984367,5 1,11 1,14 1,19 1,22 1,52 5.1}
{0 CHEMBL1984432,10 1,11 1,14 1,16 1,19 1,22 1,42 1,47 1,52 5.1}
{0 CHEMBL1984500,11 1,19 1,52 4.1}
{0 CHEMBL1984541,19 1,30 1,52 5.1}
{0 CHEMBL1984586,7 1,10 1,11 1,14 1,19 1,39 1,44 1,45 1,52 5.1}
{0 CHEMBL1984633,1 1,7 1,11 1,19 1,34 1,52 5.6}
{0 CHEMBL1984686,52 5.4}
{0 CHEMBL1984700,6 1,8 1,14 1,15 1,18 1,19 1,52 5.1}
{0 CHEMBL1984711,1 1,10 1,19 1,38 1,52 5.1}
{0 CHEMBL1984760,1 1,10 1,11 1,19 1,52 5.9}
{0 CHEMBL1984788,10 1,11 1,14 1,19 1,49 1,52 5.1}
{0 CHEMBL1984842,6 1,8 1,14 1,15 1,16 1,18 1,19 1,50 1,52 5.3}
{0 CHEMBL1984847,11 1,14 1,16 1,19 1,52 5.4}
{0 CHEMBL1985074,11 1,19 1,52 5.1}
{0 CHEMBL1985092,1 1,10 1,14 1,22 1,52 6.5}
{0 CHEMBL1985095,10 1,19 1,22 1,44 1,47 1,52 5.3}
{0 CHEMBL1985206,11 1,14 1,19 1,22 1,52 5.4}
{0 CHEMBL1985311,10 1,11 1,14 1,19 1,22 1,44 1,52 5.1}
{0 CHEMBL1985367,7 1,11 1,14 1,19 1,52 5.4}
{0 CHEMBL1985406,14 1,19 1,22 1,52 5.1}
{0 CHEMBL1985566,10 1,11 1,14 1,19 1,20 1,52 5.1}
{0 CHEMBL1985580,10 1,11 1,19 1,43 1,52 5.2}
{0 CHEMBL1985681,10 1,11 1,19 1,20 1,42 1,52 6.8}
{0 CHEMBL1985723,19 1,50 1,52 6.1}
{0 CHEMBL1986139,10 1,39 1,52 5.1}
{0 CHEMBL1986143,1 1,11 1,14 1,19 1,34 1,52 5.4}
{0 CHEMBL1986177,10 1,19 1,52 5.4}
{0 CHEMBL1986186,19 1,30 1,52 5.3}
{0 CHEMBL1986263,1 1,10 1,19 1,52 5.4}
{0 CHEMBL1986265,11 1,19 1,20 1,42 1,44 1,52 5.4}
{0 CHEMBL1986328,10 1,19 1,52 5.2}
{0 CHEMBL1986499,11 1,14 1,16 1,19 1,22 1,44 1,52 5.1}
{0 CHEMBL1986503,3 1,29 1,52 5.4}
{0 CHEMBL1986530,11 1,19 1,42 1,52 5.1}
{0 CHEMBL1986590,1 1,10 1,11 1,19 1,52 5.8}
{0 CHEMBL1986597,10 1,11 1,14 1,19 1,20 1,36 1,42 1,49 1,52 5.2}
{0 CHEMBL1986603,14 1,16 1,19 1,52 5.1}
{0 CHEMBL1986756,10 1,11 1,19 1,52 5.4}
{0 CHEMBL1986781,2 1,3 1,4 1,6 1,8 1,14 1,15 1,16 1,18 1,19 1,52 5.1}
{0 CHEMBL1986851,7 1,10 1,11 1,14 1,19 1,41 1,44 1,52 6.1}
{0 CHEMBL1986869,10 1,16 1,19 1,34 1,39 1,44 1,52 5.1}
{0 CHEMBL1986899,10 1,11 1,14 1,16 1,19 1,52 5.4}
{0 CHEMBL1986943,19 1,52 7}
{0 CHEMBL1986970,10 1,11 1,14 1,16 1,19 1,22 1,47 1,52 5.7}
{0 CHEMBL1987007,5 1,14 1,19 1,20 1,22 1,52 5.6}
{0 CHEMBL1987009,5 1,11 1,14 1,19 1,22 1,52 5.4}
{0 CHEMBL1987034,1 1,10 1,11 1,19 1,20 1,52 7.6}
{0 CHEMBL1987054,1 1,9 1,10 1,11 1,14 1,16 1,19 1,27 1,44 1,52 6.3}
{0 CHEMBL1987359,10 1,11 1,19 1,31 1,48 1,52 5.1}
{0 CHEMBL1987430,10 1,11 1,19 1,52 5.4}
{0 CHEMBL1987533,10 1,11 1,19 1,22 1,52 5.1}
{0 CHEMBL1987535,11 1,19 1,52 5.4}
{0 CHEMBL1987648,6 1,8 1,14 1,15 1,16 1,18 1,19 1,50 1,52 5.1}
{0 CHEMBL1987679,7 1,10 1,11 1,14 1,19 1,52 7.9}
{0 CHEMBL1987756,11 1,19 1,31 1,52 6.3}
{0 CHEMBL1987793,7 1,11 1,14 1,19 1,52 5.1}
{0 CHEMBL1987910,7 1,10 1,11 1,14 1,19 1,44 1,52 5.1}
{0 CHEMBL1987982,10 1,11 1,12 1,14 1,19 1,52 5.1}
{0 CHEMBL1987998,11 1,19 1,20 1,44 1,52 5.4}
{0 CHEMBL1988075,7 1,10 1,14 1,19 1,44 1,52 5.1}
{0 CHEMBL1988076,1 1,2 1,3 1,4 1,6 1,8 1,10 1,11 1,14 1,15 1,16 1,18 1,19 1,52 5.5}
{0 CHEMBL1988141,10 1,11 1,19 1,52 6.3}
{0 CHEMBL1988153,7 1,11 1,19 1,52 5.1}
{0 CHEMBL1988163,1 1,10 1,11 1,19 1,52 6.7}
{0 CHEMBL1988173,10 1,11 1,19 1,52 6.4}
{0 CHEMBL1988300,4 1,7 1,10 1,11 1,14 1,19 1,44 1,49 1,52 5.1}
{0 CHEMBL1988370,9 1,11 1,14 1,19 1,20 1,44 1,45 1,52 5.1}
{0 CHEMBL1988387,7 1,10 1,14 1,19 1,44 1,52 6.1}
{0 CHEMBL1988437,11 1,19 1,22 1,45 1,52 6.1}
{0 CHEMBL1988537,11 1,19 1,52 5.6}
{0 CHEMBL1988581,19 1,20 1,43 1,52 6.9}
{0 CHEMBL1988594,10 1,11 1,19 1,39 1,44 1,52 5.1}
{0 CHEMBL1988608,10 1,11 1,19 1,22 1,30 1,47 1,52 6.8}
{0 CHEMBL1988692,5 1,10 1,12 1,19 1,52 5.4}
{0 CHEMBL1988717,7 1,10 1,11 1,14 1,19 1,44 1,52 5.1}
{0 CHEMBL1988805,11 1,19 1,20 1,44 1,52 5.4}
{0 CHEMBL1988838,1 1,10 1,11 1,19 1,52 6.4}
{0 CHEMBL1988995,2 1,3 1,4 1,6 1,8 1,14 1,15 1,18 1,19 1,52 5.1}
{0 CHEMBL1989029,11 1,19 1,22 1,34 1,51 1,52 5.1}
{0 CHEMBL1989043,1 1,8 1,10 1,11 1,19 1,20 1,44 1,52 5.4}
{0 CHEMBL1989265,11 1,19 1,52 5.1}
{0 CHEMBL1989267,1 1,5 1,7 1,10 1,11 1,14 1,19 1,20 1,44 1,52 5.7}
{0 CHEMBL1989471,11 1,19 1,39 1,44 1,52 5.4}
{0 CHEMBL1989474,14 1,16 1,19 1,35 1,52 5.1}
{0 CHEMBL1989518,11 1,19 1,43 1,52 5.1}
{0 CHEMBL1989646,10 1,11 1,14 1,16 1,19 1,22 1,44 1,52 5.4}
{0 CHEMBL1989708,7 1,10 1,11 1,14 1,19 1,44 1,52 6.7}
{0 CHEMBL1989805,19 1,20 1,45 1,52 5.1}
{0 CHEMBL1989834,14 1,22 1,51 1,52 4.5}
{0 CHEMBL1989856,8 1,9 1,11 1,19 1,20 1,52 5.3}
{0 CHEMBL1990212,7 1,10 1,14 1,19 1,52 5.1}
{0 CHEMBL1990223,11 1,19 1,20 1,44 1,52 5.4}
{0 CHEMBL1990254,1 1,10 1,11 1,14 1,19 1,34 1,52 6.2}
{0 CHEMBL1990288,1 1,2 1,3 1,4 1,6 1,8 1,11 1,14 1,15 1,16 1,18 1,19 1,52 5.1}
{0 CHEMBL1990346,14 1,22 1,44 1,52 5.1}
{0 CHEMBL1990415,11 1,19 1,22 1,52 5.1}
{0 CHEMBL1990482,10 1,11 1,19 1,34 1,49 1,52 5.2}
{0 CHEMBL1990496,11 1,19 1,52 5.3}
{0 CHEMBL1990541,11 1,19 1,52 5.2}
{0 CHEMBL1990583,10 1,11 1,19 1,44 1,52 5.2}
{0 CHEMBL1990590,11 1,14 1,16 1,19 1,22 1,49 1,52 5.4}
{0 CHEMBL1990635,10 1,12 1,14 1,19 1,20 1,52 5.5}
{0 CHEMBL1990821,10 1,11 1,14 1,19 1,42 1,52 5.1}
{0 CHEMBL1990884,1 1,10 1,11 1,14 1,19 1,42 1,44 1,52 5.1}
{0 CHEMBL1990885,1 1,10 1,11 1,19 1,20 1,52 5.9}
{0 CHEMBL1990904,6 1,8 1,14 1,15 1,16 1,18 1,19 1,35 1,52 5.1}
{0 CHEMBL1990912,7 1,14 1,19 1,52 5.1}
{0 CHEMBL1991063,7 1,11 1,14 1,19 1,22 1,52 7.8}
{0 CHEMBL1991078,11 1,14 1,16 1,19 1,22 1,52 5.9}
{0 CHEMBL1991138,8 1,11 1,14 1,15 1,16 1,19 1,20 1,44 1,52 5.1}
{0 CHEMBL1991143,3 1,11 1,19 1,52 5.1}
{0 CHEMBL1991180,11 1,19 1,44 1,52 7}
{0 CHEMBL1991188,1 1,11 1,14 1,19 1,34 1,52 6}
{0 CHEMBL1991285,5 1,10 1,11 1,19 1,20 1,52 5.9}
{0 CHEMBL1991356,10 1,14 1,19 1,52 5.1}
{0 CHEMBL1991395,6 1,8 1,14 1,15 1,16 1,18 1,19 1,35 1,50 1,52 5.1}
{0 CHEMBL1991410,11 1,19 1,52 5.4}
{0 CHEMBL1991429,1 1,2 1,3 1,4 1,6 1,8 1,10 1,11 1,14 1,15 1,16 1,18 1,19 1,41 1,52 5.1}
{0 CHEMBL1991434,11 1,19 1,25 1,44 1,52 5.1}
{0 CHEMBL1991577,19 1,30 1,52 5.1}
{0 CHEMBL1991640,10 1,11 1,19 1,26 1,52 5.1}
{0 CHEMBL1991674,7 1,19 1,32 1,52 7.1}
{0 CHEMBL1991678,6 1,8 1,14 1,15 1,18 1,19 1,50 1,52 5.4}
{0 CHEMBL1991725,7 1,10 1,11 1,14 1,19 1,20 1,52 5.3}
{0 CHEMBL1991728,10 1,11 1,19 1,25 1,42 1,52 6.5}
{0 CHEMBL1991734,10 1,11 1,19 1,44 1,52 6}
{0 CHEMBL1991782,11 1,14 1,19 1,52 4.1}
{0 CHEMBL1991800,6 1,8 1,14 1,15 1,16 1,18 1,19 1,50 1,52 5.1}
{0 CHEMBL1991846,11 1,19 1,43 1,52 5.1}
{0 CHEMBL1992042,1 1,10 1,11 1,19 1,37 1,52 5.4}
{0 CHEMBL1992073,8 1,10 1,19 1,52 5.5}
{0 CHEMBL1992125,1 1,10 1,11 1,19 1,38 1,42 1,52 5.6}
{0 CHEMBL1992242,10 1,11 1,14 1,19 1,42 1,52 5.1}
{0 CHEMBL1992306,10 1,11 1,19 1,52 5.1}
{0 CHEMBL1992323,19 1,52 5.1}
{0 CHEMBL1992342,10 1,14 1,19 1,22 1,44 1,52 5.1}
{0 CHEMBL1992371,10 1,19 1,52 5.4}
{0 CHEMBL1992536,10 1,11 1,19 1,22 1,30 1,47 1,52 5.1}
{0 CHEMBL1992555,9 1,10 1,11 1,19 1,49 1,52 5.1}
{0 CHEMBL1992581,7 1,10 1,11 1,14 1,19 1,52 5.7}
{0 CHEMBL1992607,11 1,19 1,31 1,44 1,52 4.1}
{0 CHEMBL1992634,14 1,52 5.1}
{0 CHEMBL1992644,14 1,22 1,34 1,52 5.4}
{0 CHEMBL1992645,10 1,11 1,14 1,19 1,52 5.1}
{0 CHEMBL1992673,7 1,10 1,19 1,52 4.1}
{0 CHEMBL1992732,9 1,11 1,19 1,44 1,52 5.1}
{0 CHEMBL1992740,14 1,19 1,20 1,22 1,52 5.1}
{0 CHEMBL1992796,1 1,10 1,11 1,16 1,19 1,52 5.1}
{0 CHEMBL1992922,14 1,19 1,52 5.1}
{0 CHEMBL1992937,10 1,11 1,19 1,49 1,52 5.4}
{0 CHEMBL1993166,10 1,11 1,19 1,20 1,25 1,42 1,52 6.1}
{0 CHEMBL1993243,7 1,11 1,14 1,19 1,44 1,52 5.1}
{0 CHEMBL1993335,7 1,10 1,19 1,52 6.3}
{0 CHEMBL1993374,19 1,52 5.5}
{0 CHEMBL1993413,11 1,19 1,52 5.4}
{0 CHEMBL1993424,1 1,10 1,11 1,19 1,52 5.9}
{0 CHEMBL1993548,11 1,19 1,52 5.9}
{0 CHEMBL1993584,10 1,11 1,19 1,43 1,52 5.1}
{0 CHEMBL1993661,1 1,10 1,11 1,19 1,38 1,52 8}
{0 CHEMBL1993722,10 1,11 1,14 1,19 1,22 1,33 1,44 1,52 5.1}
{0 CHEMBL1993781,11 1,19 1,43 1,52 5.1}
{0 CHEMBL1993877,9 1,11 1,19 1,44 1,52 5.8}
{0 CHEMBL1993904,1 1,5 1,7 1,10 1,14 1,19 1,44 1,52 6.2}
{0 CHEMBL1993941,7 1,10 1,14 1,19 1,44 1,52 5.9}
{0 CHEMBL1994040,6 1,8 1,14 1,15 1,18 1,19 1,52 5.1}
{0 CHEMBL1994074,10 1,14 1,16 1,22 1,52 5.1}
{0 CHEMBL1994159,11 1,14 1,16 1,19 1,24 1,52 4.2}
{0 CHEMBL1994241,4 1,10 1,11 1,19 1,20 1,49 1,52 6.1}
{0 CHEMBL1994308,9 1,10 1,11 1,19 1,46 1,52 5.4}
{0 CHEMBL1994318,10 1,11 1,13 1,19 1,52 5.4}
{0 CHEMBL1994321,1 1,7 1,10 1,11 1,14 1,19 1,44 1,52 6.6}
{0 CHEMBL1994361,3 1,7 1,10 1,11 1,14 1,19 1,24 1,44 1,52 5.2}
{0 CHEMBL1994526,10 1,19 1,52 5.4}
{0 CHEMBL1994538,10 1,11 1,19 1,52 5.1}
{0 CHEMBL1994555,10 1,11 1,14 1,19 1,52 5.4}
{0 CHEMBL1994669,1 1,10 1,11 1,19 1,52 9}
{0 CHEMBL1994693,10 1,11 1,14 1,19 1,39 1,44 1,45 1,52 5.6}
{0 CHEMBL1994724,1 1,11 1,16 1,19 1,34 1,52 5.8}
{0 CHEMBL1994830,7 1,44 1,52 5.1}
{0 CHEMBL1994864,11 1,19 1,30 1,52 5.6}
{0 CHEMBL1994938,7 1,11 1,14 1,19 1,44 1,52 5.1}
{0 CHEMBL1994977,10 1,11 1,13 1,19 1,52 5.4}
{0 CHEMBL1995172,11 1,19 1,22 1,52 5.3}
{0 CHEMBL1995211,14 1,19 1,52 5.5}
{0 CHEMBL1995391,10 1,19 1,22 1,44 1,52 4.7}
{0 CHEMBL1995448,10 1,19 1,44 1,52 5.1}
{0 CHEMBL1995592,3 1,11 1,19 1,44 1,52 5.1}
{0 CHEMBL1995736,10 1,11 1,14 1,19 1,49 1,52 5.1}
{0 CHEMBL1995740,10 1,11 1,14 1,19 1,52 5.6}
{0 CHEMBL1995765,19 1,52 4.4}
{0 CHEMBL1995811,11 1,14 1,16 1,19 1,22 1,52 5.4}
{0 CHEMBL1995813,19 1,52 7}
{0 CHEMBL1995832,6 1,8 1,14 1,15 1,18 1,19 1,50 1,52 5.1}
{0 CHEMBL1995916,14 1,19 1,22 1,52 4.1}
{0 CHEMBL1995927,19 1,29 1,52 5.1}
{0 CHEMBL1996048,10 1,11 1,14 1,19 1,36 1,52 6.1}
{0 CHEMBL1996066,11 1,14 1,16 1,19 1,20 1,44 1,52 5.1}
{0 CHEMBL1996111,10 1,11 1,14 1,16 1,19 1,22 1,47 1,52 5.6}
{0 CHEMBL1996155,11 1,19 1,20 1,52 5.1}
{0 CHEMBL1996176,1 1,10 1,11 1,19 1,52 6.2}
{0 CHEMBL1996208,19 1,24 1,34 1,52 5.3}
{0 CHEMBL1996234,8 1,14 1,15 1,16 1,19 1,44 1,52 5.1}
{0 CHEMBL1996345,11 1,19 1,20 1,44 1,52 5.4}
{0 CHEMBL1996390,5 1,7 1,14 1,19 1,52 5.4}
{0 CHEMBL1996500,6 1,8 1,14 1,15 1,18 1,19 1,52 5.4}
{0 CHEMBL1996510,10 1,11 1,19 1,52 7.3}
{0 CHEMBL1996543,7 1,10 1,11 1,14 1,19 1,52 6.4}
{0 CHEMBL1996576,10 1,11 1,12 1,19 1,23 1,52 5.4}
{0 CHEMBL1996587,6 1,14 1,19 1,52 5.1}
{0 CHEMBL1996646,11 1,19 1,52 6.7}
{0 CHEMBL1996649,7 1,10 1,11 1,14 1,19 1,20 1,44 1,52 5.5}
{0 CHEMBL1996702,10 1,11 1,14 1,19 1,20 1,52 5.4}
{0 CHEMBL1996780,11 1,14 1,19 1,34 1,52 5.1}
{0 CHEMBL1996791,9 1,19 1,44 1,52 5.1}
{0 CHEMBL1996817,14 1,19 1,52 5.4}
{0 CHEMBL1996831,11 1,19 1,33 1,52 5.1}
{0 CHEMBL1996923,29 1,52 5.1}
{0 CHEMBL1996931,11 1,14 1,19 1,34 1,52 5.1}
{0 CHEMBL1996979,10 1,11 1,14 1,19 1,52 5.8}
{0 CHEMBL1997007,1 1,10 1,11 1,19 1,52 5.7}
{0 CHEMBL1997023,10 1,19 1,52 5.5}
{0 CHEMBL1997025,10 1,11 1,14 1,19 1,49 1,52 5.1}
{0 CHEMBL1997041,11 1,14 1,16 1,19 1,24 1,52 5.4}
{0 CHEMBL1997051,1 1,2 1,3 1,4 1,6 1,8 1,10 1,11 1,14 1,15 1,16 1,18 1,19 1,20 1,52 5.5}
{0 CHEMBL1997119,8 1,14 1,16 1,44 1,52 4.4}
{0 CHEMBL1997129,11 1,19 1,34 1,45 1,52 5.6}
{0 CHEMBL1997193,11 1,19 1,20 1,52 6.2}
{0 CHEMBL1997197,11 1,19 1,52 5.4}
{0 CHEMBL1997275,1 1,10 1,11 1,19 1,52 5.4}
{0 CHEMBL1997335,10 1,11 1,19 1,52 5.8}
{0 CHEMBL1997340,10 1,14 1,16 1,19 1,22 1,47 1,52 5.1}
{0 CHEMBL1997349,11 1,19 1,20 1,52 5.9}
{0 CHEMBL1997503,7 1,10 1,14 1,19 1,52 5.1}
{0 CHEMBL1997534,1 1,10 1,11 1,14 1,16 1,19 1,22 1,52 5.1}
{0 CHEMBL1997597,10 1,14 1,19 1,22 1,44 1,52 5.1}
{0 CHEMBL1997611,10 1,19 1,52 5.4}
{0 CHEMBL1997617,9 1,14 1,19 1,20 1,44 1,45 1,52 5.1}
{0 CHEMBL1997623,10 1,11 1,14 1,19 1,22 1,44 1,52 5.3}
{0 CHEMBL1997759,10 1,11 1,14 1,16 1,19 1,52 5.1}
{0 CHEMBL1997764,10 1,11 1,14 1,19 1,52 5.1}
{0 CHEMBL1997822,7 1,10 1,11 1,14 1,19 1,24 1,44 1,52 5.1}
{0 CHEMBL1997846,7 1,19 1,32 1,52 6}
{0 CHEMBL1997872,7 1,11 1,14 1,19 1,24 1,52 5.1}
{0 CHEMBL1997892,10 1,11 1,19 1,52 5.4}
{0 CHEMBL1997909,1 1,2 1,3 1,4 1,6 1,8 1,10 1,11 1,14 1,15 1,16 1,18 1,19 1,52 5.5}
{0 CHEMBL1997924,11 1,19 1,22 1,38 1,52 7}
{0 CHEMBL1998110,1 1,7 1,11 1,19 1,34 1,52 5.4}
{0 CHEMBL1998112,1 1,8 1,10 1,11 1,14 1,15 1,16 1,19 1,52 5.6}
{0 CHEMBL1998121,10 1,11 1,19 1,22 1,47 1,52 8.3}
{0 CHEMBL1998159,7 1,11 1,19 1,22 1,38 1,42 1,52 7.8}
{0 CHEMBL1998193,10 1,19 1,52 5.1}
{0 CHEMBL1998253,10 1,19 1,44 1,52 5.4}
{0 CHEMBL1998414,5 1,11 1,19 1,22 1,52 5.1}
{0 CHEMBL1998432,19 1,52 6.4}
{0 CHEMBL1998435,14 1,19 1,34 1,52 5.1}
{0 CHEMBL1998470,19 1,52 5.5}
{0 CHEMBL1998545,11 1,14 1,19 1,34 1,52 5.1}
{0 CHEMBL1998551,6 1,14 1,19 1,52 5.1}
{0 CHEMBL1998585,7 1,10 1,11 1,14 1,19 1,39 1,44 1,45 1,52 6.6}
{0 CHEMBL1998611,10 1,19 1,27 1,44 1,52 5.1}
{0 CHEMBL1998680,11 1,13 1,19 1,31 1,52 5.4}
{0 CHEMBL1998829,10 1,11 1,14 1,19 1,52 5.1}
{0 CHEMBL1998953,14 1,19 1,52 5.4}
{0 CHEMBL1999112,19 1,20 1,45 1,52 5.1}
{0 CHEMBL1999126,11 1,19 1,20 1,52 5.1}
{0 CHEMBL1999321,10 1,11 1,19 1,52 5.1}
{0 CHEMBL1999414,7 1,10 1,11 1,14 1,19 1,20 1,44 1,52 5.7}
{0 CHEMBL1999428,1 1,11 1,14 1,19 1,34 1,52 5.3}
{0 CHEMBL1999484,1 1,10 1,16 1,19 1,52 6.3}
{0 CHEMBL1999496,10 1,11 1,19 1,42 1,52 5.1}
{0 CHEMBL1999506,10 1,11 1,13 1,19 1,52 5.4}
{0 CHEMBL1999556,5 1,7 1,14 1,19 1,52 6.1}
{0 CHEMBL1999590,9 1,14 1,16 1,19 1,52 5.1}
{0 CHEMBL1999714,10 1,11 1,19 1,52 5.1}
{0 CHEMBL1999718,10 1,11 1,19 1,20 1,52 5.1}
{0 CHEMBL1999749,10 1,11 1,14 1,19 1,20 1,44 1,52 5.1}
{0 CHEMBL1999774,11 1,19 1,28 1,33 1,39 1,52 5.1}
{0 CHEMBL1999811,9 1,10 1,11 1,16 1,19 1,52 5.3}
{0 CHEMBL1999918,5 1,7 1,14 1,19 1,52 6}
{0 CHEMBL1999931,11 1,14 1,16 1,19 1,22 1,52 6.6}
{0 CHEMBL2000029,10 1,11 1,14 1,16 1,19 1,22 1,44 1,52 5.5}
{0 CHEMBL2000071,14 1,19 1,52 5.4}
{0 CHEMBL2000078,1 1,2 1,3 1,4 1,6 1,8 1,10 1,11 1,14 1,15 1,16 1,18 1,19 1,52 5.5}
{0 CHEMBL2000104,5 1,7 1,11 1,14 1,19 1,52 5.1}
{0 CHEMBL2000114,19 1,52 5.1}
{0 CHEMBL2000271,7 1,11 1,14 1,19 1,22 1,52 5.1}
{0 CHEMBL2000335,7 1,10 1,11 1,14 1,19 1,39 1,44 1,45 1,52 6.9}
{0 CHEMBL2000345,4 1,10 1,11 1,19 1,20 1,49 1,52 6.5}
{0 CHEMBL2000354,11 1,19 1,52 5.5}
{0 CHEMBL2000393,10 1,11 1,19 1,29 1,52 5.5}
{0 CHEMBL2000408,6 1,8 1,14 1,18 1,19 1,50 1,52 5.1}
{0 CHEMBL2000429,6 1,8 1,14 1,15 1,18 1,19 1,50 1,52 5.1}
{0 CHEMBL2000481,10 1,11 1,19 1,31 1,42 1,52 6.1}
{0 CHEMBL2000508,2 1,3 1,4 1,6 1,8 1,14 1,15 1,16 1,34 1,52 5.1}
{0 CHEMBL2000568,7 1,11 1,14 1,19 1,24 1,52 5.3}
{0 CHEMBL2000685,10 1,11 1,19 1,25 1,42 1,52 7}
{0 CHEMBL2000724,11 1,14 1,16 1,19 1,20 1,22 1,49 1,52 5.4}
{0 CHEMBL2000801,10 1,11 1,14 1,19 1,52 5.1}
{0 CHEMBL2000832,10 1,11 1,14 1,19 1,52 5.9}
{0 CHEMBL2000879,11 1,19 1,22 1,52 4.3}
{0 CHEMBL2000894,11 1,14 1,19 1,34 1,52 5.6}
{0 CHEMBL2000934,10 1,11 1,19 1,52 5.4}
{0 CHEMBL2001019,11 1,19 1,41 1,52 5.4}
{0 CHEMBL2001149,10 1,14 1,49 1,52 5.6}
{0 CHEMBL2001224,5 1,10 1,11 1,19 1,20 1,52 7}
{0 CHEMBL2001228,1 1,2 1,3 1,4 1,6 1,8 1,10 1,11 1,14 1,15 1,18 1,19 1,52 5.5}
{0 CHEMBL2001239,1 1,10 1,11 1,14 1,19 1,44 1,52 5.7}
{0 CHEMBL2001257,7 1,10 1,11 1,14 1,19 1,20 1,44 1,52 5.8}
{0 CHEMBL2001288,19 1,44 1,47 1,52 5.1}
{0 CHEMBL2001485,7 1,9 1,10 1,11 1,14 1,19 1,44 1,52 5.9}
{0 CHEMBL2001539,11 1,19 1,22 1,34 1,52 4.4}
{0 CHEMBL2001547,6 1,8 1,14 1,15 1,18 1,19 1,52 5.1}
{0 CHEMBL2001584,10 1,11 1,16 1,19 1,21 1,52 5.4}
{0 CHEMBL2001613,22 1,51 1,52 4.5}
{0 CHEMBL2001641,10 1,19 1,22 1,47 1,52 4.4}
{0 CHEMBL2001668,14 1,16 1,19 1,52 5.1}
{0 CHEMBL2001920,1 1,10 1,11 1,19 1,52 5.1}
{0 CHEMBL2001923,10 1,11 1,14 1,19 1,52 5.3}
{0 CHEMBL2001957,6 1,8 1,14 1,15 1,16 1,18 1,19 1,50 1,52 5.1}
{0 CHEMBL2001987,10 1,19 1,27 1,52 5.4}
{0 CHEMBL2001998,5 1,7 1,11 1,14 1,19 1,20 1,22 1,24 1,52 5.1}
{0 CHEMBL2002099,9 1,19 1,20 1,52 5.45}
{0 CHEMBL2002105,22 1,44 1,52 4.1}
{0 CHEMBL2002165,7 1,10 1,14 1,19 1,44 1,52 6.1}
{0 CHEMBL2002182,11 1,19 1,52 4.4}
{0 CHEMBL2002240,10 1,11 1,14 1,16 1,19 1,20 1,44 1,52 5.1}
{0 CHEMBL2002322,5 1,7 1,11 1,19 1,24 1,42 1,52 5.1}
{0 CHEMBL2002323,8 1,11 1,14 1,19 1,24 1,44 1,52 5.1}
{0 CHEMBL2002373,6 1,14 1,16 1,19 1,34 1,52 5.1}
{0 CHEMBL2002407,11 1,19 1,20 1,22 1,44 1,52 5.1}
{0 CHEMBL2002446,7 1,11 1,14 1,19 1,20 1,22 1,42 1,52 5.9}
{0 CHEMBL2002450,10 1,14 1,19 1,44 1,52 4.2}
{0 CHEMBL2002479,1 1,10 1,11 1,14 1,19 1,29 1,52 5.2}
{0 CHEMBL2002586,1 1,10 1,19 1,52 5.4}
{0 CHEMBL2002599,10 1,19 1,52 5.4}
{0 CHEMBL2002613,11 1,14 1,16 1,19 1,22 1,52 5.6}
{0 CHEMBL2002635,10 1,19 1,44 1,52 5.1}
{0 CHEMBL2002649,1 1,10 1,11 1,19 1,52 5.9}
{0 CHEMBL2002682,10 1,11 1,14 1,19 1,52 5.1}
{0 CHEMBL2002690,10 1,14 1,19 1,52 5.4}
{0 CHEMBL2002702,1 1,10 1,11 1,19 1,52 6.8}
{0 CHEMBL2002723,10 1,19 1,31 1,44 1,52 5.5}
{0 CHEMBL2002726,7 1,11 1,14 1,19 1,22 1,52 6}
{0 CHEMBL2002992,10 1,19 1,52 5.9}
{0 CHEMBL2003271,10 1,11 1,19 1,52 5.2}
{0 CHEMBL2003286,11 1,19 1,52 5.1}
{0 CHEMBL2003341,1 1,10 1,11 1,14 1,19 1,34 1,52 5.1}
{0 CHEMBL2003420,11 1,19 1,52 5.1}
{0 CHEMBL2003456,7 1,10 1,14 1,19 1,52 5.2}
{0 CHEMBL2003482,11 1,19 1,22 1,52 5.1}
{0 CHEMBL2003514,1 1,7 1,11 1,13 1,19 1,34 1,52 5.4}
{0 CHEMBL2003524,11 1,19 1,52 5.1}
{0 CHEMBL2003638,11 1,14 1,16 1,19 1,22 1,52 6.1}
{0 CHEMBL2003657,2 1,3 1,4 1,6 1,8 1,14 1,15 1,16 1,19 1,44 1,52 5.1}
{0 CHEMBL2003689,11 1,13 1,19 1,52 5.4}
{0 CHEMBL2003768,11 1,19 1,30 1,52 5.2}
{0 CHEMBL2003785,10 1,11 1,19 1,52 4.4}
{0 CHEMBL2003817,10 1,11 1,19 1,52 5.1}
{0 CHEMBL2004025,10 1,11 1,14 1,19 1,32 1,52 6}
{0 CHEMBL2004072,5 1,7 1,14 1,19 1,52 5.1}
{0 CHEMBL2004118,1 1,10 1,19 1,52 5.8}
{0 CHEMBL2004159,7 1,11 1,13 1,19 1,34 1,52 5.4}
{0 CHEMBL2004290,7 1,10 1,14 1,19 1,44 1,52 5.5}
{0 CHEMBL2004311,10 1,11 1,14 1,19 1,42 1,52 5.1}
{0 CHEMBL2004355,10 1,11 1,19 1,20 1,44 1,52 5.1}
{0 CHEMBL2004365,19 1,45 1,52 5.2}
{0 CHEMBL2004419,2 1,3 1,4 1,6 1,8 1,14 1,15 1,16 1,19 1,27 1,44 1,52 5.1}
{0 CHEMBL2004438,10 1,11 1,14 1,19 1,25 1,44 1,52 5.3}
{0 CHEMBL2004447,11 1,19 1,20 1,22 1,34 1,52 5.1}
{0 CHEMBL2004513,10 1,11 1,14 1,19 1,52 5.1}
{0 CHEMBL2004515,14 1,16 1,19 1,52 5.4}
{0 CHEMBL2004544,10 1,11 1,19 1,52 5.3}
{0 CHEMBL2004615,11 1,19 1,32 1,44 1,52 5.1}
{0 CHEMBL2004637,10 1,11 1,13 1,19 1,52 5.7}
{0 CHEMBL2004692,9 1,14 1,16 1,19 1,44 1,52 5.2}
{0 CHEMBL2004716,7 1,10 1,11 1,14 1,19 1,20 1,44 1,52 5.7}
{0 CHEMBL2004771,1 1,10 1,11 1,14 1,19 1,52 5.1}
{0 CHEMBL2004871,6 1,14 1,16 1,19 1,34 1,52 5.1}
{0 CHEMBL2004872,1 1,11 1,14 1,16 1,19 1,52 5.1}
{0 CHEMBL2004887,8 1,14 1,16 1,44 1,52 4.3}
{0 CHEMBL2004892,10 1,14 1,19 1,22 1,44 1,52 5.1}
{0 CHEMBL2004934,1 1,11 1,14 1,19 1,34 1,52 6.1}
{0 CHEMBL2005112,11 1,19 1,20 1,52 5.1}
{0 CHEMBL2005186,7 1,10 1,14 1,19 1,22 1,47 1,52 5.1}
{0 CHEMBL2005375,1 1,10 1,11 1,19 1,35 1,52 5.2}
{0 CHEMBL2005449,11 1,19 1,22 1,48 1,52 5.4}
{0 CHEMBL2005475,5 1,14 1,19 1,22 1,52 5.1}
{0 CHEMBL2005478,7 1,10 1,19 1,52 5.9}
{0 CHEMBL2005482,1 1,2 1,3 1,4 1,6 1,8 1,10 1,11 1,14 1,15 1,16 1,18 1,19 1,52 5.5}
{0 CHEMBL2005528,10 1,11 1,19 1,52 5.1}
{0 CHEMBL2005548,10 1,11 1,19 1,52 6.5}
{0 CHEMBL2005631,7 1,10 1,11 1,14 1,19 1,44 1,52 5.1}
{0 CHEMBL2005699,11 1,13 1,19 1,52 5.4}
{0 CHEMBL2005792,6 1,8 1,14 1,15 1,16 1,18 1,19 1,50 1,52 5.3}
{0 CHEMBL2005828,7 1,10 1,11 1,14 1,19 1,39 1,44 1,45 1,52 5.4}
{0 CHEMBL2005886,1 1,4 1,10 1,11 1,19 1,20 1,46 1,49 1,52 5.7}
{0 CHEMBL2005899,19 1,52 5.2}
{0 CHEMBL2005936,11 1,14 1,16 1,19 1,22 1,52 5.3}
{0 CHEMBL2006010,10 1,19 1,52 5.7}
{0 CHEMBL2006156,10 1,19 1,52 5.1}
{0 CHEMBL2006188,1 1,10 1,11 1,14 1,19 1,34 1,52 5.3}
{0 CHEMBL2006237,10 1,11 1,19 1,20 1,49 1,52 5.1}
{0 CHEMBL2006263,10 1,11 1,19 1,44 1,52 6.1}
{0 CHEMBL2006276,10 1,11 1,19 1,52 5.1}
{0 CHEMBL2006299,11 1,14 1,19 1,34 1,52 5.4}
{0 CHEMBL2006439,19 1,52 5.7}
{0 CHEMBL2006450,19 1,52 5.4}
{0 CHEMBL2006481,10 1,14 1,16 1,19 1,22 1,47 1,52 5.1}
{0 CHEMBL2006493,11 1,18 1,19 1,52 5.1}
{0 CHEMBL2006564,1 1,6 1,10 1,19 1,43 1,52 7}
{0 CHEMBL2006567,7 1,10 1,11 1,19 1,20 1,34 1,44 1,52 5.1}
{0 CHEMBL2006580,10 1,39 1,52 5.2}
{0 CHEMBL2006581,10 1,11 1,19 1,44 1,52 5.1}
{0 CHEMBL2006674,11 1,19 1,34 1,50 1,52 5.4}
{0 CHEMBL2006715,1 1,2 1,3 1,4 1,6 1,8 1,10 1,11 1,14 1,15 1,16 1,18 1,19 1,41 1,52 5.1}
{0 CHEMBL2006765,1 1,10 1,11 1,19 1,34 1,52 7.4}
{0 CHEMBL2006778,7 1,10 1,11 1,19 1,44 1,52 5.4}
{0 CHEMBL2006785,5 1,10 1,11 1,19 1,20 1,52 5.1}
{0 CHEMBL2006836,11 1,19 1,20 1,33 1,52 5.1}
{0 CHEMBL2006933,15 1,19 1,44 1,52 5.8}
{0 CHEMBL2007002,10 1,14 1,19 1,22 1,52 5.1}
{0 CHEMBL2007044,5 1,7 1,11 1,14 1,19 1,20 1,22 1,24 1,52 6.4}
{0 CHEMBL2007064,1 1,10 1,11 1,19 1,52 6.6}
{0 CHEMBL2007097,11 1,19 1,52 4.1}
{0 CHEMBL2007124,10 1,11 1,19 1,52 5.4}
{0 CHEMBL2007138,10 1,19 1,52 4.7}
{0 CHEMBL2007151,9 1,11 1,14 1,19 1,20 1,44 1,45 1,52 5.1}
{0 CHEMBL2007266,10 1,11 1,14 1,19 1,22 1,44 1,52 5.4}
{0 CHEMBL2007296,1 1,11 1,14 1,19 1,34 1,52 5.1}
{0 CHEMBL2007372,6 1,8 1,14 1,15 1,16 1,18 1,19 1,50 1,52 5.1}
{0 CHEMBL2007375,10 1,11 1,19 1,52 5.4}
{0 CHEMBL2007421,19 1,22 1,52 5.4}
{0 CHEMBL2007479,8 1,11 1,19 1,44 1,52 5.4}
{0 CHEMBL2007559,1 1,10 1,11 1,19 1,34 1,52 5.4}
{0 CHEMBL2007574,44 1,52 6.1}
{0 CHEMBL2007592,7 1,11 1,14 1,19 1,52 5.1}
{0 CHEMBL2007603,10 1,19 1,52 5.4}
{0 CHEMBL2012701,10 1,11 1,19 1,20 1,22 1,52 7.167}
{0 CHEMBL2012702,10 1,11 1,19 1,20 1,22 1,49 1,52 6.606}
{0 CHEMBL2012703,10 1,11 1,19 1,20 1,22 1,49 1,52 7.62}
{0 CHEMBL2017214,10 1,19 1,52 4.398}
{0 CHEMBL2017517,11 1,19 1,23 1,52 5.947}
{0 CHEMBL2017518,11 1,19 1,23 1,52 6.599}
{0 CHEMBL2017519,11 1,19 1,23 1,52 6.061}
{0 CHEMBL2017520,11 1,19 1,23 1,52 5.717}
{0 CHEMBL2017521,11 1,19 1,23 1,52 6.307}
{0 CHEMBL2017522,11 1,19 1,23 1,52 6.449}
{0 CHEMBL2017523,11 1,19 1,23 1,52 5.845}
{0 CHEMBL2022369,8 1,19 1,20 1,44 1,52 5.114}
{0 CHEMBL2022373,8 1,10 1,19 1,20 1,52 5.367}
{0 CHEMBL2022379,8 1,10 1,19 1,20 1,44 1,52 5.959}
{0 CHEMBL2022711,8 1,10 1,19 1,20 1,44 1,52 5.167}
{0 CHEMBL202635,5 1,10 1,11 1,19 1,20 1,52 6.1}
{0 CHEMBL202721,10 1,11 1,19 1,20 1,52 5.7}
{0 CHEMBL2063926,10 1,19 1,20 1,52 5}
{0 CHEMBL2064666,1 1,10 1,11 1,19 1,20 1,52 7.886}
{0 CHEMBL207253,3 1,11 1,19 1,44 1,52 5.1}
{0 CHEMBL207400,3 1,11 1,19 1,52 5.1}
{0 CHEMBL207995,5 1,9 1,10 1,11 1,19 1,20 1,52 5.6}
{0 CHEMBL208637,10 1,11 1,19 1,20 1,44 1,52 5.116}
{0 CHEMBL2086760,1 1,4 1,10 1,11 1,19 1,20 1,52 8.523}
{0 CHEMBL209534,10 1,11 1,19 1,20 1,44 1,52 5.1}
{0 CHEMBL210032,10 1,11 1,14 1,16 1,19 1,20 1,44 1,52 5.116}
{0 CHEMBL210618,10 1,11 1,19 1,20 1,44 1,52 5.116}
{0 CHEMBL210887,11 1,19 1,52 5.1}
{0 CHEMBL210928,10 1,11 1,19 1,44 1,52 5.116}
{0 CHEMBL210963,10 1,11 1,19 1,20 1,44 1,52 5.116}
{0 CHEMBL211378,10 1,11 1,14 1,16 1,19 1,44 1,52 5.1}
{0 CHEMBL21156,4 1,10 1,11 1,19 1,52 6.4}
{0 CHEMBL213505,10 1,11 1,14 1,16 1,19 1,44 1,52 5.9}
{0 CHEMBL215152,10 1,19 1,20 1,22 1,52 5.2}
{0 CHEMBL215803,14 1,19 1,20 1,52 6}
{0 CHEMBL219722,10 1,14 1,19 1,22 1,44 1,52 5.3}
{0 CHEMBL220057,10 1,11 1,14 1,19 1,22 1,44 1,52 5.5}
{0 CHEMBL220241,7 1,10 1,11 1,19 1,20 1,44 1,52 7.4}
{0 CHEMBL2205426,1 1,10 1,14 1,19 1,34 1,52 6.201}
{0 CHEMBL2205766,7 1,11 1,19 1,24 1,34 1,44 1,52 5}
{0 CHEMBL2216829,11 1,14 1,19 1,20 1,44 1,45 1,52 8.398}
{0 CHEMBL221959,19 1,20 1,28 1,52 5}
{0 CHEMBL223257,5 1,10 1,19 1,20 1,52 7.3}
{0 CHEMBL223360,10 1,11 1,14 1,19 1,22 1,44 1,52 5.2}
{0 CHEMBL223367,5 1,10 1,11 1,19 1,20 1,52 8.1}
{0 CHEMBL223460,5 1,10 1,19 1,20 1,52 7.6}
{0 CHEMBL225519,11 1,19 1,34 1,52 5.7}
{0 CHEMBL226403,7 1,11 1,19 1,34 1,52 5.1}
{0 CHEMBL226471,11 1,14 1,19 1,34 1,52 5.1}
{0 CHEMBL230011,6 1,14 1,16 1,44 1,52 5}
{0 CHEMBL2309006,7 1,11 1,19 1,25 1,52 5.886}
{0 CHEMBL2309609,7 1,11 1,19 1,26 1,52 5}
{0 CHEMBL231209,7 1,10 1,14 1,19 1,44 1,52 5.2}
{0 CHEMBL2321925,11 1,19 1,23 1,52 7.699}
{0 CHEMBL2326704,11 1,19 1,52 5.821}
{0 CHEMBL2326705,11 1,19 1,52 6.149}
{0 CHEMBL2326706,11 1,19 1,52 6.319}
{0 CHEMBL2326707,11 1,19 1,23 1,52 5.824}
{0 CHEMBL2326708,11 1,19 1,23 1,52 6.208}
{0 CHEMBL2326709,11 1,19 1,52 5.752}
{0 CHEMBL2333365,7 1,11 1,14 1,19 1,24 1,26 1,44 1,52 5}
{0 CHEMBL234085,19 1,20 1,28 1,52 5.4}
{0 CHEMBL2347053,1 1,10 1,11 1,14 1,19 1,22 1,52 6.301}
{0 CHEMBL2347054,1 1,10 1,11 1,14 1,16 1,19 1,22 1,52 5.066}
{0 CHEMBL2347061,1 1,10 1,11 1,19 1,52 5.775}
{0 CHEMBL2347062,1 1,10 1,11 1,19 1,52 4.77}
{0 CHEMBL2347073,1 1,10 1,11 1,19 1,45 1,52 5.285}
{0 CHEMBL2347074,1 1,10 1,11 1,19 1,45 1,52 5.695}
{0 CHEMBL2347075,1 1,10 1,11 1,19 1,45 1,52 5.821}
{0 CHEMBL2347085,1 1,10 1,11 1,19 1,44 1,45 1,52 5.604}
{0 CHEMBL235157,10 1,11 1,19 1,44 1,52 6.3}
{0 CHEMBL235345,11 1,19 1,52 5.699}
{0 CHEMBL240954,11 1,19 1,23 1,52 6.119}
{0 CHEMBL242865,1 1,10 1,11 1,19 1,33 1,52 6.1}
{0 CHEMBL243088,1 1,10 1,11 1,19 1,33 1,52 5.8}
{0 CHEMBL243298,1 1,10 1,11 1,19 1,33 1,52 6.9}
{0 CHEMBL244378,1 1,10 1,11 1,19 1,22 1,33 1,52 6.2}
{0 CHEMBL246970,11 1,19 1,38 1,52 6.9}
{0 CHEMBL24828,10 1,19 1,20 1,52 5.35}
{0 CHEMBL248757,5 1,10 1,18 1,19 1,20 1,21 1,52 5.117}
{0 CHEMBL249282,5 1,7 1,11 1,14 1,19 1,20 1,22 1,52 6.4}
{0 CHEMBL249697,8 1,11 1,19 1,52 5}
{0 CHEMBL253969,11 1,19 1,20 1,52 5.5}
{0 CHEMBL255210,1 1,5 1,7 1,10 1,11 1,19 1,52 5.712}
{0 CHEMBL255863,1 1,7 1,10 1,11 1,14 1,18 1,19 1,52 5}
{0 CHEMBL256835,6 1,9 1,14 1,16 1,19 1,52 5.1}
{0 CHEMBL257321,1 1,5 1,7 1,10 1,11 1,19 1,52 6.456}
{0 CHEMBL259084,1 1,10 1,11 1,14 1,19 1,33 1,52 5.3}
{0 CHEMBL259850,11 1,17 1,19 1,52 5.1}
{0 CHEMBL259922,10 1,11 1,19 1,52 5.1}
{0 CHEMBL260092,10 1,11 1,19 1,44 1,52 5.1}
{0 CHEMBL260135,14 1,16 1,22 1,44 1,52 5.1}
{0 CHEMBL260933,11 1,19 1,42 1,43 1,52 5.2}
{0 CHEMBL261849,11 1,19 1,44 1,52 5.2}
{0 CHEMBL262433,10 1,11 1,14 1,16 1,19 1,44 1,52 5.2}
{0 CHEMBL262623,11 1,19 1,44 1,52 5}
{0 CHEMBL271381,10 1,14 1,19 1,44 1,52 6.2}
{0 CHEMBL272096,1 1,5 1,7 1,10 1,11 1,19 1,52 5.616}
{0 CHEMBL272309,1 1,5 1,7 1,10 1,11 1,19 1,52 5.745}
{0 CHEMBL272453,10 1,14 1,19 1,44 1,52 5.8}
{0 CHEMBL274064,6 1,9 1,14 1,16 1,19 1,44 1,52 5.1}
{0 CHEMBL278041,14 1,16 1,34 1,42 1,52 5.2}
{0 CHEMBL288441,10 1,11 1,19 1,20 1,52 5.921}
{0 CHEMBL289959,10 1,52 4.1}
{0 CHEMBL296468,13 1,19 1,52 5.2}
{0 CHEMBL296586,4 1,10 1,11 1,14 1,19 1,52 5.1}
{0 CHEMBL300138,7 1,9 1,11 1,19 1,20 1,52 7.06}
{0 CHEMBL302449,7 1,11 1,19 1,20 1,52 8.6}
{0 CHEMBL306380,11 1,14 1,16 1,19 1,44 1,52 6.8}
{0 CHEMBL316264,14 1,16 1,34 1,42 1,52 5.1}
{0 CHEMBL31965,10 1,19 1,20 1,52 5}
{0 CHEMBL326282,11 1,19 1,29 1,44 1,52 5.1}
{0 CHEMBL336961,10 1,11 1,19 1,52 5.1}
{0 CHEMBL340384,11 1,14 1,19 1,34 1,52 6.4}
{0 CHEMBL340921,11 1,14 1,19 1,34 1,52 5.3}
{0 CHEMBL360847,7 1,11 1,19 1,20 1,49 1,52 7.7}
{0 CHEMBL362558,8 1,11 1,19 1,49 1,52 5.9}
{0 CHEMBL363648,6 1,11 1,14 1,16 1,19 1,24 1,34 1,52 5.1}
{0 CHEMBL365617,14 1,19 1,22 1,52 5.5}
{0 CHEMBL371206,10 1,11 1,14 1,19 1,39 1,42 1,44 1,45 1,52 6.2}
{0 CHEMBL373598,5 1,10 1,19 1,20 1,52 7.9}
{0 CHEMBL375284,10 1,11 1,14 1,19 1,22 1,52 5.8}
{0 CHEMBL377300,10 1,11 1,19 1,52 5}
{0 CHEMBL377383,10 1,11 1,19 1,44 1,52 5.116}
{0 CHEMBL377408,10 1,11 1,19 1,20 1,44 1,52 5.4}
{0 CHEMBL378627,10 1,11 1,19 1,20 1,44 1,52 5.441}
{0 CHEMBL379218,7 1,11 1,14 1,19 1,22 1,52 5}
{0 CHEMBL379835,3 1,11 1,19 1,52 5.1}
{0 CHEMBL379975,10 1,11 1,14 1,19 1,52 6.5}
{0 CHEMBL38380,11 1,19 1,20 1,36 1,52 6}
{0 CHEMBL384304,3 1,11 1,19 1,20 1,44 1,52 5}
{0 CHEMBL386051,1 1,10 1,11 1,19 1,52 5}
{0 CHEMBL387971,3 1,7 1,11 1,14 1,19 1,20 1,22 1,42 1,52 5.3}
{0 CHEMBL389745,10 1,11 1,14 1,19 1,44 1,52 5}
{0 CHEMBL392642,11 1,19 1,38 1,52 6.7}
{0 CHEMBL393929,11 1,19 1,52 5.699}
{0 CHEMBL394619,7 1,10 1,11 1,14 1,19 1,44 1,52 5.9}
{0 CHEMBL394790,7 1,10 1,14 1,19 1,44 1,52 5.8}
{0 CHEMBL396377,11 1,19 1,52 5.699}
{0 CHEMBL396523,1 1,10 1,11 1,19 1,22 1,33 1,47 1,52 6.7}
{0 CHEMBL398951,5 1,7 1,11 1,14 1,19 1,20 1,22 1,52 6.1}
{0 CHEMBL402846,7 1,10 1,11 1,14 1,19 1,44 1,52 5.5}
{0 CHEMBL403436,1 1,5 1,7 1,11 1,19 1,52 5.658}
{0 CHEMBL404367,7 1,10 1,11 1,14 1,19 1,44 1,52 5.5}
{0 CHEMBL404908,1 1,5 1,7 1,10 1,11 1,19 1,52 5}
{0 CHEMBL406845,14 1,16 1,19 1,44 1,52 5.4}
{0 CHEMBL407391,10 1,19 1,52 5.3}
{0 CHEMBL411903,10 1,11 1,19 1,44 1,52 5.5}
{0 CHEMBL412142,7 1,11 1,14 1,19 1,20 1,52 5.1}
{0 CHEMBL413779,5 1,10 1,19 1,20 1,52 8.1}
{0 CHEMBL415049,10 1,19 1,20 1,22 1,27 1,52 5.4}
{0 CHEMBL41783,14 1,19 1,20 1,22 1,52 5.1}
{0 CHEMBL422897,11 1,19 1,20 1,52 5.9}
{0 CHEMBL424872,10 1,11 1,19 1,20 1,44 1,52 5.4}
{0 CHEMBL428690,11 1,19 1,20 1,52 5}
{0 CHEMBL437747,6 1,14 1,16 1,19 1,52 5.1}
{0 CHEMBL440084,11 1,14 1,16 1,19 1,52 5.2}
{0 CHEMBL443962,7 1,14 1,19 1,52 5.1}
{0 CHEMBL445813,10 1,11 1,19 1,22 1,52 5}
{0 CHEMBL450786,1 1,10 1,11 1,19 1,20 1,42 1,52 5.004}
{0 CHEMBL451964,7 1,11 1,14 1,19 1,52 5.1}
{0 CHEMBL458997,1 1,10 1,11 1,19 1,52 6.3}
{0 CHEMBL461876,1 1,10 1,11 1,19 1,20 1,52 6.2}
{0 CHEMBL462120,10 1,11 1,19 1,52 5.1}
{0 CHEMBL464552,1 1,10 1,11 1,19 1,20 1,52 6.77}
{0 CHEMBL468280,3 1,7 1,11 1,19 1,52 5.1}
{0 CHEMBL474432,11 1,19 1,52 5.1}
{0 CHEMBL475251,1 1,10 1,19 1,38 1,52 5.349}
{0 CHEMBL477772,1 1,10 1,11 1,19 1,52 5.2}
{0 CHEMBL481491,11 1,19 1,52 5.1}
{0 CHEMBL482538,14 1,34 1,52 5.2}
{0 CHEMBL482767,10 1,19 1,52 5.6}
{0 CHEMBL482967,1 1,10 1,16 1,19 1,44 1,52 5.7}
{0 CHEMBL483158,1 1,10 1,11 1,14 1,19 1,33 1,52 6.1}
{0 CHEMBL483321,10 1,11 1,19 1,52 5}
{0 CHEMBL484390,11 1,19 1,20 1,52 6.7}
{0 CHEMBL485556,11 1,19 1,20 1,26 1,52 6}
{0 CHEMBL489344,4 1,11 1,14 1,16 1,19 1,24 1,52 4.119}
{0 CHEMBL49120,1 1,10 1,11 1,19 1,20 1,52 6.3}
{0 CHEMBL491473,10 1,19 1,20 1,52 5.15}
{0 CHEMBL491758,1 1,10 1,52 5.7}
{0 CHEMBL494089,7 1,11 1,19 1,44 1,52 5}
{0 CHEMBL495727,10 1,11 1,19 1,20 1,22 1,49 1,52 9}
{0 CHEMBL497151,7 1,52 5.4}
{0 CHEMBL504950,11 1,19 1,39 1,44 1,52 5.1}
{0 CHEMBL507936,10 1,11 1,14 1,19 1,25 1,44 1,52 5.1}
{0 CHEMBL508928,7 1,10 1,11 1,14 1,19 1,44 1,52 5.2}
{0 CHEMBL50894,4 1,10 1,11 1,14 1,19 1,52 5.3}
{0 CHEMBL509032,1 1,10 1,11 1,19 1,20 1,52 7.77}
{0 CHEMBL513846,1 1,8 1,10 1,16 1,19 1,52 5.1}
{0 CHEMBL513909,1 1,10 1,11 1,19 1,20 1,35 1,52 5}
{0 CHEMBL514499,11 1,19 1,52 5.1}
{0 CHEMBL515414,11 1,14 1,19 1,44 1,45 1,52 4.824}
{0 CHEMBL519697,11 1,19 1,20 1,52 6.4}
{0 CHEMBL521851,7 1,10 1,14 1,19 1,20 1,22 1,52 5.523}
{0 CHEMBL522892,1 1,4 1,10 1,11 1,19 1,20 1,49 1,52 5.252}
{0 CHEMBL523823,3 1,7 1,11 1,19 1,52 5.5}
{0 CHEMBL52387,9 1,11 1,19 1,52 5.1}
{0 CHEMBL523938,4 1,14 1,16 1,19 1,34 1,42 1,52 4.409}
{0 CHEMBL525191,11 1,14 1,16 1,19 1,24 1,34 1,41 1,52 5}
{0 CHEMBL526133,10 1,11 1,19 1,22 1,47 1,52 6.1}
{0 CHEMBL529177,10 1,11 1,14 1,19 1,44 1,49 1,52 6.495}
{0 CHEMBL535,1 1,10 1,11 1,19 1,20 1,52 6.486}
{0 CHEMBL535331,9 1,10 1,11 1,19 1,46 1,49 1,52 5.1}
{0 CHEMBL539474,10 1,11 1,19 1,41 1,52 6.9}
{0 CHEMBL546797,4 1,10 1,12 1,19 1,49 1,52 5.4}
{0 CHEMBL550418,10 1,11 1,14 1,17 1,19 1,52 5.4}
{0 CHEMBL553,10 1,11 1,19 1,26 1,52 5.2}
{0 CHEMBL554,10 1,11 1,14 1,16 1,19 1,49 1,52 5.2}
{0 CHEMBL558752,1 1,10 1,11 1,19 1,52 5}
{0 CHEMBL560813,5 1,10 1,11 1,19 1,20 1,33 1,52 5.1}
{0 CHEMBL565612,10 1,11 1,19 1,20 1,52 6.9}
{0 CHEMBL572878,10 1,19 1,20 1,22 1,34 1,52 5.297}
{0 CHEMBL572881,10 1,11 1,19 1,52 5}
{0 CHEMBL573339,7 1,14 1,19 1,39 1,52 5}
{0 CHEMBL574738,10 1,11 1,19 1,20 1,34 1,52 5.2}
{0 CHEMBL576982,2 1,3 1,4 1,8 1,10 1,13 1,14 1,16 1,19 1,20 1,52 5}
{0 CHEMBL578061,1 1,10 1,52 5.5}
{0 CHEMBL583144,19 1,27 1,52 5.1}
{0 CHEMBL590109,10 1,19 1,22 1,44 1,47 1,52 5.449}
{0 CHEMBL592030,10 1,19 1,22 1,44 1,47 1,52 6}
{0 CHEMBL601719,7 1,9 1,11 1,19 1,44 1,52 5}
{0 CHEMBL607707,8 1,10 1,11 1,19 1,20 1,52 5}
{0 CHEMBL608154,10 1,11 1,19 1,52 5}
{0 CHEMBL6291,7 1,11 1,19 1,52 8}
{0 CHEMBL7064,3 1,11 1,14 1,19 1,22 1,52 6.4}
{0 CHEMBL91829,7 1,11 1,19 1,20 1,49 1,52 5.551}
{0 CHEMBL939,10 1,19 1,20 1,52 5.4}
{0 CHEMBL941,1 1,7 1,10 1,11 1,14 1,19 1,20 1,52 5.15}
{0 CHEMBL95692,6 1,9 1,14 1,16 1,19 1,52 5.1}
