{
  "data_set_description": {
    "collection_date": "November 2013",
    "creator": "Dr Jeremy Besnard, Dr Ivan Olier, Dr Noureddin Sadawi, Dr Larisa Soldatova, Dr Crina Grosan, Prof Ross King, Dr Richard Bickerton, Prof Andrew Hopkins and Dr Willem van Hoorn",
    "default_target_attribute": "pXC50",
    "description": "This dataset contains QSAR data (from ChEMBL version 17) showing activity values (unit is pseudo-pCI50) of several compounds on drug target ChEMBL_ID: CHEMBL1293259 (TID: 103692), and it has 134 rows and 1322 features (not including molecule IDs and class feature: molecule_id and pXC50). The features represent Molecular Descriptors which were generated from SMILES strings. Missing value imputation was applied to this dataset (By choosing the Median).",
    "description_version": "1",
    "file_id": "3355063",
    "format": "ARFF",
    "id": "28269",
    "licence": "Public",
    "md5_checksum": "c136d28d7414f4950be516aff034fef3",
    "minio_url": "https://data.openml.org/datasets/0002/28269/dataset_28269.pq",
    "name": "QSAR-DATASET-FOR-DRUG-TARGET-CHEMBL1293259",
    "original_data_url": "https://www.ebi.ac.uk/chembl/target/inspect/CHEMBL1293259",
    "parquet_url": "https://data.openml.org/datasets/0002/28269/dataset_28269.pq",
    "processing_date": "2018-10-04 01:08:15",
    "row_id_attribute": "molecule_id",
    "status": "deactivated",
    "tag": [
      "MetaQSAR",
      "study_13"
    ],
    "upload_date": "2016-07-14T23:34:10",
    "url": "https://api.openml.org/data/v1/download/3355063/QSAR-DATASET-FOR-DRUG-TARGET-CHEMBL1293259.arff",
    "version": "8",
    "visibility": "public"
  }
}