{
  "data_features": {
    "feature": [
      {
        "data_type": "nominal",
        "index": "0",
        "is_ignore": "false",
        "is_row_identifier": "true",
        "is_target": "false",
        "name": "molecule_id",
        "nominal_value": [
          "CHEMBL1200847",
          "CHEMBL1300370",
          "CHEMBL1300464",
          "CHEMBL1303150",
          "CHEMBL1303157",
          "CHEMBL1303193",
          "CHEMBL1303198",
          "CHEMBL1303520",
          "CHEMBL1304092",
          "CHEMBL1307036",
          "CHEMBL1307648",
          "CHEMBL1307956",
          "CHEMBL1309404",
          "CHEMBL1309683",
          "CHEMBL1309911",
          "CHEMBL1310269",
          "CHEMBL1310631",
          "CHEMBL1311260",
          "CHEMBL1312377",
          "CHEMBL1313936",
          "CHEMBL1313945",
          "CHEMBL1317867",
          "CHEMBL1318179",
          "CHEMBL1319447",
          "CHEMBL1319456",
          "CHEMBL1322281",
          "CHEMBL1323268",
          "CHEMBL1323828",
          "CHEMBL1324227",
          "CHEMBL1324859",
          "CHEMBL1325286",
          "CHEMBL1325293",
          "CHEMBL1325819",
          "CHEMBL1326748",
          "CHEMBL1327721",
          "CHEMBL1328405",
          "CHEMBL1328741",
          "CHEMBL1330698",
          "CHEMBL1333151",
          "CHEMBL1333238",
          "CHEMBL1333548",
          "CHEMBL1334696",
          "CHEMBL1336930",
          "CHEMBL1337221",
          "CHEMBL1338689",
          "CHEMBL1338930",
          "CHEMBL1339166",
          "CHEMBL1339765",
          "CHEMBL1339921",
          "CHEMBL1340895",
          "CHEMBL1341350",
          "CHEMBL1342485",
          "CHEMBL1342798",
          "CHEMBL1343099",
          "CHEMBL1343780",
          "CHEMBL1344560",
          "CHEMBL1346297",
          "CHEMBL1349690",
          "CHEMBL1350845",
          "CHEMBL1351618",
          "CHEMBL1352343",
          "CHEMBL1352376",
          "CHEMBL1358926",
          "CHEMBL1359137",
          "CHEMBL1360606",
          "CHEMBL1360793",
          "CHEMBL1361805",
          "CHEMBL1362667",
          "CHEMBL1364211",
          "CHEMBL1365068",
          "CHEMBL1366122",
          "CHEMBL1366593",
          "CHEMBL1368671",
          "CHEMBL1369487",
          "CHEMBL1370184",
          "CHEMBL1370456",
          "CHEMBL1371472",
          "CHEMBL1372505",
          "CHEMBL1372792",
          "CHEMBL1374557",
          "CHEMBL1375034",
          "CHEMBL1375292",
          "CHEMBL1375904",
          "CHEMBL1377943",
          "CHEMBL1379877",
          "CHEMBL1379898",
          "CHEMBL1380580",
          "CHEMBL1380676",
          "CHEMBL1381340",
          "CHEMBL1381831",
          "CHEMBL1382001",
          "CHEMBL1382089",
          "CHEMBL1384104",
          "CHEMBL1385897",
          "CHEMBL1386020",
          "CHEMBL1386348",
          "CHEMBL1386658",
          "CHEMBL1386791",
          "CHEMBL1386952",
          "CHEMBL1389733",
          "CHEMBL1389963",
          "CHEMBL1390551",
          "CHEMBL1393284",
          "CHEMBL1393310",
          "CHEMBL1393396",
          "CHEMBL1393520",
          "CHEMBL1394008",
          "CHEMBL1398060",
          "CHEMBL1398190",
          "CHEMBL1400989",
          "CHEMBL1401048",
          "CHEMBL1402103",
          "CHEMBL1402149",
          "CHEMBL1403913",
          "CHEMBL1405172",
          "CHEMBL1405274",
          "CHEMBL1405729",
          "CHEMBL1405900",
          "CHEMBL1406911",
          "CHEMBL1407274",
          "CHEMBL1407873",
          "CHEMBL1408741",
          "CHEMBL1408828",
          "CHEMBL1408986",
          "CHEMBL1409207",
          "CHEMBL1410465",
          "CHEMBL1411354",
          "CHEMBL1411624",
          "CHEMBL1411784",
          "CHEMBL1414655",
          "CHEMBL1416018",
          "CHEMBL1416556",
          "CHEMBL1416570",
          "CHEMBL1417553",
          "CHEMBL1419027",
          "CHEMBL1419680",
          "CHEMBL1419935",
          "CHEMBL1420252",
          "CHEMBL1420548",
          "CHEMBL1421105",
          "CHEMBL1421166",
          "CHEMBL1421207",
          "CHEMBL1421456",
          "CHEMBL1421924",
          "CHEMBL1422285",
          "CHEMBL1422748",
          "CHEMBL1423165",
          "CHEMBL1423797",
          "CHEMBL1423836",
          "CHEMBL1425931",
          "CHEMBL1427044",
          "CHEMBL1428087",
          "CHEMBL1428271",
          "CHEMBL1428589",
          "CHEMBL1429367",
          "CHEMBL1429676",
          "CHEMBL1430935",
          "CHEMBL1431810",
          "CHEMBL1431909",
          "CHEMBL1431919",
          "CHEMBL1432052",
          "CHEMBL1432585",
          "CHEMBL1432696",
          "CHEMBL1439713",
          "CHEMBL1439958",
          "CHEMBL1440463",
          "CHEMBL1441335",
          "CHEMBL1441958",
          "CHEMBL1442704",
          "CHEMBL1443089",
          "CHEMBL1444791",
          "CHEMBL1444979",
          "CHEMBL1445617",
          "CHEMBL1445858",
          "CHEMBL1446234",
          "CHEMBL1446410",
          "CHEMBL1447058",
          "CHEMBL1447988",
          "CHEMBL1451351",
          "CHEMBL1452945",
          "CHEMBL1453623",
          "CHEMBL1454397",
          "CHEMBL1454807",
          "CHEMBL1455044",
          "CHEMBL1456545",
          "CHEMBL1456548",
          "CHEMBL1457252",
          "CHEMBL1457774",
          "CHEMBL1459196",
          "CHEMBL1459316",
          "CHEMBL1459317",
          "CHEMBL1460092",
          "CHEMBL1461287",
          "CHEMBL1462078",
          "CHEMBL1462708",
          "CHEMBL1462918",
          "CHEMBL1463189",
          "CHEMBL1463624",
          "CHEMBL1463714",
          "CHEMBL1465106",
          "CHEMBL1465435",
          "CHEMBL1465727",
          "CHEMBL1466606",
          "CHEMBL1468444",
          "CHEMBL1469032",
          "CHEMBL1469894",
          "CHEMBL1473591",
          "CHEMBL1476029",
          "CHEMBL1477656",
          "CHEMBL1477749",
          "CHEMBL1479103",
          "CHEMBL1480157",
          "CHEMBL1480971",
          "CHEMBL1481671",
          "CHEMBL1481938",
          "CHEMBL1482878",
          "CHEMBL1482959",
          "CHEMBL1483095",
          "CHEMBL1483453",
          "CHEMBL1484293",
          "CHEMBL1484508",
          "CHEMBL1486503",
          "CHEMBL1486531",
          "CHEMBL1487380",
          "CHEMBL1487625",
          "CHEMBL1487912",
          "CHEMBL1487921",
          "CHEMBL1488420",
          "CHEMBL1488551",
          "CHEMBL1490734",
          "CHEMBL1491210",
          "CHEMBL1492158",
          "CHEMBL1492819",
          "CHEMBL1497357",
          "CHEMBL1497574",
          "CHEMBL1497581",
          "CHEMBL1499248",
          "CHEMBL1499361",
          "CHEMBL1499390",
          "CHEMBL1499508",
          "CHEMBL1500423",
          "CHEMBL1500904",
          "CHEMBL1501108",
          "CHEMBL1501146",
          "CHEMBL1502526",
          "CHEMBL1502554",
          "CHEMBL1503442",
          "CHEMBL1503639",
          "CHEMBL1504624",
          "CHEMBL1505608",
          "CHEMBL1505747",
          "CHEMBL1506476",
          "CHEMBL1506849",
          "CHEMBL1508724",
          "CHEMBL1509830",
          "CHEMBL1510614",
          "CHEMBL1512498",
          "CHEMBL1513083",
          "CHEMBL1514705",
          "CHEMBL1516186",
          "CHEMBL1517176",
          "CHEMBL1517376",
          "CHEMBL1518508",
          "CHEMBL1521250",
          "CHEMBL1521461",
          "CHEMBL1522724",
          "CHEMBL1522986",
          "CHEMBL1523044",
          "CHEMBL1523192",
          "CHEMBL1523597",
          "CHEMBL1523652",
          "CHEMBL1524630",
          "CHEMBL1526682",
          "CHEMBL1528991",
          "CHEMBL1529418",
          "CHEMBL1531495",
          "CHEMBL1532662",
          "CHEMBL1532783",
          "CHEMBL1533083",
          "CHEMBL1533337",
          "CHEMBL1534294",
          "CHEMBL1535241",
          "CHEMBL1536490",
          "CHEMBL1537639",
          "CHEMBL1538590",
          "CHEMBL1539384",
          "CHEMBL1539653",
          "CHEMBL1540094",
          "CHEMBL1540841",
          "CHEMBL1542591",
          "CHEMBL1543005",
          "CHEMBL1543229",
          "CHEMBL1543509",
          "CHEMBL1545489",
          "CHEMBL1546706",
          "CHEMBL1546791",
          "CHEMBL1548789",
          "CHEMBL1551560",
          "CHEMBL1553691",
          "CHEMBL1555050",
          "CHEMBL1556750",
          "CHEMBL1557186",
          "CHEMBL1558403",
          "CHEMBL1558832",
          "CHEMBL1558977",
          "CHEMBL1559256",
          "CHEMBL1559324",
          "CHEMBL1561287",
          "CHEMBL1566130",
          "CHEMBL1567518",
          "CHEMBL1567597",
          "CHEMBL1569794",
          "CHEMBL1569865",
          "CHEMBL1570427",
          "CHEMBL1572588",
          "CHEMBL1572627",
          "CHEMBL1572785",
          "CHEMBL1573198",
          "CHEMBL1573304",
          "CHEMBL1573707",
          "CHEMBL1574438",
          "CHEMBL1576364",
          "CHEMBL1576540",
          "CHEMBL1576642",
          "CHEMBL1576646",
          "CHEMBL1576943",
          "CHEMBL1577333",
          "CHEMBL1577981",
          "CHEMBL1578039",
          "CHEMBL1578141",
          "CHEMBL1578178",
          "CHEMBL1578612",
          "CHEMBL1578643",
          "CHEMBL1578806",
          "CHEMBL1579116",
          "CHEMBL1579898",
          "CHEMBL1580198",
          "CHEMBL1580407",
          "CHEMBL1580472",
          "CHEMBL1582131",
          "CHEMBL1582416",
          "CHEMBL1582996",
          "CHEMBL1583067",
          "CHEMBL1583552",
          "CHEMBL1583844",
          "CHEMBL1583907",
          "CHEMBL1584115",
          "CHEMBL1585226",
          "CHEMBL1585764",
          "CHEMBL1587083",
          "CHEMBL1587434",
          "CHEMBL1591513",
          "CHEMBL1594756",
          "CHEMBL1594826",
          "CHEMBL1595871",
          "CHEMBL1595909",
          "CHEMBL1597246",
          "CHEMBL1598441",
          "CHEMBL1598493",
          "CHEMBL1598538",
          "CHEMBL1598745",
          "CHEMBL1599761",
          "CHEMBL1601348",
          "CHEMBL1601846",
          "CHEMBL1602261",
          "CHEMBL1604953",
          "CHEMBL1605363",
          "CHEMBL1605468",
          "CHEMBL1605813",
          "CHEMBL1606773",
          "CHEMBL1608989",
          "CHEMBL1609003",
          "CHEMBL1610395",
          "CHEMBL1610433",
          "CHEMBL1611002",
          "CHEMBL1611662",
          "CHEMBL1612672",
          "CHEMBL1612843",
          "CHEMBL1613256",
          "CHEMBL1697963",
          "CHEMBL1698604",
          "CHEMBL1702248",
          "CHEMBL1702350",
          "CHEMBL1705345",
          "CHEMBL1710856",
          "CHEMBL1713837",
          "CHEMBL1714260",
          "CHEMBL1714498",
          "CHEMBL1720248",
          "CHEMBL1721095",
          "CHEMBL1722129",
          "CHEMBL1723047",
          "CHEMBL1723854",
          "CHEMBL1724655",
          "CHEMBL1727519",
          "CHEMBL1728023",
          "CHEMBL1734383",
          "CHEMBL1863847",
          "CHEMBL1863914",
          "CHEMBL1864111",
          "CHEMBL1866444",
          "CHEMBL1867926",
          "CHEMBL1868381",
          "CHEMBL1868444",
          "CHEMBL1873191",
          "CHEMBL1874087",
          "CHEMBL1875552",
          "CHEMBL1878187",
          "CHEMBL1881583",
          "CHEMBL1883085",
          "CHEMBL1884882",
          "CHEMBL1885064",
          "CHEMBL1885471",
          "CHEMBL1892727",
          "CHEMBL1896512",
          "CHEMBL1897572",
          "CHEMBL1898065",
          "CHEMBL1901790",
          "CHEMBL1902460",
          "CHEMBL1964868",
          "CHEMBL1967726",
          "CHEMBL1970711",
          "CHEMBL1971324",
          "CHEMBL1972014",
          "CHEMBL1973694",
          "CHEMBL1975523",
          "CHEMBL1976280",
          "CHEMBL1976839",
          "CHEMBL1978330",
          "CHEMBL1981303",
          "CHEMBL1981833",
          "CHEMBL1983116",
          "CHEMBL1984348",
          "CHEMBL1984796",
          "CHEMBL1985338",
          "CHEMBL1987483",
          "CHEMBL1991136",
          "CHEMBL1992719",
          "CHEMBL1994266",
          "CHEMBL1995385",
          "CHEMBL1995922",
          "CHEMBL1996363",
          "CHEMBL1997740",
          "CHEMBL1998893",
          "CHEMBL2001481",
          "CHEMBL2003831",
          "CHEMBL2003840",
          "CHEMBL2005703",
          "CHEMBL2007056",
          "CHEMBL240332",
          "CHEMBL268584",
          "CHEMBL41286",
          "CHEMBL428496",
          "CHEMBL457679",
          "CHEMBL481577",
          "CHEMBL495991",
          "CHEMBL505670",
          "CHEMBL512216",
          "CHEMBL518575",
          "CHEMBL521762",
          "CHEMBL538104",
          "CHEMBL584246",
          "CHEMBL600034",
          "CHEMBL66953",
          "CHEMBL69863"
        ],
        "number_of_missing_values": "0"
      },
      {
        "data_type": "numeric",
        "index": "1",
        "is_ignore": "false",
        "is_row_identifier": "false",
        "is_target": "false",
        "name": "AMW",
        "number_of_missing_values": "0"
      },
      {
        "data_type": "numeric",
        "index": "2",
        "is_ignore": "false",
        "is_row_identifier": "false",
        "is_target": "false",
        "name": "C.",
        "number_of_missing_values": "0"
      },
      {
        "data_type": "numeric",
        "index": "3",
        "is_ignore": "false",
        "is_row_identifier": "false",
        "is_target": "false",
        "name": "H.",
        "number_of_missing_values": "0"
      },
      {
        "data_type": "numeric",
        "index": "4",
        "is_ignore": "false",
        "is_row_identifier": "false",
        "is_target": "false",
        "name": "Me",
        "number_of_missing_values": "0"
      },
      {
        "data_type": "numeric",
        "index": "5",
        "is_ignore": "false",
        "is_row_identifier": "false",
        "is_target": "false",
        "name": "Mi",
        "number_of_missing_values": "0"
      },
      {
        "data_type": "numeric",
        "index": "6",
        "is_ignore": "false",
        "is_row_identifier": "false",
        "is_target": "false",
        "name": "Mp",
        "number_of_missing_values": "0"
      },
      {
        "data_type": "numeric",
        "index": "7",
        "is_ignore": "false",
        "is_row_identifier": "false",
        "is_target": "false",
        "name": "Mv",
        "number_of_missing_values": "0"
      },
      {
        "data_type": "numeric",
        "index": "8",
        "is_ignore": "false",
        "is_row_identifier": "false",
        "is_target": "false",
        "name": "MW",
        "number_of_missing_values": "0"
      },
      {
        "data_type": "numeric",
        "index": "9",
        "is_ignore": "false",
        "is_row_identifier": "false",
        "is_target": "false",
        "name": "N.",
        "number_of_missing_values": "0"
      },
      {
        "data_type": "numeric",
        "index": "10",
        "is_ignore": "false",
        "is_row_identifier": "false",
        "is_target": "false",
        "name": "nAB",
        "number_of_missing_values": "0"
      },
      {
        "data_type": "numeric",
        "index": "11",
        "is_ignore": "false",
        "is_row_identifier": "false",
        "is_target": "false",
        "name": "nAT",
        "number_of_missing_values": "0"
      },
      {
        "data_type": "numeric",
        "index": "12",
        "is_ignore": "false",
        "is_row_identifier": "false",
        "is_target": "false",
        "name": "nB",
        "number_of_missing_values": "0"
      },
      {
        "data_type": "numeric",
        "index": "13",
        "is_ignore": "false",
        "is_row_identifier": "false",
        "is_target": "false",
        "name": "nBM",
        "number_of_missing_values": "0"
      },
      {
        "data_type": "numeric",
        "index": "14",
        "is_ignore": "false",
        "is_row_identifier": "false",
        "is_target": "false",
        "name": "nBO",
        "number_of_missing_values": "0"
      },
      {
        "data_type": "numeric",
        "index": "15",
        "is_ignore": "false",
        "is_row_identifier": "false",
        "is_target": "false",
        "name": "nBR",
        "number_of_missing_values": "0"
      },
      {
        "data_type": "numeric",
        "index": "16",
        "is_ignore": "false",
        "is_row_identifier": "false",
        "is_target": "false",
        "name": "nBT",
        "number_of_missing_values": "0"
      },
      {
        "data_type": "numeric",
        "index": "17",
        "is_ignore": "false",
        "is_row_identifier": "false",
        "is_target": "false",
        "name": "nC",
        "number_of_missing_values": "0"
      },
      {
        "data_type": "numeric",
        "index": "18",
        "is_ignore": "false",
        "is_row_identifier": "false",
        "is_target": "false",
        "name": "nCL",
        "number_of_missing_values": "0"
      },
      {
        "data_type": "numeric",
        "index": "19",
        "is_ignore": "false",
        "is_row_identifier": "false",
        "is_target": "false",
        "name": "nCsp",
        "number_of_missing_values": "0"
      },
      {
        "data_type": "numeric",
        "index": "20",
        "is_ignore": "false",
        "is_row_identifier": "false",
        "is_target": "false",
        "name": "nCsp2",
        "number_of_missing_values": "0"
      },
      {
        "data_type": "numeric",
        "index": "21",
        "is_ignore": "false",
        "is_row_identifier": "false",
        "is_target": "false",
        "name": "nCsp3",
        "number_of_missing_values": "0"
      },
      {
        "data_type": "numeric",
        "index": "22",
        "is_ignore": "false",
        "is_row_identifier": "false",
        "is_target": "false",
        "name": "nDB",
        "number_of_missing_values": "0"
      },
      {
        "data_type": "numeric",
        "index": "23",
        "is_ignore": "false",
        "is_row_identifier": "false",
        "is_target": "false",
        "name": "nF",
        "number_of_missing_values": "0"
      },
      {
        "data_type": "numeric",
        "index": "24",
        "is_ignore": "false",
        "is_row_identifier": "false",
        "is_target": "false",
        "name": "nH",
        "number_of_missing_values": "0"
      },
      {
        "data_type": "numeric",
        "index": "25",
        "is_ignore": "false",
        "is_row_identifier": "false",
        "is_target": "false",
        "name": "nHet",
        "number_of_missing_values": "0"
      },
      {
        "data_type": "numeric",
        "index": "26",
        "is_ignore": "false",
        "is_row_identifier": "false",
        "is_target": "false",
        "name": "nHM",
        "number_of_missing_values": "0"
      },
      {
        "data_type": "numeric",
        "index": "27",
        "is_ignore": "false",
        "is_row_identifier": "false",
        "is_target": "false",
        "name": "nI",
        "number_of_missing_values": "0"
      },
      {
        "data_type": "numeric",
        "index": "28",
        "is_ignore": "false",
        "is_row_identifier": "false",
        "is_target": "false",
        "name": "nN",
        "number_of_missing_values": "0"
      },
      {
        "data_type": "numeric",
        "index": "29",
        "is_ignore": "false",
        "is_row_identifier": "false",
        "is_target": "false",
        "name": "nO",
        "number_of_missing_values": "0"
      },
      {
        "data_type": "numeric",
        "index": "30",
        "is_ignore": "false",
        "is_row_identifier": "false",
        "is_target": "false",
        "name": "nP",
        "number_of_missing_values": "0"
      },
      {
        "data_type": "numeric",
        "index": "31",
        "is_ignore": "false",
        "is_row_identifier": "false",
        "is_target": "false",
        "name": "nS",
        "number_of_missing_values": "0"
      },
      {
        "data_type": "numeric",
        "index": "32",
        "is_ignore": "false",
        "is_row_identifier": "false",
        "is_target": "false",
        "name": "nSK",
        "number_of_missing_values": "0"
      },
      {
        "data_type": "numeric",
        "index": "33",
        "is_ignore": "false",
        "is_row_identifier": "false",
        "is_target": "false",
        "name": "nTB",
        "number_of_missing_values": "0"
      },
      {
        "data_type": "numeric",
        "index": "34",
        "is_ignore": "false",
        "is_row_identifier": "false",
        "is_target": "false",
        "name": "nX",
        "number_of_missing_values": "0"
      },
      {
        "data_type": "numeric",
        "index": "35",
        "is_ignore": "false",
        "is_row_identifier": "false",
        "is_target": "false",
        "name": "O.",
        "number_of_missing_values": "0"
      },
      {
        "data_type": "numeric",
        "index": "36",
        "is_ignore": "false",
        "is_row_identifier": "false",
        "is_target": "false",
        "name": "RBF",
        "number_of_missing_values": "0"
      },
      {
        "data_type": "numeric",
        "index": "37",
        "is_ignore": "false",
        "is_row_identifier": "false",
        "is_target": "false",
        "name": "RBN",
        "number_of_missing_values": "0"
      },
      {
        "data_type": "numeric",
        "index": "38",
        "is_ignore": "false",
        "is_row_identifier": "false",
        "is_target": "false",
        "name": "SCBO",
        "number_of_missing_values": "0"
      },
      {
        "data_type": "numeric",
        "index": "39",
        "is_ignore": "false",
        "is_row_identifier": "false",
        "is_target": "false",
        "name": "Se",
        "number_of_missing_values": "0"
      },
      {
        "data_type": "numeric",
        "index": "40",
        "is_ignore": "false",
        "is_row_identifier": "false",
        "is_target": "false",
        "name": "Si",
        "number_of_missing_values": "0"
      },
      {
        "data_type": "numeric",
        "index": "41",
        "is_ignore": "false",
        "is_row_identifier": "false",
        "is_target": "false",
        "name": "Sp",
        "number_of_missing_values": "0"
      },
      {
        "data_type": "numeric",
        "index": "42",
        "is_ignore": "false",
        "is_row_identifier": "false",
        "is_target": "false",
        "name": "Sv",
        "number_of_missing_values": "0"
      },
      {
        "data_type": "numeric",
        "index": "43",
        "is_ignore": "false",
        "is_row_identifier": "false",
        "is_target": "false",
        "name": "X.",
        "number_of_missing_values": "0"
      },
      {
        "data_type": "numeric",
        "index": "44",
        "is_ignore": "false",
        "is_row_identifier": "false",
        "is_target": "true",
        "name": "pXC50",
        "number_of_missing_values": "0"
      }
    ]
  }
}