{
  "data_features": {
    "feature": [
      {
        "data_type": "nominal",
        "index": "0",
        "is_ignore": "false",
        "is_row_identifier": "true",
        "is_target": "false",
        "name": "molecule_id",
        "nominal_value": [
          "CHEMBL1159913",
          "CHEMBL1649588",
          "CHEMBL1649949",
          "CHEMBL1649950",
          "CHEMBL1649951",
          "CHEMBL1649952",
          "CHEMBL1649953",
          "CHEMBL1649954",
          "CHEMBL1649955",
          "CHEMBL1649956",
          "CHEMBL1649957",
          "CHEMBL1649958",
          "CHEMBL1649959",
          "CHEMBL1649960",
          "CHEMBL1649961",
          "CHEMBL1649962",
          "CHEMBL1649963",
          "CHEMBL1649964",
          "CHEMBL1649965",
          "CHEMBL1649966",
          "CHEMBL1649967",
          "CHEMBL1649968",
          "CHEMBL1649969",
          "CHEMBL1649970",
          "CHEMBL1649971",
          "CHEMBL1649972",
          "CHEMBL1649973",
          "CHEMBL1649974",
          "CHEMBL1649975",
          "CHEMBL1649976",
          "CHEMBL1926706",
          "CHEMBL1928731",
          "CHEMBL1928732",
          "CHEMBL1928733",
          "CHEMBL1928734",
          "CHEMBL1928735",
          "CHEMBL1928736",
          "CHEMBL1928737",
          "CHEMBL1928738",
          "CHEMBL1928739",
          "CHEMBL1928740",
          "CHEMBL1928741",
          "CHEMBL1928742",
          "CHEMBL1928743",
          "CHEMBL1928744",
          "CHEMBL1928745",
          "CHEMBL1928746",
          "CHEMBL1939498",
          "CHEMBL219714",
          "CHEMBL222720",
          "CHEMBL222899",
          "CHEMBL223199",
          "CHEMBL223743",
          "CHEMBL27850",
          "CHEMBL27914",
          "CHEMBL28016",
          "CHEMBL281450",
          "CHEMBL283017",
          "CHEMBL283230",
          "CHEMBL285370",
          "CHEMBL28549",
          "CHEMBL285592",
          "CHEMBL28570",
          "CHEMBL28577",
          "CHEMBL28601",
          "CHEMBL286706",
          "CHEMBL28746",
          "CHEMBL287626",
          "CHEMBL29022",
          "CHEMBL29023",
          "CHEMBL29220",
          "CHEMBL29256",
          "CHEMBL29279",
          "CHEMBL29396",
          "CHEMBL29958",
          "CHEMBL29964",
          "CHEMBL376472",
          "CHEMBL416203",
          "CHEMBL418388",
          "CHEMBL87351"
        ],
        "number_of_missing_values": "0"
      },
      {
        "data_type": "numeric",
        "index": "1",
        "is_ignore": "false",
        "is_row_identifier": "false",
        "is_target": "false",
        "name": "nN",
        "number_of_missing_values": "0"
      },
      {
        "data_type": "numeric",
        "index": "2",
        "is_ignore": "false",
        "is_row_identifier": "false",
        "is_target": "false",
        "name": "nO",
        "number_of_missing_values": "0"
      },
      {
        "data_type": "numeric",
        "index": "3",
        "is_ignore": "false",
        "is_row_identifier": "false",
        "is_target": "false",
        "name": "O.",
        "number_of_missing_values": "0"
      },
      {
        "data_type": "numeric",
        "index": "4",
        "is_ignore": "false",
        "is_row_identifier": "false",
        "is_target": "false",
        "name": "Mp",
        "number_of_missing_values": "0"
      },
      {
        "data_type": "numeric",
        "index": "5",
        "is_ignore": "false",
        "is_row_identifier": "false",
        "is_target": "false",
        "name": "nDB",
        "number_of_missing_values": "0"
      },
      {
        "data_type": "numeric",
        "index": "6",
        "is_ignore": "false",
        "is_row_identifier": "false",
        "is_target": "false",
        "name": "nAB",
        "number_of_missing_values": "0"
      },
      {
        "data_type": "numeric",
        "index": "7",
        "is_ignore": "false",
        "is_row_identifier": "false",
        "is_target": "false",
        "name": "nBM",
        "number_of_missing_values": "0"
      },
      {
        "data_type": "numeric",
        "index": "8",
        "is_ignore": "false",
        "is_row_identifier": "false",
        "is_target": "false",
        "name": "RBF",
        "number_of_missing_values": "0"
      },
      {
        "data_type": "numeric",
        "index": "9",
        "is_ignore": "false",
        "is_row_identifier": "false",
        "is_target": "false",
        "name": "N.",
        "number_of_missing_values": "0"
      },
      {
        "data_type": "numeric",
        "index": "10",
        "is_ignore": "false",
        "is_row_identifier": "false",
        "is_target": "false",
        "name": "SCBO",
        "number_of_missing_values": "0"
      },
      {
        "data_type": "numeric",
        "index": "11",
        "is_ignore": "false",
        "is_row_identifier": "false",
        "is_target": "false",
        "name": "MW",
        "number_of_missing_values": "0"
      },
      {
        "data_type": "numeric",
        "index": "12",
        "is_ignore": "false",
        "is_row_identifier": "false",
        "is_target": "false",
        "name": "nCL",
        "number_of_missing_values": "0"
      },
      {
        "data_type": "numeric",
        "index": "13",
        "is_ignore": "false",
        "is_row_identifier": "false",
        "is_target": "false",
        "name": "C.",
        "number_of_missing_values": "0"
      },
      {
        "data_type": "numeric",
        "index": "14",
        "is_ignore": "false",
        "is_row_identifier": "false",
        "is_target": "false",
        "name": "RBN",
        "number_of_missing_values": "0"
      },
      {
        "data_type": "numeric",
        "index": "15",
        "is_ignore": "false",
        "is_row_identifier": "false",
        "is_target": "false",
        "name": "nAT",
        "number_of_missing_values": "0"
      },
      {
        "data_type": "numeric",
        "index": "16",
        "is_ignore": "false",
        "is_row_identifier": "false",
        "is_target": "false",
        "name": "nBT",
        "number_of_missing_values": "0"
      },
      {
        "data_type": "numeric",
        "index": "17",
        "is_ignore": "false",
        "is_row_identifier": "false",
        "is_target": "false",
        "name": "nHet",
        "number_of_missing_values": "0"
      },
      {
        "data_type": "numeric",
        "index": "18",
        "is_ignore": "false",
        "is_row_identifier": "false",
        "is_target": "true",
        "name": "pXC50",
        "number_of_missing_values": "0"
      }
    ]
  }
}