{
  "data_features": {
    "feature": [
      {
        "data_type": "nominal",
        "index": "0",
        "is_ignore": "false",
        "is_row_identifier": "true",
        "is_target": "false",
        "name": "molecule_id",
        "nominal_value": [
          "CHEMBL100872",
          "CHEMBL101891",
          "CHEMBL1082392",
          "CHEMBL1082629",
          "CHEMBL1082704",
          "CHEMBL1083017",
          "CHEMBL1083642",
          "CHEMBL1083643",
          "CHEMBL1083942",
          "CHEMBL1083943",
          "CHEMBL1084228",
          "CHEMBL1084229",
          "CHEMBL1084327",
          "CHEMBL1084328",
          "CHEMBL1084761",
          "CHEMBL1084762",
          "CHEMBL1085002",
          "CHEMBL1085086",
          "CHEMBL1086237",
          "CHEMBL113736",
          "CHEMBL113762",
          "CHEMBL114226",
          "CHEMBL114271",
          "CHEMBL114731",
          "CHEMBL114846",
          "CHEMBL114858",
          "CHEMBL114950",
          "CHEMBL115045",
          "CHEMBL115341",
          "CHEMBL115395",
          "CHEMBL115441",
          "CHEMBL115651",
          "CHEMBL117483",
          "CHEMBL118326",
          "CHEMBL118333",
          "CHEMBL118451",
          "CHEMBL118615",
          "CHEMBL118643",
          "CHEMBL119200",
          "CHEMBL119367",
          "CHEMBL119755",
          "CHEMBL119761",
          "CHEMBL1234956",
          "CHEMBL130055",
          "CHEMBL130667",
          "CHEMBL131644",
          "CHEMBL132191",
          "CHEMBL132201",
          "CHEMBL132430",
          "CHEMBL132640",
          "CHEMBL133109",
          "CHEMBL133114",
          "CHEMBL133274",
          "CHEMBL133603",
          "CHEMBL133745",
          "CHEMBL133832",
          "CHEMBL133911",
          "CHEMBL133923",
          "CHEMBL134152",
          "CHEMBL134793",
          "CHEMBL134797",
          "CHEMBL134802",
          "CHEMBL134854",
          "CHEMBL136168",
          "CHEMBL136182",
          "CHEMBL136188",
          "CHEMBL136218",
          "CHEMBL136241",
          "CHEMBL136295",
          "CHEMBL136327",
          "CHEMBL136418",
          "CHEMBL136506",
          "CHEMBL136567",
          "CHEMBL136572",
          "CHEMBL136573",
          "CHEMBL136655",
          "CHEMBL136712",
          "CHEMBL136812",
          "CHEMBL136864",
          "CHEMBL137196",
          "CHEMBL137231",
          "CHEMBL138069",
          "CHEMBL138822",
          "CHEMBL138874",
          "CHEMBL139461",
          "CHEMBL139472",
          "CHEMBL139581",
          "CHEMBL178160",
          "CHEMBL178171",
          "CHEMBL178173",
          "CHEMBL178181",
          "CHEMBL178212",
          "CHEMBL178253",
          "CHEMBL178256",
          "CHEMBL178288",
          "CHEMBL178357",
          "CHEMBL178386",
          "CHEMBL178497",
          "CHEMBL178524",
          "CHEMBL178555",
          "CHEMBL178569",
          "CHEMBL178586",
          "CHEMBL178648",
          "CHEMBL178699",
          "CHEMBL178752",
          "CHEMBL178906",
          "CHEMBL179127",
          "CHEMBL179132",
          "CHEMBL179368",
          "CHEMBL179438",
          "CHEMBL179439",
          "CHEMBL179485",
          "CHEMBL179486",
          "CHEMBL179563",
          "CHEMBL179564",
          "CHEMBL179609",
          "CHEMBL179764",
          "CHEMBL180652",
          "CHEMBL180654",
          "CHEMBL180666",
          "CHEMBL180757",
          "CHEMBL180775",
          "CHEMBL180776",
          "CHEMBL180881",
          "CHEMBL180914",
          "CHEMBL180915",
          "CHEMBL180985",
          "CHEMBL181023",
          "CHEMBL181072",
          "CHEMBL181081",
          "CHEMBL181117",
          "CHEMBL181228",
          "CHEMBL181326",
          "CHEMBL181380",
          "CHEMBL181386",
          "CHEMBL181455",
          "CHEMBL181456",
          "CHEMBL181473",
          "CHEMBL181553",
          "CHEMBL181626",
          "CHEMBL181723",
          "CHEMBL181737",
          "CHEMBL181844",
          "CHEMBL181876",
          "CHEMBL181893",
          "CHEMBL181996",
          "CHEMBL182204",
          "CHEMBL182205",
          "CHEMBL182238",
          "CHEMBL182239",
          "CHEMBL194537",
          "CHEMBL194839",
          "CHEMBL194840",
          "CHEMBL194893",
          "CHEMBL195724",
          "CHEMBL196013",
          "CHEMBL196014",
          "CHEMBL196330",
          "CHEMBL196630",
          "CHEMBL196678",
          "CHEMBL196679",
          "CHEMBL196785",
          "CHEMBL196993",
          "CHEMBL197090",
          "CHEMBL197259",
          "CHEMBL197662",
          "CHEMBL197722",
          "CHEMBL197901",
          "CHEMBL197997",
          "CHEMBL198009",
          "CHEMBL198149",
          "CHEMBL198202",
          "CHEMBL198229",
          "CHEMBL198381",
          "CHEMBL198392",
          "CHEMBL198394",
          "CHEMBL198408",
          "CHEMBL198770",
          "CHEMBL199086",
          "CHEMBL199099",
          "CHEMBL2030480",
          "CHEMBL2030482",
          "CHEMBL206468",
          "CHEMBL213661",
          "CHEMBL215137",
          "CHEMBL217903",
          "CHEMBL217956",
          "CHEMBL217993",
          "CHEMBL217994",
          "CHEMBL218162",
          "CHEMBL218287",
          "CHEMBL218462",
          "CHEMBL218492",
          "CHEMBL218712",
          "CHEMBL218714",
          "CHEMBL219059",
          "CHEMBL219730",
          "CHEMBL220126",
          "CHEMBL220177",
          "CHEMBL220178",
          "CHEMBL220953",
          "CHEMBL220954",
          "CHEMBL220976",
          "CHEMBL221226",
          "CHEMBL221442",
          "CHEMBL222125",
          "CHEMBL222126",
          "CHEMBL222729",
          "CHEMBL222953",
          "CHEMBL223087",
          "CHEMBL223536",
          "CHEMBL223676",
          "CHEMBL231835",
          "CHEMBL231836",
          "CHEMBL232432",
          "CHEMBL232433",
          "CHEMBL232626",
          "CHEMBL232627",
          "CHEMBL232628",
          "CHEMBL232698",
          "CHEMBL232829",
          "CHEMBL232830",
          "CHEMBL233033",
          "CHEMBL233034",
          "CHEMBL233035",
          "CHEMBL233238",
          "CHEMBL233239",
          "CHEMBL233240",
          "CHEMBL233445",
          "CHEMBL233446",
          "CHEMBL233447",
          "CHEMBL233656",
          "CHEMBL233657",
          "CHEMBL233658",
          "CHEMBL234950",
          "CHEMBL234951",
          "CHEMBL234952",
          "CHEMBL242918",
          "CHEMBL243412",
          "CHEMBL245060",
          "CHEMBL264201",
          "CHEMBL316488",
          "CHEMBL316598",
          "CHEMBL317026",
          "CHEMBL317410",
          "CHEMBL317861",
          "CHEMBL318910",
          "CHEMBL319136",
          "CHEMBL319152",
          "CHEMBL319165",
          "CHEMBL319736",
          "CHEMBL319854",
          "CHEMBL323569",
          "CHEMBL323707",
          "CHEMBL324266",
          "CHEMBL324357",
          "CHEMBL324770",
          "CHEMBL326611",
          "CHEMBL326810",
          "CHEMBL326950",
          "CHEMBL327504",
          "CHEMBL329493",
          "CHEMBL331056",
          "CHEMBL331057",
          "CHEMBL331752",
          "CHEMBL332629",
          "CHEMBL333866",
          "CHEMBL334272",
          "CHEMBL335577",
          "CHEMBL335954",
          "CHEMBL337012",
          "CHEMBL337224",
          "CHEMBL337332",
          "CHEMBL337378",
          "CHEMBL342032",
          "CHEMBL342364",
          "CHEMBL342601",
          "CHEMBL342664",
          "CHEMBL342880",
          "CHEMBL344170",
          "CHEMBL359658",
          "CHEMBL359689",
          "CHEMBL359735",
          "CHEMBL360236",
          "CHEMBL360287",
          "CHEMBL360993",
          "CHEMBL361006",
          "CHEMBL361133",
          "CHEMBL361389",
          "CHEMBL361555",
          "CHEMBL361645",
          "CHEMBL361767",
          "CHEMBL361780",
          "CHEMBL361860",
          "CHEMBL361998",
          "CHEMBL362440",
          "CHEMBL362806",
          "CHEMBL362828",
          "CHEMBL365785",
          "CHEMBL367799",
          "CHEMBL370119",
          "CHEMBL370635",
          "CHEMBL370848",
          "CHEMBL372113",
          "CHEMBL372673",
          "CHEMBL373238",
          "CHEMBL373506",
          "CHEMBL373748",
          "CHEMBL373749",
          "CHEMBL373842",
          "CHEMBL373869",
          "CHEMBL374136",
          "CHEMBL374945",
          "CHEMBL375397",
          "CHEMBL375832",
          "CHEMBL376433",
          "CHEMBL381443",
          "CHEMBL381870",
          "CHEMBL382298",
          "CHEMBL382713",
          "CHEMBL382726",
          "CHEMBL383387",
          "CHEMBL386015",
          "CHEMBL387096",
          "CHEMBL390701",
          "CHEMBL394526",
          "CHEMBL394527",
          "CHEMBL395707",
          "CHEMBL395708",
          "CHEMBL395732",
          "CHEMBL395733",
          "CHEMBL395955",
          "CHEMBL396576",
          "CHEMBL396724",
          "CHEMBL397192",
          "CHEMBL397688",
          "CHEMBL398159",
          "CHEMBL414851",
          "CHEMBL422632",
          "CHEMBL423509",
          "CHEMBL425284",
          "CHEMBL425526",
          "CHEMBL427311",
          "CHEMBL430503",
          "CHEMBL431463",
          "CHEMBL433766",
          "CHEMBL433950",
          "CHEMBL434946",
          "CHEMBL440528",
          "CHEMBL442404",
          "CHEMBL443938",
          "CHEMBL444029",
          "CHEMBL444032",
          "CHEMBL449986",
          "CHEMBL451625",
          "CHEMBL452026",
          "CHEMBL452276",
          "CHEMBL452277",
          "CHEMBL452278",
          "CHEMBL452792",
          "CHEMBL453049",
          "CHEMBL453311",
          "CHEMBL453312",
          "CHEMBL453580",
          "CHEMBL455988",
          "CHEMBL457029",
          "CHEMBL457643",
          "CHEMBL457650",
          "CHEMBL457860",
          "CHEMBL457861",
          "CHEMBL457877",
          "CHEMBL457878",
          "CHEMBL458091",
          "CHEMBL458092",
          "CHEMBL458289",
          "CHEMBL458655",
          "CHEMBL459139",
          "CHEMBL459443",
          "CHEMBL459792",
          "CHEMBL459858",
          "CHEMBL459864",
          "CHEMBL460058",
          "CHEMBL460059",
          "CHEMBL460064",
          "CHEMBL460877",
          "CHEMBL460878",
          "CHEMBL461500",
          "CHEMBL461501",
          "CHEMBL469700",
          "CHEMBL470490",
          "CHEMBL471266",
          "CHEMBL471372",
          "CHEMBL471373",
          "CHEMBL471378",
          "CHEMBL471379",
          "CHEMBL471469",
          "CHEMBL471491",
          "CHEMBL471752",
          "CHEMBL472140",
          "CHEMBL472292",
          "CHEMBL472319",
          "CHEMBL473421",
          "CHEMBL473422",
          "CHEMBL473486",
          "CHEMBL473643",
          "CHEMBL473718",
          "CHEMBL473828",
          "CHEMBL473850",
          "CHEMBL473851",
          "CHEMBL473852",
          "CHEMBL473918",
          "CHEMBL473919",
          "CHEMBL474098",
          "CHEMBL474193",
          "CHEMBL474297",
          "CHEMBL474298",
          "CHEMBL474518",
          "CHEMBL474519",
          "CHEMBL474520",
          "CHEMBL474705",
          "CHEMBL474706",
          "CHEMBL475217",
          "CHEMBL475378",
          "CHEMBL475448",
          "CHEMBL475449",
          "CHEMBL475508",
          "CHEMBL475639",
          "CHEMBL475764",
          "CHEMBL475765",
          "CHEMBL475766",
          "CHEMBL475807",
          "CHEMBL475822",
          "CHEMBL475833",
          "CHEMBL475834",
          "CHEMBL479728",
          "CHEMBL479920",
          "CHEMBL480195",
          "CHEMBL480367",
          "CHEMBL480368",
          "CHEMBL480732",
          "CHEMBL480733",
          "CHEMBL480764",
          "CHEMBL480765",
          "CHEMBL481335",
          "CHEMBL481336",
          "CHEMBL481363",
          "CHEMBL481493",
          "CHEMBL481507",
          "CHEMBL481534",
          "CHEMBL481535",
          "CHEMBL481887",
          "CHEMBL482146",
          "CHEMBL482147",
          "CHEMBL487421",
          "CHEMBL488273",
          "CHEMBL488274",
          "CHEMBL488450",
          "CHEMBL488451",
          "CHEMBL489798",
          "CHEMBL489872",
          "CHEMBL493194",
          "CHEMBL493218",
          "CHEMBL494020",
          "CHEMBL494036",
          "CHEMBL494037",
          "CHEMBL494377",
          "CHEMBL494435",
          "CHEMBL494436",
          "CHEMBL494810",
          "CHEMBL494811",
          "CHEMBL494812",
          "CHEMBL494980",
          "CHEMBL494987",
          "CHEMBL495218",
          "CHEMBL495383",
          "CHEMBL495384",
          "CHEMBL496723",
          "CHEMBL496929",
          "CHEMBL505339",
          "CHEMBL506011",
          "CHEMBL507504",
          "CHEMBL507762",
          "CHEMBL508123",
          "CHEMBL508691",
          "CHEMBL508747",
          "CHEMBL511305",
          "CHEMBL512357",
          "CHEMBL512527",
          "CHEMBL512725",
          "CHEMBL513263",
          "CHEMBL513400",
          "CHEMBL516038",
          "CHEMBL516081",
          "CHEMBL516221",
          "CHEMBL516369",
          "CHEMBL516918",
          "CHEMBL516945",
          "CHEMBL517112",
          "CHEMBL517728",
          "CHEMBL517736",
          "CHEMBL519787",
          "CHEMBL519796",
          "CHEMBL519942",
          "CHEMBL520765",
          "CHEMBL522200",
          "CHEMBL522706",
          "CHEMBL522880",
          "CHEMBL523215",
          "CHEMBL80254",
          "CHEMBL98283",
          "CHEMBL98339",
          "CHEMBL98496",
          "CHEMBL98891",
          "CHEMBL99379",
          "CHEMBL99556",
          "CHEMBL99597",
          "CHEMBL99889"
        ],
        "number_of_missing_values": "0"
      },
      {
        "data_type": "numeric",
        "index": "1",
        "is_ignore": "false",
        "is_row_identifier": "false",
        "is_target": "false",
        "name": "H.",
        "number_of_missing_values": "0"
      },
      {
        "data_type": "numeric",
        "index": "2",
        "is_ignore": "false",
        "is_row_identifier": "false",
        "is_target": "false",
        "name": "Mv",
        "number_of_missing_values": "0"
      },
      {
        "data_type": "numeric",
        "index": "3",
        "is_ignore": "false",
        "is_row_identifier": "false",
        "is_target": "false",
        "name": "Me",
        "number_of_missing_values": "0"
      },
      {
        "data_type": "numeric",
        "index": "4",
        "is_ignore": "false",
        "is_row_identifier": "false",
        "is_target": "false",
        "name": "Si",
        "number_of_missing_values": "0"
      },
      {
        "data_type": "numeric",
        "index": "5",
        "is_ignore": "false",
        "is_row_identifier": "false",
        "is_target": "false",
        "name": "AMW",
        "number_of_missing_values": "0"
      },
      {
        "data_type": "numeric",
        "index": "6",
        "is_ignore": "false",
        "is_row_identifier": "false",
        "is_target": "false",
        "name": "nH",
        "number_of_missing_values": "0"
      },
      {
        "data_type": "numeric",
        "index": "7",
        "is_ignore": "false",
        "is_row_identifier": "false",
        "is_target": "false",
        "name": "Se",
        "number_of_missing_values": "0"
      },
      {
        "data_type": "numeric",
        "index": "8",
        "is_ignore": "false",
        "is_row_identifier": "false",
        "is_target": "false",
        "name": "nBT",
        "number_of_missing_values": "0"
      },
      {
        "data_type": "numeric",
        "index": "9",
        "is_ignore": "false",
        "is_row_identifier": "false",
        "is_target": "false",
        "name": "nAT",
        "number_of_missing_values": "0"
      },
      {
        "data_type": "numeric",
        "index": "10",
        "is_ignore": "false",
        "is_row_identifier": "false",
        "is_target": "false",
        "name": "nCL",
        "number_of_missing_values": "0"
      },
      {
        "data_type": "numeric",
        "index": "11",
        "is_ignore": "false",
        "is_row_identifier": "false",
        "is_target": "false",
        "name": "C.",
        "number_of_missing_values": "0"
      },
      {
        "data_type": "numeric",
        "index": "12",
        "is_ignore": "false",
        "is_row_identifier": "false",
        "is_target": "false",
        "name": "Mi",
        "number_of_missing_values": "0"
      },
      {
        "data_type": "numeric",
        "index": "13",
        "is_ignore": "false",
        "is_row_identifier": "false",
        "is_target": "false",
        "name": "Mp",
        "number_of_missing_values": "0"
      },
      {
        "data_type": "numeric",
        "index": "14",
        "is_ignore": "false",
        "is_row_identifier": "false",
        "is_target": "false",
        "name": "MW",
        "number_of_missing_values": "0"
      },
      {
        "data_type": "numeric",
        "index": "15",
        "is_ignore": "false",
        "is_row_identifier": "false",
        "is_target": "false",
        "name": "N.",
        "number_of_missing_values": "0"
      },
      {
        "data_type": "numeric",
        "index": "16",
        "is_ignore": "false",
        "is_row_identifier": "false",
        "is_target": "false",
        "name": "nAB",
        "number_of_missing_values": "0"
      },
      {
        "data_type": "numeric",
        "index": "17",
        "is_ignore": "false",
        "is_row_identifier": "false",
        "is_target": "false",
        "name": "nB",
        "number_of_missing_values": "0"
      },
      {
        "data_type": "numeric",
        "index": "18",
        "is_ignore": "false",
        "is_row_identifier": "false",
        "is_target": "false",
        "name": "nBM",
        "number_of_missing_values": "0"
      },
      {
        "data_type": "numeric",
        "index": "19",
        "is_ignore": "false",
        "is_row_identifier": "false",
        "is_target": "false",
        "name": "nBO",
        "number_of_missing_values": "0"
      },
      {
        "data_type": "numeric",
        "index": "20",
        "is_ignore": "false",
        "is_row_identifier": "false",
        "is_target": "false",
        "name": "nBR",
        "number_of_missing_values": "0"
      },
      {
        "data_type": "numeric",
        "index": "21",
        "is_ignore": "false",
        "is_row_identifier": "false",
        "is_target": "false",
        "name": "nC",
        "number_of_missing_values": "0"
      },
      {
        "data_type": "numeric",
        "index": "22",
        "is_ignore": "false",
        "is_row_identifier": "false",
        "is_target": "false",
        "name": "nCsp",
        "number_of_missing_values": "0"
      },
      {
        "data_type": "numeric",
        "index": "23",
        "is_ignore": "false",
        "is_row_identifier": "false",
        "is_target": "false",
        "name": "nCsp2",
        "number_of_missing_values": "0"
      },
      {
        "data_type": "numeric",
        "index": "24",
        "is_ignore": "false",
        "is_row_identifier": "false",
        "is_target": "false",
        "name": "nCsp3",
        "number_of_missing_values": "0"
      },
      {
        "data_type": "numeric",
        "index": "25",
        "is_ignore": "false",
        "is_row_identifier": "false",
        "is_target": "false",
        "name": "nDB",
        "number_of_missing_values": "0"
      },
      {
        "data_type": "numeric",
        "index": "26",
        "is_ignore": "false",
        "is_row_identifier": "false",
        "is_target": "false",
        "name": "nF",
        "number_of_missing_values": "0"
      },
      {
        "data_type": "numeric",
        "index": "27",
        "is_ignore": "false",
        "is_row_identifier": "false",
        "is_target": "false",
        "name": "nHet",
        "number_of_missing_values": "0"
      },
      {
        "data_type": "numeric",
        "index": "28",
        "is_ignore": "false",
        "is_row_identifier": "false",
        "is_target": "false",
        "name": "nHM",
        "number_of_missing_values": "0"
      },
      {
        "data_type": "numeric",
        "index": "29",
        "is_ignore": "false",
        "is_row_identifier": "false",
        "is_target": "true",
        "name": "pXC50",
        "number_of_missing_values": "0"
      }
    ]
  }
}