{
  "data_set_description": {
    "collection_date": "November 2013",
    "creator": "Dr Jeremy Besnard, Dr Ivan Olier, Dr Noureddin Sadawi, Dr Larisa Soldatova, Dr Crina Grosan, Prof Ross King, Dr Richard Bickerton, Prof Andrew Hopkins and Dr Willem van Hoorn",
    "default_target_attribute": "pXC50",
    "description": "This dataset contains QSAR data (from ChEMBL version 17) showing activity values (unit is pseudo-pCI50) of several compounds on drug target ChEMBL_ID: CHEMBL220 (TID: 93), and it has 2604 rows and 43 features (not including molecule IDs and class feature: molecule_id and pXC50). The features represent Basic Molecular Descriptors which were generated from SMILES strings.  Missing value imputation was applied to this dataset (By choosing the Median).",
    "description_version": "1",
    "file_id": "3352736",
    "format": "ARFF",
    "id": "28204",
    "licence": "Public",
    "md5_checksum": "9db1d566ce58b27ce0c0137691faa70f",
    "minio_url": "https://data.openml.org/datasets/0002/28204/dataset_28204.pq",
    "name": "QSAR-DATASET-FOR-DRUG-TARGET-CHEMBL220",
    "original_data_url": "https://www.ebi.ac.uk/chembl/target/inspect/CHEMBL220",
    "parquet_url": "https://data.openml.org/datasets/0002/28204/dataset_28204.pq",
    "processing_date": "2018-10-04 00:41:07",
    "row_id_attribute": "molecule_id",
    "status": "deactivated",
    "tag": [
      "MetaQSAR",
      "study_13"
    ],
    "upload_date": "2016-07-14T23:24:19",
    "url": "https://api.openml.org/data/v1/download/3352736/QSAR-DATASET-FOR-DRUG-TARGET-CHEMBL220.arff",
    "version": "8",
    "visibility": "public"
  }
}