"molecule_id","Sp","nH","nBO","MW","nBT","O.","nBM","nAB","SCBO","nSK","RBN","Sv","nCsp2","nCsp3","nC","pXC50"
{1 39.784,2 20,3 40,4 484.56,5 60,6 9.1,7 22,8 17,9 53.5,10 35,11 5,12 38.545,13 23,14 4,15 27,16 4.394}
{0 CHEMBL1094172,1 42.091,2 22,3 41,4 494.6,5 63,6 6.9,7 23,8 18,9 55,10 36,11 5,12 40.357,13 25,14 4,15 29,16 4.987}
{0 CHEMBL1094250,1 62.114,2 40,3 57,4 700.84,5 97,6 8.7,7 36,8 34,9 76,10 52,11 9,12 59.77,13 34,14 8,15 42,16 6.338}
{0 CHEMBL1094366,1 62.114,2 40,3 57,4 700.84,5 97,6 8.7,7 36,8 34,9 76,10 52,11 9,12 59.77,13 34,14 8,15 42,16 6.357}
{0 CHEMBL1094443,1 46.523,2 26,3 45,4 554.66,5 71,6 9.1,7 23,8 18,9 59,10 40,11 7,12 44.84,13 25,14 6,15 31,16 4}
{0 CHEMBL1094444,1 41.546,2 22,3 40,4 498.59,5 62,6 8.6,7 23,8 18,9 54,10 36,11 7,12 40.072,13 25,14 3,15 28,16 4.143}
{0 CHEMBL1094643,1 54.046,2 30,3 52,4 630.76,5 82,6 7.9,7 29,8 24,9 69,10 46,11 9,12 51.894,13 31,14 6,15 37,16 4}
{0 CHEMBL1094644,1 61.262,2 32,3 60,4 720.84,5 92,6 8.2,7 36,8 30,9 81,10 53,11 10,12 59.135,13 38,14 5,15 43,16 4}
{0 CHEMBL1094645,1 46.489,2 24,3 46,4 570.65,5 70,6 6.2,7 24,8 18,9 61,10 41,11 6,12 45.177,13 27,14 5,15 32,16 4}
{0 CHEMBL1094809,1 44.307,2 24,3 43,4 524.63,5 67,6 8.1,7 23,8 18,9 57,10 38,11 6,12 42.599,13 25,14 5,15 30,16 4.444}
{0 CHEMBL1095146,1 42.029,2 21,3 42,4 512.59,5 63,6 6.9,7 23,8 18,9 56,10 37,11 5,12 40.74,13 25,14 4,15 29,16 5.268}
{0 CHEMBL1095147,1 46.852,2 24,3 46,4 544.66,5 70,6 6.3,7 28,8 23,9 62.5,10 40,11 5,12 44.884,13 29,14 4,15 33,16 4.706}
{0 CHEMBL1095307,1 46.244,2 21,3 48,4 575.63,5 69,6 9.5,7 30,8 23,9 66.5,10 42,11 5,12 45.281,13 29,14 3,15 32,16 5.721}
{0 CHEMBL1095308,1 49.852,2 24,3 50,4 580.69,5 74,6 6,7 33,8 28,9 69,10 43,11 4,12 47.884,13 33,14 3,15 36,16 4.873}
{0 CHEMBL1095309,1 47.307,2 24,3 47,4 560.66,5 71,6 7.7,7 28,8 23,9 63.5,10 41,11 5,12 45.599,13 29,14 4,15 33,16 5.149}
{0 CHEMBL1095310,1 47.307,2 24,3 47,4 560.66,5 71,6 7.7,7 28,8 23,9 63.5,10 41,11 5,12 45.599,13 29,14 4,15 33,16 4.759}
{0 CHEMBL1095311,1 47.244,2 23,3 48,4 578.65,5 71,6 7.7,7 28,8 23,9 64.5,10 42,11 5,12 45.982,13 29,14 4,15 33,16 4}
{0 CHEMBL1095312,1 49.489,2 24,3 50,4 606.68,5 74,6 5.9,7 29,8 23,9 67.5,10 44,11 5,12 48.177,13 31,14 4,15 35,16 4}
{0 CHEMBL1095757,1 45.029,2 21,3 46,4 548.62,5 67,6 6.6,7 28,8 23,9 62.5,10 40,11 4,12 43.74,13 29,14 3,15 32,16 5.284}
{0 CHEMBL1095758,1 42.784,2 20,3 44,4 520.59,5 64,6 8.6,7 27,8 22,9 60,10 38,11 4,12 41.545,13 27,14 3,15 30,16 4.445}
{0 CHEMBL1095759,1 28.102,2 15,3 23,4 399.35,5 38,6 8.1,7 10,8 6,9 30,10 22,11 4,12 25.758,13 11,14 5,15 16,16 5.208}
{0 CHEMBL1095770,1 44.852,2 24,3 43,4 520.64,5 67,6 6.5,7 24,8 18,9 58,10 38,11 5,12 42.884,13 27,14 4,15 31,16 4.896}
{0 CHEMBL1096087,1 42.091,2 22,3 41,4 494.6,5 63,6 6.9,7 23,8 18,9 55,10 36,11 4,12 40.357,13 25,14 4,15 29,16 4.9}
{0 CHEMBL1096755,1 45.029,2 21,3 46,4 548.62,5 67,6 6.6,7 28,8 23,9 62.5,10 40,11 4,12 43.74,13 29,14 3,15 32,16 5.342}
{0 CHEMBL1097075,1 44.307,2 24,3 43,4 524.63,5 67,6 8.1,7 23,8 18,9 57,10 38,11 6,12 42.599,13 25,14 5,15 30,16 5.469}
{0 CHEMBL1097427,1 47.83,2 28,3 45,4 552.69,5 73,6 7.4,7 23,8 18,9 59,10 40,11 8,12 45.652,13 25,14 7,15 32,16 4}
{0 CHEMBL1097428,1 44.307,2 24,3 43,4 524.63,5 67,6 8.1,7 23,8 18,9 57,10 38,11 6,12 42.599,13 25,14 5,15 30,16 4.917}
{0 CHEMBL1098322,1 49.614,2 26,3 48,4 570.7,5 74,6 5.9,7 29,8 24,9 65,10 42,11 5,12 47.411,13 31,14 4,15 35,16 4.573}
{0 CHEMBL1098323,1 47.307,2 24,3 47,4 560.66,5 71,6 7.7,7 28,8 23,9 63.5,10 41,11 5,12 45.599,13 29,14 4,15 33,16 5.276}
{0 CHEMBL1098324,1 54.046,2 30,3 52,4 630.76,5 82,6 7.9,7 29,8 24,9 69,10 46,11 8,12 51.894,13 31,14 6,15 37,16 4.388}
{0 CHEMBL1098754,1 45.091,2 22,3 45,4 530.63,5 67,6 6.6,7 28,8 23,9 61.5,10 39,11 4,12 43.357,13 29,14 3,15 32,16 4.9}
{0 CHEMBL1098755,1 45.029,2 21,3 46,4 548.62,5 67,6 6.6,7 28,8 23,9 62.5,10 40,11 4,12 43.74,13 29,14 3,15 32,16 5.208}
{0 CHEMBL119171,1 21.54,2 13,3 22,4 299.35,5 35,6 12.1,7 10,8 10,9 27,10 20,11 2,12 21.261,13 5,14 5,15 10,16 4.468}
{0 CHEMBL1200938,1 34.063,2 27,3 29,4 353.51,5 56,6 3.8,7 12,8 10,9 36,10 26,11 4,12 31.815,13 11,14 10,15 21,16 4.645}
{0 CHEMBL1269012,1 65.023,2 40,3 61,4 756.86,5 101,6 10.4,7 32,8 24,9 81,10 56,11 11,12 63.2,13 34,14 10,15 44,16 6.708}
{0 CHEMBL1269070,1 61.5,2 36,3 59,4 728.8,5 95,6 11.1,7 32,8 24,9 79,10 54,11 9,12 60.146,13 34,14 8,15 42,16 6.587}
{0 CHEMBL1269072,1 52.443,2 26,3 53,4 642.64,5 79,6 13.5,7 32,8 24,9 73,10 48,11 7,12 51.996,13 34,14 4,15 38,16 6.545}
{0 CHEMBL1269073,1 50.58,2 34,3 47,4 570.68,5 81,6 10.5,7 18,8 12,9 59,10 42,11 5,12 48.674,13 20,14 14,15 34,16 5.612}
{0 CHEMBL1269074,1 57.625,2 42,3 51,4 626.8,5 93,6 9.1,7 18,8 12,9 63,10 46,11 7,12 54.781,13 20,14 18,15 38,16 4.898}
{0 CHEMBL1269075,1 53.057,2 30,3 51,4 614.68,5 81,6 10.5,7 30,8 24,9 69,10 46,11 7,12 51.62,13 32,14 6,15 38,16 5.834}
{0 CHEMBL1269076,1 56.58,2 34,3 53,4 642.74,5 87,6 9.8,7 30,8 24,9 71,10 48,11 7,12 54.674,13 32,14 8,15 40,16 5.602}
{0 CHEMBL1269077,1 56.58,2 34,3 53,4 642.74,5 87,6 9.8,7 30,8 24,9 71,10 48,11 9,12 54.674,13 32,14 8,15 40,16 5.842}
{0 CHEMBL1269107,1 49.534,2 26,3 49,4 586.62,5 75,6 11.4,7 30,8 24,9 67,10 44,11 5,12 48.567,13 32,14 4,15 36,16 6.469}
{0 CHEMBL1269110,1 51.25,2 24,3 51,4 655.5,5 75,6 11.4,7 30,8 24,9 69,10 46,11 5,12 50.222,13 32,14 4,15 36,16 6.892}
{0 CHEMBL1272170,1 41.534,2 26,3 39,4 490.54,5 65,6 12.9,7 18,8 12,9 51,10 36,11 3,12 40.567,13 20,14 8,15 28,16 6.289}
{0 CHEMBL1272224,1 45.057,2 30,3 41,4 518.6,5 71,6 11.8,7 18,8 12,9 53,10 38,11 5,12 43.62,13 20,14 10,15 30,16 6.346}
{0 CHEMBL1288344,1 64.279,2 45,3 55,4 732.02,5 100,6 6.3,7 29,8 24,9 72,10 51,11 16,12 60.306,13 25,14 13,15 38,16 6.167}
{0 CHEMBL1288345,1 61.239,2 40,3 54,4 717.96,5 94,6 5.6,7 30,8 24,9 72,10 50,11 14,12 57.921,13 27,14 10,15 37,16 6.42}
{0 CHEMBL1288346,1 61.307,2 42,3 53,4 702.98,5 95,6 5.5,7 29,8 24,9 70,10 49,11 15,12 57.559,13 25,14 11,15 36,16 5.959}
{0 CHEMBL1288347,1 62.04,2 47,3 51,4 698.01,5 98,6 6.3,7 23,8 18,9 65,10 48,11 16,12 57.833,13 19,14 16,15 35,16 6.237}
{0 CHEMBL1288348,1 63.802,2 49,3 52,4 712.04,5 101,6 6.1,7 23,8 18,9 66,10 49,11 16,12 59.36,13 19,14 17,15 36,16 6.125}
{0 CHEMBL1288349,1 66.563,2 51,3 55,4 738.08,5 106,6 5.9,7 23,8 18,9 69,10 51,11 16,12 61.886,13 19,14 19,15 38,16 6.495}
{0 CHEMBL1288350,1 65.137,2 44,3 56,4 766.46,5 100,6 6.3,7 29,8 24,9 73,10 52,11 16,12 61.133,13 25,14 13,15 38,16 6.638}
{0 CHEMBL1288351,1 65.137,2 44,3 56,4 766.46,5 100,6 6.3,7 29,8 24,9 73,10 52,11 16,12 61.133,13 25,14 13,15 38,16 6.602}
{0 CHEMBL1288352,1 65.137,2 44,3 56,4 766.46,5 100,6 6.3,7 29,8 24,9 73,10 52,11 16,12 61.133,13 25,14 13,15 38,16 6.398}
{0 CHEMBL1288353,1 64.216,2 44,3 56,4 750.01,5 100,6 6.3,7 29,8 24,9 73,10 52,11 16,12 60.689,13 25,14 13,15 38,16 6.745}
{0 CHEMBL1288354,1 66.04,2 47,3 56,4 746.05,5 103,6 6.1,7 29,8 24,9 73,10 52,11 16,12 61.833,13 25,14 14,15 39,16 6.824}
{0 CHEMBL1288355,1 66.495,2 47,3 57,4 762.05,5 104,6 7,7 29,8 24,9 74,10 53,11 17,12 62.548,13 25,14 14,15 39,16 6.824}
{0 CHEMBL1288356,1 65.631,2 44,3 56,4 810.91,5 100,6 6.3,7 29,8 24,9 73,10 52,11 16,12 61.331,13 25,14 13,15 38,16 7}
{0 CHEMBL1288357,1 71.802,2 49,3 62,4 808.12,5 111,6 5.7,7 35,8 30,9 82,10 57,11 17,12 67.36,13 31,14 13,15 44,16 7.456}
{0 CHEMBL1288358,1 71.802,2 49,3 62,4 808.12,5 111,6 5.7,7 35,8 30,9 82,10 57,11 17,12 67.36,13 31,14 13,15 44,16 6.222}
{0 CHEMBL1288359,1 61.239,2 40,3 54,4 717.96,5 94,6 5.6,7 30,8 24,9 72,10 50,11 14,12 57.921,13 27,14 10,15 37,16 6.602}
{0 CHEMBL1288360,1 62.159,2 40,3 54,4 734.41,5 94,6 5.6,7 30,8 24,9 72,10 50,11 14,12 58.365,13 27,14 10,15 37,16 6.208}
{0 CHEMBL1288361,1 62.875,2 40,3 57,4 767.97,5 97,6 5.4,7 30,8 24,9 75,10 53,11 14,12 60.214,13 27,14 11,15 38,16 6.824}
{0 CHEMBL1288362,1 62.875,2 40,3 57,4 767.97,5 97,6 5.4,7 30,8 24,9 75,10 53,11 14,12 60.214,13 27,14 11,15 38,16 5.585}
{0 CHEMBL1288363,1 63.517,2 43,3 55,4 730,5 98,6 6.4,7 30,8 24,9 73,10 51,11 15,12 59.779,13 27,14 11,15 38,16 6.523}
{0 CHEMBL1288364,1 62.546,2 40,3 55,4 724.98,5 95,6 5.5,7 31,8 24,9 75,10 51,11 14,12 59.032,13 27,14 10,15 38,16 5.959}
{0 CHEMBL1288365,1 60.546,2 40,3 53,4 700.96,5 93,6 5.6,7 30,8 24,9 71,10 49,11 14,12 57.032,13 26,14 10,15 36,16 6.26}
{0 CHEMBL1288366,1 60.546,2 40,3 53,4 700.96,5 93,6 5.6,7 30,8 24,9 71,10 49,11 14,12 57.032,13 26,14 10,15 36,16 5.721}
{0 CHEMBL1288367,1 68.824,2 45,3 60,4 776.07,5 105,6 5,7 36,8 30,9 81,10 55,11 15,12 64.591,13 33,14 10,15 43,16 6.796}
{0 CHEMBL1288368,1 63.069,2 44,3 54,4 717.01,5 98,6 5.3,7 29,8 24,9 71,10 50,11 15,12 59.086,13 25,14 12,15 37,16 6.387}
{0 CHEMBL1288369,1 62.881,2 41,3 57,4 770.98,5 98,6 5.3,7 29,8 24,9 74,10 53,11 15,12 60.236,13 25,14 12,15 37,16 6.409}
{0 CHEMBL1288370,1 63.523,2 44,3 55,4 733.01,5 99,6 6.3,7 29,8 24,9 72,10 51,11 16,12 59.801,13 25,14 12,15 37,16 6.409}
{0 CHEMBL1288371,1 64.716,2 44,3 55,4 749.08,5 99,6 5.3,7 29,8 24,9 72,10 51,11 16,12 60.273,13 25,14 12,15 37,16 7.022}
{0 CHEMBL1288372,1 65.625,2 44,3 57,4 781.08,5 101,6 7.2,7 31,8 24,9 76,10 53,11 16,12 61.702,13 25,14 12,15 37,16 5.26}
{0 CHEMBL1288373,1 72.12,2 53,3 61,4 800.16,5 114,6 4.6,7 29,8 24,9 78,10 56,11 17,12 67.214,13 25,14 17,15 42,16 6.18}
{0 CHEMBL1288374,1 71.114,2 52,3 60,4 785.14,5 112,6 4.7,7 29,8 24,9 77,10 55,11 16,12 66.193,13 25,14 17,15 42,16 6.469}
{0 CHEMBL1288375,1 68.83,2 46,3 60,4 779.08,5 106,6 5,7 35,8 30,9 80,10 55,11 16,12 64.613,13 31,14 11,15 42,16 7.745}
{0 CHEMBL1288376,1 68.074,2 45,3 60,4 780.07,5 105,6 5,7 35,8 30,9 80,10 55,11 16,12 64.107,13 30,14 11,15 41,16 6.097}
{0 CHEMBL1288377,1 71.046,2 48,3 62,4 809.11,5 110,6 5.7,7 35,8 30,9 82,10 57,11 17,12 66.854,13 31,14 12,15 43,16 6.42}
{0 CHEMBL1288460,1 71.046,2 48,3 62,4 809.11,5 110,6 5.7,7 35,8 30,9 82,10 57,11 17,12 66.854,13 31,14 12,15 43,16 7.523}
{0 CHEMBL1288461,1 69.688,2 45,3 61,4 813.52,5 106,6 5,7 35,8 30,9 81,10 56,11 16,12 65.44,13 31,14 11,15 42,16 7.252}
{0 CHEMBL1288462,1 69.688,2 45,3 61,4 813.52,5 106,6 5,7 35,8 30,9 81,10 56,11 16,12 65.44,13 31,14 11,15 42,16 6.745}
{0 CHEMBL1288463,1 76.353,2 50,3 67,4 855.18,5 117,6 4.5,7 41,8 36,9 90,10 61,11 17,12 71.666,13 37,14 11,15 48,16 7.658}
{0 CHEMBL1288464,1 68.768,2 45,3 61,4 797.07,5 106,6 5,7 35,8 30,9 81,10 56,11 16,12 64.996,13 31,14 11,15 42,16 6.886}
{0 CHEMBL1288465,1 70.404,2 45,3 64,4 847.08,5 109,6 4.8,7 35,8 30,9 84,10 59,11 16,12 67.289,13 31,14 12,15 43,16 7.398}
{0 CHEMBL1288466,1 73.148,2 48,3 64,4 857.18,5 112,6 6.5,7 37,8 30,9 86,10 59,11 17,12 68.756,13 31,14 12,15 43,16 6.337}
{0 CHEMBL1307648,1 28.392,2 13,3 29,4 343.35,5 42,6 10.3,7 21,8 18,9 41,10 26,11 4,12 28.041,13 21,15 21,16 4.809}
{0 CHEMBL1312212,1 40.307,2 24,3 38,4 476.59,5 62,6 8.6,7 22,8 18,9 51,10 34,11 6,12 38.599,13 21,14 5,15 26,16 4.188}
{0 CHEMBL1316816,1 28.636,2 16,3 26,4 383.25,5 42,6 9.8,7 14,8 12,9 34,10 25,11 7,12 27.771,13 13,14 4,15 17,16 4.518}
{0 CHEMBL133255,1 21.602,2 14,3 20,4 262.28,5 34,6 15.2,7 9,8 6,9 26,10 19,11 3,12 21.262,13 11,14 3,15 14,16 4}
{0 CHEMBL134871,1 23.364,2 16,3 21,4 276.31,5 37,6 13.9,7 9,8 6,9 27,10 20,11 4,12 22.788,13 11,14 4,15 15,16 4}
{0 CHEMBL135650,1 21.295,2 12,3 21,4 276.26,5 33,6 18.8,7 10,8 6,9 28,10 20,11 3,12 21.45,13 12,14 2,15 14,16 4.137}
{0 CHEMBL1359782,1 30.006,2 13,3 33,4 407.36,5 46,6 16.3,7 22,8 16,9 47,10 30,11 5,12 30.702,13 19,14 1,15 20,16 4.754}
{0 CHEMBL1401406,1 29.92,2 16,3 29,4 388.42,5 45,6 16.3,7 12,8 5,9 38.5,10 27,11 7,12 29.405,13 14,14 5,15 19,16 4.565}
{0 CHEMBL1413866,1 24.097,2 7,3 25,4 365.45,5 32,6 10,7 17,8 15,9 35.5,10 23,11 4,12 23.34,13 10,14 1,15 12,16 4.016}
{0 CHEMBL1417070,1 40.71,2 23,3 38,4 495.03,5 61,6 7,7 22,8 18,9 51,10 34,11 5,12 38.711,13 21,14 5,15 26,16 4.294}
{0 CHEMBL1417701,1 29.017,2 17,3 27,4 359.43,5 44,6 11.9,7 19,8 16,9 38,10 25,11 4,12 27.997,13 15,14 3,15 18,16 4.03}
{0 CHEMBL1439414,1 34.153,2 13,3 36,4 464.91,5 49,6 8.9,7 25,8 21,9 50.5,10 32,11 4,12 33.593,13 22,15 22,16 4.918}
{0 CHEMBL1451039,1 21.512,2 12,3 23,4 299.27,5 35,6 9.1,7 8,8 6,9 28,10 21,11 2,12 22.003,13 9,14 5,15 14,16 4.218}
{0 CHEMBL1453409,1 25.563,2 15,3 26,4 349.34,5 41,6 15,7 12,8 6,9 35,10 25,11 5,12 26.03,13 10,14 4,15 14,16 4.672}
{0 CHEMBL1465739,1 26,2 16,3 23,4 324.46,5 39,6 8.1,7 8,8 5,9 28.5,10 21,11 4,12 24.249,13 7,14 7,15 14,16 4.045}
{0 CHEMBL1490685,1 29.614,2 10,3 30,4 414.52,5 40,6 8.1,7 22,8 20,9 43,10 27,11 4,12 28.372,13 15,14 1,15 17,16 4.199}
{0 CHEMBL1492325,1 23.131,2 11,3 25,4 313.3,5 36,6 11.8,7 19,8 15,9 36.5,10 23,11 4,12 23.547,13 13,14 1,15 14,16 4.258}
{0 CHEMBL1538897,1 28.773,2 15,3 25,4 432.74,5 40,6 10.3,7 15,8 12,9 34,10 24,11 6,12 27.135,13 13,14 3,15 16,16 4.492}
{0 CHEMBL1543134,1 26.648,2 14,3 27,4 338.35,5 41,6 10.3,7 19,8 15,9 38.5,10 25,11 6,12 26.579,13 16,14 1,15 17,16 4.431}
{0 CHEMBL1543965,1 23.318,2 10,3 25,4 314.35,5 35,6 9.4,7 17,8 16,9 34,10 22,11 2,12 22.998,13 13,14 1,15 14,16 4.163}
{0 CHEMBL1574133,1 24.801,2 13,3 24,4 316.76,5 37,6 8.6,7 17,8 16,9 33,10 22,11 4,12 24.176,13 14,14 2,15 16,16 4.183}
{0 CHEMBL1579209,1 39.057,2 22,3 37,4 456.59,5 59,6 3.6,7 25,8 21,9 51.5,10 33,11 6,12 37.201,13 22,14 3,15 25,16 4.558}
{0 CHEMBL1592276,1 32.654,2 19,3 31,4 395.44,5 50,6 4.2,7 20,8 17,9 42.5,10 29,11 6,12 32.002,13 19,14 3,15 22,16 4.598}
{0 CHEMBL1672071,1 32.25,2 16,3 32,4 364.42,5 48,6 4.5,7 21,8 17,9 45.5,10 28,11 3,12 31.16,13 20,14 3,15 24,16 6.187}
{0 CHEMBL1672077,1 30.375,2 12,3 31,4 368.43,5 43,6 5.1,7 21,8 17,9 44.5,10 27,11 3,12 29.294,13 20,14 1,15 22,16 6.079}
{0 CHEMBL1672082,1 29.165,2 11,3 30,4 353.42,5 41,6 2.7,7 21,8 17,9 43.5,10 26,11 2,12 28.073,13 20,15 21,16 6.536}
{0 CHEMBL1683276,1 34.091,2 24,3 30,4 360.5,5 54,6 2,7 18,8 18,9 39,10 27,11 5,12 32.068,13 16,14 6,15 22,16 6.284}
{0 CHEMBL1683280,1 38.648,2 26,3 35,4 410.57,5 61,7 23,8 23,9 46.5,10 31,11 6,12 36.396,13 19,14 6,15 25,16 6.896}
{0 CHEMBL1683285,1 35.5,2 24,3 31,4 393.96,5 55,7 18,8 18,9 40,10 28,11 5,12 33.203,13 16,14 6,15 22,16 6.77}
{0 CHEMBL1689139,1 71.484,2 45,3 64,4 837.55,5 109,6 3.9,7 39,8 35,9 85.5,10 58,11 16,12 67.241,13 32,14 11,15 43,16 8.266}
{0 CHEMBL1689140,1 74.699,2 47,3 68,4 879.59,5 115,6 4.6,7 39,8 35,9 89.5,10 61,11 16,12 70.483,13 32,14 13,15 45,16 7.469}
{0 CHEMBL1689141,1 74.461,2 45,3 68,4 924.62,5 113,6 3.7,7 39,8 35,9 89.5,10 62,11 16,12 70.611,13 32,14 12,15 44,16 8.222}
{0 CHEMBL1689142,1 77.677,2 47,3 72,4 966.66,5 119,6 4.5,7 39,8 35,9 93.5,10 65,11 16,12 73.852,13 32,14 14,15 46,16 7.796}
{0 CHEMBL1689143,1 76.529,2 53,3 66,4 869.65,5 119,6 3.5,7 34,8 29,9 85.5,10 60,11 16,12 71.349,13 28,14 17,15 45,16 8.523}
{0 CHEMBL1689144,1 79.745,2 55,3 70,4 911.69,5 125,6 4.2,7 34,8 29,9 89.5,10 63,11 16,12 74.59,13 28,14 19,15 47,16 7.699}
{0 CHEMBL1689145,1 79.506,2 53,3 70,4 956.72,5 123,6 3.4,7 34,8 29,9 89.5,10 64,11 16,12 74.718,13 28,14 18,15 46,16 8.523}
{0 CHEMBL1689146,1 82.722,2 55,3 74,4 998.76,5 129,6 4.1,7 34,8 29,9 93.5,10 67,11 16,12 77.959,13 28,14 20,15 48,16 7.538}
{0 CHEMBL1689147,1 44.932,2 22,3 44,4 575.69,5 66,6 6.5,7 33,8 29,9 62.5,10 40,11 10,12 43.465,13 26,14 2,15 28,16 5.523}
{0 CHEMBL1824800,1 38.085,2 21,3 35,4 443.55,5 56,6 7.5,7 27,8 24,9 50,10 32,11 7,12 36.336,13 25,14 1,15 26,16 4.775}
{0 CHEMBL1824801,1 38.085,2 21,3 35,4 443.55,5 56,6 7.5,7 27,8 24,9 50,10 32,11 7,12 36.336,13 25,14 1,15 26,16 4.822}
{0 CHEMBL1824802,1 38.085,2 21,3 35,4 443.55,5 56,6 7.5,7 27,8 24,9 50,10 32,11 7,12 36.336,13 25,14 1,15 26,16 4.369}
{0 CHEMBL1824803,1 38.023,2 20,3 36,4 461.54,5 56,6 7.5,7 27,8 24,9 51,10 33,11 7,12 36.719,13 25,14 1,15 26,16 5.028}
{0 CHEMBL1824804,1 38.943,2 20,3 36,4 477.99,5 56,6 7.5,7 27,8 24,9 51,10 33,11 7,12 37.163,13 25,14 1,15 26,16 5.421}
{0 CHEMBL1824805,1 39.801,2 19,3 37,4 512.43,5 56,6 7.5,7 27,8 24,9 52,10 34,11 7,12 37.991,13 25,14 1,15 26,16 5.383}
{0 CHEMBL1824806,1 36.324,2 19,3 34,4 429.52,5 53,6 8,7 27,8 24,9 49,10 31,11 6,12 34.809,13 25,15 25,16 4.552}
{0 CHEMBL1824807,1 36.261,2 18,3 35,4 447.51,5 53,6 8,7 27,8 24,9 50,10 32,11 6,12 35.192,13 25,15 25,16 4.475}
{0 CHEMBL1824808,1 38.04,2 17,3 36,4 498.4,5 53,6 8,7 27,8 24,9 51,10 33,11 6,12 36.464,13 25,15 25,16 4.305}
{0 CHEMBL1824809,1 39.801,2 19,3 37,4 512.43,5 56,6 7.5,7 27,8 24,9 52,10 34,11 7,12 37.991,13 25,14 1,15 26,16 5.496}
{0 CHEMBL1824811,1 39.659,2 20,3 39,4 511.55,5 59,6 7.1,7 27,8 24,9 54,10 36,11 7,12 39.012,13 25,14 2,15 27,16 5.208}
{0 CHEMBL1824812,1 39.801,2 19,3 37,4 512.43,5 56,6 7.5,7 27,8 24,9 52,10 34,11 7,12 37.991,13 25,14 1,15 26,16 6.509}
{0 CHEMBL1824813,1 39.801,2 19,3 37,4 512.43,5 56,6 7.5,7 27,8 24,9 52,10 34,11 7,12 37.991,13 25,14 1,15 26,16 6.745}
{0 CHEMBL1824814,1 39.801,2 19,3 37,4 512.43,5 56,6 7.5,7 27,8 24,9 52,10 34,11 7,12 37.991,13 25,14 1,15 26,16 5.001}
{0 CHEMBL1824815,1 39.801,2 19,3 37,4 512.43,5 56,6 7.5,7 27,8 24,9 52,10 34,11 7,12 37.991,13 25,14 1,15 26,16 5.146}
{0 CHEMBL1824816,1 36.324,2 19,3 34,4 429.52,5 53,6 8,7 27,8 24,9 49,10 31,11 6,12 34.809,13 25,15 25,16 4.545}
{0 CHEMBL1824817,1 38.04,2 17,3 36,4 498.4,5 53,6 8,7 27,8 24,9 51,10 33,11 6,12 36.464,13 25,15 25,16 5.597}
{0 CHEMBL1824818,1 37.284,2 16,3 36,4 499.39,5 52,6 8.2,7 27,8 24,9 51,10 33,11 6,12 35.958,13 24,15 24,16 5.636}
{0 CHEMBL1824819,1 38.04,2 17,3 36,4 498.4,5 53,6 8,7 27,8 24,9 51,10 33,11 6,12 36.464,13 25,15 25,16 5.389}
{0 CHEMBL1824820,1 38.04,2 17,3 36,4 498.4,5 53,6 8,7 27,8 24,9 51,10 33,11 6,12 36.464,13 25,15 25,16 5.712}
{0 CHEMBL1824821,1 38.04,2 17,3 36,4 498.4,5 53,6 8,7 27,8 24,9 51,10 33,11 6,12 36.464,13 25,15 25,16 5.706}
{0 CHEMBL1824823,1 34.824,2 15,3 33,4 456.36,5 48,6 6.7,7 26,8 23,9 47.5,10 30,11 4,12 33.222,13 23,15 23,16 4.964}
{0 CHEMBL1824824,1 37.563,2 21,3 33,4 478.42,5 54,6 7.7,7 21,8 18,9 45,10 31,11 8,12 35.517,13 19,14 4,15 23,16 4.917}
{0 CHEMBL1824825,1 39.801,2 19,3 37,4 512.43,5 56,6 7.5,7 27,8 24,9 52,10 34,11 7,12 37.991,13 25,14 1,15 26,16 5.529}
{0 CHEMBL1824826,1 42.085,2 25,3 37,4 518.49,5 62,6 6.8,7 21,8 18,9 49,10 34,11 7,12 39.571,13 19,14 7,15 26,16 6.796}
{0 CHEMBL1824827,1 40.256,2 19,3 38,4 528.43,5 57,6 9.3,7 27,8 24,9 53,10 35,11 7,12 38.705,13 25,14 1,15 26,16 5.425}
{0 CHEMBL1824828,1 40.142,2 15,3 39,4 557.85,5 54,6 7.8,7 28,8 24,9 56,10 36,11 6,12 38.786,13 25,15 26,16 5.569}
{0 CHEMBL1824829,1 40.051,2 15,3 40,4 577.84,5 55,6 11.5,7 29,8 24,9 57,10 37,11 7,12 39.216,13 25,15 25,16 5.699}
{0 CHEMBL1824830,1 41.188,2 15,3 44,4 634.4,5 59,6 7.1,7 27,8 24,9 59,10 41,11 6,12 41.817,13 25,14 2,15 27,16 5.532}
{0 CHEMBL1824831,1 37.977,2 16,3 37,4 516.39,5 53,6 8,7 27,8 24,9 52,10 34,11 6,12 36.847,13 25,15 25,16 5.542}
{0 CHEMBL1824832,1 42.017,2 21,3 39,4 542.46,5 60,6 8.8,7 27,8 24,9 54,10 36,11 8,12 40.232,13 25,14 2,15 27,16 7.066}
{0 CHEMBL1916190,1 64.643,2 43,3 58,4 785.01,5 101,6 5.2,7 29,8 24,9 75,10 54,11 15,12 61.762,13 25,14 13,15 38,16 9}
{0 CHEMBL1916191,1 64.643,2 43,3 58,4 785.01,5 101,6 5.2,7 29,8 24,9 75,10 54,11 15,12 61.762,13 25,14 13,15 38,16 9}
{0 CHEMBL1916192,1 66.404,2 45,3 59,4 799.04,5 104,6 5,7 29,8 24,9 76,10 55,11 15,12 63.289,13 25,14 14,15 39,16 7.167}
{0 CHEMBL1916193,1 68.165,2 47,3 60,4 813.07,5 107,6 4.9,7 29,8 24,9 77,10 56,11 16,12 64.816,13 25,14 15,15 40,16 8.481}
{0 CHEMBL1916194,1 68.165,2 47,3 60,4 813.07,5 107,6 4.9,7 29,8 24,9 77,10 56,11 16,12 64.816,13 25,14 15,15 40,16 8.585}
{0 CHEMBL1916195,1 254.581,2 204,3 216,4 3003.84,5 420,6 9.1,7 62,8 28,9 264,10 212,11 102,12 245.403,13 60,14 73,15 133,16 8.495}
{0 CHEMBL1916196,1 265.865,2 214,3 227,4 3206.01,5 441,6 10,7 57,8 16,9 276,10 225,11 111,12 257.874,13 55,14 79,15 134,16 8.854}
{0 CHEMBL1916197,1 208.456,2 170,3 175,4 2445.17,5 345,6 9.1,7 45,8 16,9 212,10 172,11 81,12 200.38,13 43,14 65,15 108,16 8.108}
{0 CHEMBL1916198,1 265.65,2 224,3 218,4 3076.07,5 442,6 8.9,7 48,8 12,9 260,10 216,11 107,12 254.386,13 48,14 88,15 136,16 5}
{0 CHEMBL192571,1 56.302,2 41,3 47,4 639.92,5 88,6 5.9,7 23,8 18,9 61,10 44,11 13,12 52.538,13 19,14 13,15 32,16 6.444}
{0 CHEMBL1940662,1 51.165,2 33,3 45,4 627.81,5 78,6 9.2,7 25,8 18,9 61,10 43,11 14,12 48.86,13 21,14 8,15 29,16 5.235}
{0 CHEMBL1940663,1 51.165,2 33,3 45,4 627.81,5 78,6 9.2,7 25,8 18,9 61,10 43,11 14,12 48.86,13 21,14 8,15 29,16 5.315}
{0 CHEMBL1940664,1 51.051,2 31,3 45,4 645.85,5 76,6 9.5,7 25,8 18,9 61,10 43,11 15,12 48.52,13 21,14 7,15 28,16 5.408}
{0 CHEMBL1940665,1 53.404,2 31,3 49,4 661.82,5 80,6 9.1,7 31,8 24,9 68,10 46,11 14,12 51.333,13 27,14 5,15 32,16 5.466}
{0 CHEMBL1940666,1 56.409,2 32,3 53,4 700.86,5 85,6 8.6,7 35,8 28,9 74,10 49,11 14,12 54.355,13 29,14 5,15 34,16 5.19}
{0 CHEMBL1940667,1 49.404,2 31,3 44,4 613.78,5 75,6 9.6,7 25,8 18,9 60,10 42,11 13,12 47.333,13 21,14 7,15 28,16 4.784}
{0 CHEMBL1940668,1 45.659,2 24,3 43,4 576.7,5 67,6 9.4,7 30,8 24,9 61,10 40,11 11,12 44.017,13 26,14 2,15 28,16 5.6}
{0 CHEMBL1940669,1 45.597,2 23,3 44,4 594.69,5 67,6 9.4,7 30,8 24,9 62,10 41,11 11,12 44.4,13 26,14 2,15 28,16 5.767}
{0 CHEMBL1940670,1 45.597,2 23,3 44,4 594.69,5 67,6 9.4,7 30,8 24,9 62,10 41,11 11,12 44.4,13 26,14 2,15 28,16 5.682}
{0 CHEMBL1940671,1 45.597,2 23,3 44,4 594.69,5 67,6 9.4,7 30,8 24,9 62,10 41,11 11,12 44.4,13 26,14 2,15 28,16 5.712}
{0 CHEMBL1940678,1 47.011,2 23,3 44,4 655.59,5 67,6 9.4,7 30,8 24,9 62,10 41,11 11,12 45.042,13 26,14 2,15 28,16 5.824}
{0 CHEMBL1940679,1 47.875,2 26,3 45,4 606.73,5 71,6 10.3,7 30,8 24,9 63,10 42,11 12,12 46.258,13 26,14 3,15 29,16 5.896}
{0 CHEMBL1940680,1 46.761,2 24,3 44,4 612.76,5 68,6 10.8,7 31,8 24,9 63,10 41,11 12,12 44.918,13 25,14 2,15 27,16 5.64}
{0 CHEMBL1966952,1 31.779,2 17,3 30,4 396.85,5 47,6 8.9,7 21,8 18,9 42,10 28,11 5,12 30.944,13 19,14 2,15 21,16 5.142}
{0 CHEMBL198903,1 59.517,2 43,3 51,4 681.96,5 94,6 6.7,7 23,8 18,9 65,10 47,11 13,12 55.779,13 19,14 15,15 34,16 5.078}
{0 CHEMBL2011504,1 48.801,2 29,3 45,4 569.09,5 74,6 7.1,7 30,8 27,9 61.5,10 41,11 9,12 46.819,13 27,14 6,15 33,16 6.032}
{0 CHEMBL201669,1 51.705,2 32,3 46,4 620.81,5 78,6 8,7 29,8 24,9 63,10 43,11 13,12 49.124,13 25,14 6,15 31,16 6.186}
{0 CHEMBL201670,1 58.137,2 36,3 53,4 704.89,5 89,6 9.4,7 30,8 24,9 71,10 49,11 14,12 55.607,13 26,14 9,15 35,16 6.102}
{0 CHEMBL201947,1 70.018,2 51,3 59,4 790.11,5 110,6 6.6,7 29,8 24,9 76,10 55,11 20,12 65.601,13 25,14 16,15 41,16 5.572}
{0 CHEMBL202314,1 43.972,2 27,3 40,4 541.71,5 67,6 7.8,7 23,8 18,9 54,10 37,11 10,12 41.85,13 19,14 6,15 25,16 5.3}
{0 CHEMBL202509,1 47.188,2 29,3 43,4 583.75,5 72,6 8.7,7 24,8 18,9 58,10 40,11 10,12 45.092,13 20,14 7,15 27,16 5.527}
{0 CHEMBL202540,1 52.926,2 35,3 47,4 641.84,5 82,6 8.9,7 24,8 18,9 62,10 44,11 12,12 50.387,13 20,14 10,15 30,16 5.475}
{0 CHEMBL202798,1 66.495,2 47,3 57,4 762.05,5 104,6 7,7 29,8 24,9 74,10 53,11 18,12 62.548,13 25,14 14,15 39,16 6.615}
{0 CHEMBL202964,1 66.495,2 47,3 57,4 762.05,5 104,6 7,7 29,8 24,9 74,10 53,11 18,12 62.548,13 25,14 14,15 39,16 4.358}
{0 CHEMBL2030844,1 59.818,2 34,3 57,4 698.85,5 91,6 7.1,7 39,8 34,9 79,10 51,11 9,12 57.463,13 34,14 6,15 40,16 6.194}
{0 CHEMBL2030845,1 65.103,2 40,3 60,4 740.94,5 100,6 6.4,7 39,8 34,9 82,10 54,11 12,12 62.044,13 34,14 9,15 43,16 7.377}
{0 CHEMBL2030846,1 61.58,2 36,3 58,4 712.88,5 94,6 6.8,7 39,8 34,9 80,10 52,11 10,12 58.99,13 34,14 7,15 41,16 7.523}
{0 CHEMBL2030847,1 61.887,2 38,3 57,4 698.9,5 95,6 5.6,7 38,8 34,9 78,10 51,11 10,12 58.802,13 33,14 8,15 41,16 7.959}
{0 CHEMBL2030848,1 67.319,2 42,3 62,4 770.97,5 104,6 7.1,7 39,8 34,9 84,10 56,11 13,12 64.285,13 34,14 10,15 44,16 7.319}
{0 CHEMBL2030849,1 73.08,2 44,3 68,4 833.04,5 112,6 6.7,7 45,8 40,9 93,10 61,11 14,12 69.812,13 40,14 9,15 49,16 6.328}
{0 CHEMBL2030850,1 73.08,2 44,3 68,4 833.04,5 112,6 6.7,7 45,8 40,9 93,10 61,11 14,12 69.812,13 40,14 9,15 49,16 7.26}
{0 CHEMBL2030851,1 69.864,2 42,3 65,4 791,5 107,6 6,7 44,8 40,9 89,10 58,11 12,12 66.571,13 39,14 8,15 47,16 7.456}
{0 CHEMBL2030852,1 70.722,2 41,3 66,4 825.44,5 107,6 6,7 44,8 40,9 90,10 59,11 12,12 67.398,13 39,14 8,15 47,16 7.456}
{0 CHEMBL2030853,1 70.722,2 41,3 66,4 825.44,5 107,6 6,7 44,8 40,9 90,10 59,11 12,12 67.398,13 39,14 8,15 47,16 7.745}
{0 CHEMBL2030854,1 69.387,2 46,3 62,4 771.02,5 108,6 5.9,7 38,8 34,9 83,10 56,11 14,12 65.624,13 33,14 12,15 45,16 7.585}
{0 CHEMBL2030855,1 69.41,2 42,3 64,4 775,5 106,6 5.1,7 44,8 40,9 88,10 57,11 11,12 65.856,13 39,14 8,15 47,16 7.886}
{0 CHEMBL2030856,1 65.864,2 42,3 60,4 742.96,5 102,6 6.3,7 38,8 34,9 81,10 54,11 12,12 62.571,13 33,14 10,15 43,16 8.222}
{0 CHEMBL2030857,1 67.625,2 44,3 61,4 756.99,5 105,6 6.1,7 38,8 34,9 82,10 55,11 13,12 64.097,13 33,14 11,15 44,16 8.155}
{0 CHEMBL2030858,1 64.103,2 40,3 59,4 728.93,5 99,6 6.5,7 38,8 34,9 80,10 53,11 11,12 61.044,13 33,14 9,15 42,16 7.824}
{0 CHEMBL2030859,1 64.103,2 40,3 59,4 728.93,5 99,6 6.5,7 38,8 34,9 80,10 53,11 11,12 61.044,13 33,14 9,15 42,16 8.097}
{0 CHEMBL2030860,1 64.654,2 41,3 59,4 727.95,5 100,6 5.3,7 38,8 34,9 80,10 53,11 11,12 61.35,13 33,14 9,15 42,16 8.155}
{0 CHEMBL2030861,1 62.228,2 44,3 51,4 673,5 95,6 5.5,7 27,8 23,9 66.5,10 47,11 12,12 57.267,13 23,14 13,15 36,16 7.886}
{0 CHEMBL2030862,1 61.961,2 39,3 56,4 727.34,5 95,6 6.7,7 33,8 29,9 74.5,10 51,11 12,12 58.871,13 29,14 10,15 39,16 6.854}
{0 CHEMBL2030863,1 67.245,2 45,3 59,4 769.43,5 104,6 6.1,7 33,8 29,9 77.5,10 54,11 15,12 63.452,13 29,14 13,15 42,16 6.921}
{0 CHEMBL2030864,1 71.58,2 40,3 67,4 859.88,5 107,6 6,7 44,8 40,9 91,10 60,11 12,12 68.226,13 39,14 8,15 47,16 7.824}
{0 CHEMBL2030865,1 61.199,2 41,3 54,4 675.92,5 95,6 4.4,7 33,8 29,9 72.5,10 49,11 12,12 57.636,13 28,14 11,15 39,16 6.301}
{0 CHEMBL2030866,1 62.057,2 40,3 55,4 710.36,5 95,6 4.4,7 33,8 29,9 73.5,10 50,11 12,12 58.463,13 28,14 11,15 39,16 6.319}
{0 CHEMBL2031001,1 63.858,2 40,3 55,4 801.81,5 95,6 4.4,7 33,8 29,9 73.5,10 50,11 12,12 58.952,13 28,14 11,15 39,16 6.013}
{0 CHEMBL2031002,1 71.205,2 46,3 63,4 825.93,5 109,6 3.9,7 34,8 30,9 82,10 57,11 14,12 66.892,13 30,14 14,15 44,16 6.149}
{0 CHEMBL2031003,1 63.966,2 44,3 56,4 704.97,5 100,6 4.2,7 33,8 29,9 74.5,10 51,11 13,12 60.184,13 28,14 12,15 40,16 6.796}
{0 CHEMBL2031004,1 64.273,2 42,3 57,4 740.39,5 99,6 5.3,7 33,8 29,9 75.5,10 52,11 13,12 60.705,13 28,14 12,15 40,16 6.886}
{0 CHEMBL2031005,1 62.057,2 40,3 55,4 710.36,5 95,6 4.4,7 33,8 29,9 73.5,10 50,11 12,12 58.463,13 28,14 11,15 39,16 6.638}
{0 CHEMBL2031006,1 62.961,2 43,3 55,4 689.95,5 98,6 4.3,7 33,8 29,9 73.5,10 50,11 12,12 59.162,13 28,14 12,15 40,16 6.921}
{0 CHEMBL2031007,1 57.677,2 37,3 52,4 647.86,5 89,6 4.8,7 33,8 29,9 70.5,10 47,11 10,12 54.582,13 28,14 9,15 37,16 6.602}
{0 CHEMBL2031008,1 62.159,2 38,3 56,4 745.79,5 94,6 4.5,7 33,8 29,9 74.5,10 51,11 11,12 58.785,13 28,14 10,15 38,16 7.854}
{0 CHEMBL2031009,1 61.608,2 37,3 56,4 746.77,5 93,6 5.7,7 33,8 29,9 74.5,10 51,11 11,12 58.479,13 28,14 10,15 38,16 8.046}
{0 CHEMBL2031010,1 55.205,2 26,3 52,4 750.5,5 78,6 5.4,7 33,8 30,9 70,10 48,11 11,12 53.068,13 31,14 4,15 35,16 4.523}
{0 CHEMBL2031011,1 60.228,2 38,3 53,4 747.2,5 91,6 5.7,7 27,8 23,9 68.5,10 49,11 12,12 56.833,13 23,14 12,15 35,16 5.367}
{0 CHEMBL2031012,1 64.273,2 42,3 57,4 740.39,5 99,6 5.3,7 33,8 28,9 76,10 52,11 12,12 60.705,13 28,14 12,15 40,16 7.62}
{0 CHEMBL2031013,1 70.353,2 46,3 62,4 832.52,5 108,6 6.8,7 35,8 28,9 83,10 57,11 14,12 66.375,13 28,14 14,15 42,16 6.824}
{0 CHEMBL2031014,1 75.995,2 53,3 67,4 869.57,5 120,6 6.1,7 33,8 28,9 86,10 61,11 16,12 71.79,13 28,14 18,15 46,16 7.387}
{0 CHEMBL2031015,1 75.995,2 53,3 67,4 869.57,5 120,6 6.1,7 33,8 28,9 86,10 61,11 16,12 71.79,13 28,14 18,15 46,16 7.268}
{0 CHEMBL2031016,1 75.921,2 48,3 69,4 890.53,5 117,6 7.2,7 40,8 34,9 92,10 63,11 16,12 72.43,13 35,14 13,15 48,16 7.77}
{0 CHEMBL2031017,1 66.932,2 41,3 58,4 866.28,5 99,6 5.3,7 33,8 28,9 77,10 53,11 12,12 62.022,13 28,14 12,15 40,16 7.432}
{0 CHEMBL2031018,1 66.932,2 41,3 58,4 866.28,5 99,6 5.3,7 33,8 28,9 77,10 53,11 12,12 62.022,13 28,14 12,15 40,16 7.328}
{0 CHEMBL2031019,1 63.279,2 43,3 56,4 731.39,5 99,6 5.3,7 28,8 23,9 72.5,10 51,11 12,12 59.726,13 24,14 14,15 38,16 7.638}
{0 CHEMBL2031020,1 73.972,2 45,3 67,4 904.38,5 112,6 5.7,7 35,8 29,9 87.5,10 61,11 13,12 70.15,13 31,14 14,15 45,16 6.26}
{0 CHEMBL2031021,1 66.802,2 47,3 58,4 759.45,5 105,6 5,7 28,8 23,9 74.5,10 53,11 13,12 62.78,13 24,14 16,15 40,16 7.77}
{0 CHEMBL2031022,1 74.279,2 47,3 66,4 890.4,5 113,6 4.7,7 34,8 29,9 85.5,10 60,11 14,12 69.962,13 30,14 15,15 45,16 7.357}
{0 CHEMBL2031023,1 66.035,2 44,3 58,4 754.42,5 102,6 5.2,7 33,8 28,9 77,10 53,11 12,12 62.232,13 28,14 13,15 41,16 6.229}
{0 CHEMBL2031024,1 66.489,2 44,3 59,4 770.42,5 103,6 6.1,7 33,8 28,9 78,10 54,11 13,12 62.946,13 28,14 13,15 41,16 7.921}
{0 CHEMBL2031025,1 73.989,2 52,3 64,4 842.54,5 116,6 6.3,7 33,8 28,9 83,10 59,11 18,12 69.768,13 28,14 17,15 45,16 7.538}
{0 CHEMBL2031026,1 74.54,2 53,3 64,4 841.56,5 117,6 5.4,7 33,8 28,9 83,10 59,11 17,12 70.075,13 28,14 17,15 45,16 7.328}
{0 CHEMBL2031027,1 67.04,2 45,3 59,4 769.44,5 104,6 5.1,7 33,8 28,9 78,10 54,11 13,12 63.253,13 28,14 13,15 41,16 8}
{0 CHEMBL2031028,1 76.092,2 54,3 66,4 852.59,5 120,6 4.4,7 33,8 28,9 85,10 60,11 14,12 71.382,13 28,14 18,15 46,16 7.658}
{0 CHEMBL2031029,1 73.779,2 51,3 65,4 839.54,5 116,6 5.5,7 33,8 28,9 84,10 59,11 14,12 69.548,13 28,14 17,15 45,16 7.796}
{0 CHEMBL2031030,1 73.325,2 51,3 64,4 823.54,5 115,6 4.6,7 33,8 28,9 83,10 58,11 14,12 68.833,13 28,14 17,15 45,16 7.721}
{0 CHEMBL2031031,1 62.966,2 40,3 57,4 742.36,5 97,6 6.5,7 33,8 28,9 76,10 52,11 12,12 59.893,13 28,14 11,15 39,16 7.208}
{0 CHEMBL2031032,1 63.517,2 41,3 57,4 741.38,5 98,6 5.4,7 33,8 28,9 76,10 52,11 12,12 60.199,13 28,14 11,15 39,16 7.585}
{0 CHEMBL203620,1 49.955,2 32,3 45,4 612.8,5 77,6 8.1,7 24,8 18,9 60,10 42,11 10,12 47.64,13 20,14 8,15 28,16 6.297}
{0 CHEMBL204822,1 58.443,2 38,3 52,4 690.91,5 90,6 8.1,7 29,8 24,9 69,10 48,11 15,12 55.419,13 25,14 10,15 35,16 5.367}
{0 CHEMBL204915,1 43.421,2 26,3 40,4 542.69,5 66,6 9.5,7 23,8 18,9 54,10 37,11 10,12 41.543,13 19,14 6,15 25,16 5.484}
{0 CHEMBL2063881,1 34.75,2 24,3 29,4 424.6,5 53,6 7.7,7 16,8 12,9 39,10 28,11 10,12 32.587,13 12,14 6,15 18,16 4.125}
{0 CHEMBL2063882,1 99.45,2 71,3 86,4 1135.98,5 157,6 5.3,7 41,8 35,9 109.5,10 79,11 25,12 93.465,13 36,14 22,15 58,16 8.215}
{0 CHEMBL2063883,1 97.995,2 71,3 84,4 1107.97,5 155,6 4.7,7 40,8 35,9 106.5,10 77,11 25,12 91.75,13 35,14 22,15 57,16 8.208}
{0 CHEMBL2063884,1 93.955,2 64,3 83,4 1090.89,5 147,6 5,7 45,8 40,9 108,10 76,11 25,12 88.664,13 37,14 18,15 55,16 8.319}
{0 CHEMBL2063885,1 93.154,2 63,3 81,4 1075.86,5 144,6 5.8,7 42,8 35,9 106.5,10 75,11 23,12 87.842,13 36,14 18,15 56,16 8.244}
{0 CHEMBL2063886,1 91.7,2 63,3 79,4 1047.85,5 142,6 5.1,7 41,8 35,9 103.5,10 73,11 23,12 86.127,13 35,14 18,15 55,16 7.9}
{0 CHEMBL2063887,1 95.234,2 69,3 81,4 1081.93,5 150,6 4.9,7 40,8 35,9 103.5,10 75,11 28,12 89.223,13 35,14 20,15 55,16 7.652}
{0 CHEMBL2063888,1 97.995,2 71,3 84,4 1107.97,5 155,6 4.7,7 40,8 35,9 106.5,10 77,11 25,12 91.75,13 35,14 22,15 57,16 8.119}
{0 CHEMBL2063889,1 68.234,2 45,3 59,4 785.51,5 104,6 4,7 34,8 30,9 78,10 54,11 16,12 63.725,13 30,14 11,15 41,16 7.331}
{0 CHEMBL2063891,1 50.569,2 36,3 43,4 584.84,5 79,6 5.3,7 22,8 18,9 56,10 40,11 13,12 47.264,13 18,14 10,15 28,16 4.721}
{0 CHEMBL2063892,1 91.802,2 65,3 79,4 1033.88,5 144,6 3.6,7 40,8 35,9 101.5,10 72,11 21,12 85.74,13 35,14 19,15 54,16 8.31}
{0 CHEMBL2063893,1 78.222,2 51,3 69,4 907.65,5 120,6 4.4,7 40,8 35,9 91.5,10 63,11 17,12 73.537,13 35,14 12,15 47,16 8.201}
{0 CHEMBL2063894,1 74.001,2 48,3 65,4 850.59,5 113,6 3.7,7 39,8 35,9 86.5,10 59,11 16,12 69.274,13 34,14 11,15 45,16 7.463}
{0 CHEMBL2063895,1 79.432,2 52,3 70,4 922.66,5 122,6 5.2,7 40,8 35,9 92.5,10 64,11 19,12 74.757,13 35,14 13,15 48,16 7.9}
{0 CHEMBL2063896,1 75.91,2 48,3 68,4 894.6,5 116,6 5.5,7 40,8 35,9 90.5,10 62,11 17,12 71.703,13 35,14 11,15 46,16 8.444}
{0 CHEMBL2063897,1 79.432,2 52,3 70,4 922.66,5 122,6 5.2,7 40,8 35,9 92.5,10 64,11 18,12 74.757,13 35,14 13,15 48,16 8.125}
{0 CHEMBL2159733,1 43.756,2 33,3 36,4 465.09,5 69,6 1.5,7 18,8 17,9 45.5,10 33,11 7,12 40.53,13 17,14 10,15 27,16 4.056}
{0 CHEMBL2159734,1 95.018,2 67,3 82,4 1075.92,5 149,6 4.2,7 41,8 35,9 105.5,10 75,11 21,12 88.982,13 36,14 20,15 56,16 8.301}
{0 CHEMBL2159735,1 93.563,2 67,3 80,4 1047.91,5 147,6 3.6,7 40,8 35,9 102.5,10 73,11 21,12 87.267,13 35,14 20,15 55,16 8.046}
{0 CHEMBL2159736,1 79.984,2 53,3 70,4 921.68,5 123,6 4.3,7 40,8 35,9 92.5,10 64,11 17,12 75.063,13 35,14 13,15 48,16 8.222}
{0 CHEMBL2159737,1 77.671,2 50,3 69,4 908.63,5 119,6 5.3,7 40,8 35,9 91.5,10 63,11 17,12 73.23,13 35,14 12,15 47,16 8.222}
{0 CHEMBL2159738,1 75.762,2 50,3 66,4 864.62,5 116,6 3.6,7 39,8 35,9 87.5,10 60,11 16,12 70.8,13 34,14 12,15 46,16 7.959}
{0 CHEMBL2159739,1 79.432,2 52,3 70,4 922.66,5 122,6 5.2,7 40,8 35,9 92.5,10 64,11 18,12 74.757,13 35,14 13,15 48,16 8.18}
{0 CHEMBL2159740,1 81.194,2 54,3 71,4 936.69,5 125,6 5,7 40,8 35,9 93.5,10 65,11 18,12 76.284,13 35,14 14,15 49,16 8.319}
{0 CHEMBL2159741,1 80.432,2 52,3 72,4 934.67,5 124,6 5.1,7 40,8 35,9 94.5,10 65,11 18,12 75.757,13 35,14 14,15 49,16 8.114}
{0 CHEMBL2159742,1 231.206,2 184,3 198,4 2711.42,5 382,6 9.3,7 59,8 28,9 243,10 193,11 86,12 223.256,13 57,14 67,15 124,16 9}
{0 CHEMBL2159743,1 231.348,2 183,3 198,4 2748.48,5 381,6 9.3,7 59,8 28,9 243,10 194,11 92,12 223.453,13 57,14 64,15 121,16 8.301}
{0 CHEMBL2159744,1 228.388,2 190,3 189,4 2681.49,5 379,6 9.3,7 44,8 12,9 227,10 188,11 95,12 219.539,13 44,14 72,15 116,16 4.959}
{0 CHEMBL216089,1 41.943,2 30,3 36,4 462.59,5 66,6 7.8,7 16,8 12,9 47,10 34,11 9,12 39.992,13 16,14 10,15 27,16 4.664}
{0 CHEMBL2171488,1 40.37,2 29,3 35,4 411.59,5 64,6 1.7,7 22,8 22,9 46,10 31,11 5,12 37.627,13 18,14 9,15 27,16 5.208}
{0 CHEMBL2171489,1 40.824,2 29,3 36,4 427.59,5 65,6 3.3,7 22,8 22,9 47,10 32,11 5,12 38.342,13 18,14 9,15 27,16 4.836}
{0 CHEMBL2171491,1 42.586,2 31,3 37,4 441.62,5 68,6 3.1,7 22,8 22,9 48,10 33,11 6,12 39.869,13 18,14 10,15 28,16 4}
{0 CHEMBL2171506,1 42.586,2 31,3 37,4 441.62,5 68,6 3.1,7 22,8 22,9 48,10 33,11 6,12 39.869,13 18,14 10,15 28,16 4}
{0 CHEMBL2171509,1 43.682,2 32,3 38,4 436.65,5 70,7 22,8 22,9 49,10 33,11 4,12 40.461,13 18,14 11,15 29,16 4}
{0 CHEMBL217354,1 51.324,2 35,3 44,4 573.76,5 79,6 7.9,7 27,8 24,9 59,10 41,11 8,12 48.453,13 25,14 8,15 33,16 5.569}
{0 CHEMBL217960,1 68.768,2 45,3 61,4 797.07,5 106,6 5,7 35,8 30,9 81,10 56,11 16,12 64.996,13 31,14 11,15 42,16 6.886}
{0 CHEMBL218408,1 69.688,2 45,3 61,4 813.52,5 106,6 5,7 35,8 30,9 81,10 56,11 16,12 65.44,13 31,14 11,15 42,16 6.8}
{0 CHEMBL218524,1 69.688,2 45,3 61,4 813.52,5 106,6 5,7 35,8 30,9 81,10 56,11 16,12 65.44,13 31,14 11,15 42,16 7.237}
{0 CHEMBL219234,1 35.421,2 26,3 31,4 398.5,5 57,6 9.1,7 10,8 6,9 39,10 29,11 8,12 33.938,13 10,14 11,15 22,16 4.438}
{0 CHEMBL219366,1 34.898,2 22,3 32,4 406.47,5 54,6 9.6,7 16,8 12,9 43,10 30,11 8,12 33.885,13 16,14 6,15 23,16 4.277}
{0 CHEMBL221218,1 63.802,2 49,3 52,4 712.04,5 101,6 6.1,7 23,8 18,9 66,10 49,11 16,12 59.36,13 19,14 17,15 36,16 6.241}
{0 CHEMBL221294,1 71.802,2 49,3 62,4 808.12,5 111,6 5.7,7 35,8 30,9 82,10 57,11 17,12 67.36,13 31,14 13,15 44,16 7.339}
{0 CHEMBL221295,1 71.802,2 49,3 62,4 808.12,5 111,6 5.7,7 35,8 30,9 82,10 57,11 17,12 67.36,13 31,14 13,15 44,16 6.509}
{0 CHEMBL221708,1 60.546,2 40,3 53,4 700.96,5 93,6 5.6,7 30,8 24,9 71,10 49,11 14,12 57.032,13 26,14 10,15 36,16 6.208}
{0 CHEMBL221750,1 68.074,2 45,3 60,4 780.07,5 105,6 5,7 35,8 30,9 80,10 55,11 16,12 64.107,13 30,14 11,15 41,16 6.097}
{0 CHEMBL221805,1 68.824,2 45,3 60,4 776.07,5 105,6 5,7 36,8 30,9 81,10 55,11 15,12 64.591,13 33,14 10,15 43,16 6.796}
{0 CHEMBL221854,1 62.881,2 41,3 57,4 770.98,5 98,6 5.3,7 29,8 24,9 74,10 53,11 15,12 60.236,13 25,14 12,15 37,16 6.409}
{0 CHEMBL221855,1 64.716,2 44,3 55,4 749.08,5 99,6 5.3,7 29,8 24,9 72,10 51,11 16,12 60.273,13 25,14 12,15 37,16 7.122}
{0 CHEMBL221856,1 72.12,2 53,3 61,4 800.16,5 114,6 4.6,7 29,8 24,9 78,10 56,11 17,12 67.214,13 25,14 17,15 42,16 6.306}
{0 CHEMBL222069,1 62.875,2 40,3 57,4 767.97,5 97,6 5.4,7 30,8 24,9 75,10 53,11 14,12 60.214,13 27,14 11,15 38,16 5.736}
{0 CHEMBL2312469,1 39.495,2 25,3 35,4 427.61,5 60,6 1.8,7 20,8 17,9 46.5,10 31,11 7,12 36.761,13 20,14 6,15 26,16 7.149}
{0 CHEMBL2312470,1 41.733,2 23,3 39,4 461.62,5 62,6 1.8,7 26,8 23,9 53.5,10 34,11 6,12 39.234,13 26,14 3,15 29,16 7.745}
{0 CHEMBL2312471,1 37.182,2 22,3 34,4 414.56,5 56,6 3.8,7 20,8 17,9 45.5,10 30,11 6,12 34.927,13 20,14 5,15 25,16 6.502}
{0 CHEMBL2312472,1 40.705,2 26,3 36,4 442.62,5 62,6 3.4,7 20,8 17,9 47.5,10 32,11 8,12 37.981,13 20,14 7,15 27,16 6.742}
{0 CHEMBL2312473,1 41.637,2 22,3 40,4 478.6,5 62,6 5.3,7 26,8 23,9 54.5,10 35,11 7,12 39.642,13 26,14 3,15 29,16 7.276}
{0 CHEMBL2312474,1 39.057,2 26,3 35,4 410.55,5 61,6 3.5,7 20,8 17,9 46.5,10 31,11 6,12 36.794,13 20,14 7,15 27,16 6.548}
{0 CHEMBL2312475,1 42.58,2 30,3 37,4 438.61,5 67,6 3.2,7 20,8 17,9 48.5,10 33,11 8,12 39.848,13 20,14 9,15 29,16 6.79}
{0 CHEMBL2312476,1 44.819,2 28,3 41,4 472.62,5 69,6 3.1,7 26,8 23,9 55.5,10 36,11 7,12 42.321,13 26,14 6,15 32,16 7.432}
{0 CHEMBL2312481,1 34.733,2 23,3 31,4 377.55,5 54,6 2,7 14,8 11,9 39.5,10 27,11 4,12 32.234,13 14,14 8,15 22,16 6.767}
{0 CHEMBL2312482,1 38.256,2 27,3 33,4 405.61,5 60,6 1.8,7 14,8 11,9 41.5,10 29,11 6,12 35.288,13 14,14 10,15 24,16 7.071}
{0 CHEMBL2312483,1 40.495,2 25,3 37,4 439.62,5 62,6 1.8,7 20,8 17,9 48.5,10 32,11 6,12 37.761,13 20,14 7,15 27,16 7.367}
{0 CHEMBL2312484,1 35.972,2 21,3 33,4 399.55,5 54,6 2,7 20,8 17,9 44.5,10 29,11 5,12 33.707,13 20,14 4,15 24,16 6.783}
{0 CHEMBL2314172,1 40.506,2 25,3 37,4 435.55,5 62,6 5.2,7 28,8 27,9 51.5,10 33,11 8,12 38.487,13 25,14 4,15 29,16 4.824}
{0 CHEMBL2314173,1 31.483,2 19,3 27,4 374.91,5 46,6 6.8,7 17,8 16,9 36,10 25,11 6,12 29.427,13 15,14 5,15 20,16 4.824}
{0 CHEMBL2314176,1 32.341,2 18,3 28,4 409.35,5 46,6 6.8,7 17,8 16,9 37,10 26,11 6,12 30.255,13 15,14 5,15 20,16 5.387}
{0 CHEMBL2314177,1 32.722,2 17,3 30,4 396.91,5 47,6 6.8,7 22,8 21,9 41.5,10 27,11 6,12 30.9,13 19,14 3,15 22,16 5.167}
{0 CHEMBL2314191,1 29.08,2 18,3 26,4 343.83,5 44,6 7.1,7 17,8 16,9 35,10 24,11 6,12 27.735,13 15,14 4,15 19,16 4.824}
{0 CHEMBL2314193,1 30.841,2 20,3 27,4 357.86,5 47,6 6.7,7 17,8 16,9 36,10 25,11 6,12 29.261,13 15,14 5,15 20,16 4.824}
{0 CHEMBL2314198,1 31.222,2 19,3 29,4 345.42,5 48,6 6.7,7 22,8 21,9 40.5,10 26,11 6,12 29.907,13 19,14 3,15 22,16 4.824}
{0 CHEMBL2314208,1 29.938,2 17,3 27,4 378.27,5 44,6 7.1,7 17,8 16,9 36,10 25,11 6,12 28.562,13 15,14 4,15 19,16 4.824}
{0 CHEMBL2314209,1 31.699,2 19,3 28,4 392.3,5 47,6 6.7,7 17,8 16,9 37,10 26,11 6,12 30.089,13 15,14 5,15 20,16 4.824}
{0 CHEMBL2314210,1 32.08,2 18,3 30,4 379.86,5 48,6 6.7,7 22,8 21,9 41.5,10 27,11 6,12 30.735,13 19,14 3,15 22,16 5.167}
{0 CHEMBL2314503,1 32.603,2 22,3 28,4 371.89,5 50,6 6.3,7 17,8 16,9 37,10 26,11 6,12 30.788,13 15,14 6,15 21,16 4.824}
{0 CHEMBL2314504,1 32.983,2 21,3 30,4 359.45,5 51,6 6.3,7 22,8 21,9 41.5,10 27,11 6,12 31.434,13 19,14 4,15 23,16 4.824}
{0 CHEMBL2314516,1 31.864,2 18,3 29,4 362.47,5 47,6 6.8,7 22,8 21,9 40.5,10 26,11 6,12 30.073,13 19,14 3,15 22,16 4.824}
{0 CHEMBL2314519,1 30.671,2 18,3 29,4 346.4,5 47,6 9.1,7 22,8 21,9 40.5,10 26,11 6,12 29.6,13 19,14 3,15 22,16 4.824}
{0 CHEMBL2322020,1 75.614,2 46,3 70,4 960.63,5 116,6 4.5,7 35,8 30,9 90,10 64,11 16,12 72.235,13 29,14 15,15 44,16 7.658}
{0 CHEMBL2322021,1 76.842,2 48,3 69,4 963.1,5 117,6 3.6,7 34,8 30,9 88,10 63,11 16,12 72.492,13 28,14 16,15 44,16 7.699}
{0 CHEMBL2322022,1 77.558,2 48,3 72,4 996.66,5 120,6 3.5,7 34,8 30,9 91,10 66,11 16,12 74.341,13 28,14 17,15 45,16 7.208}
{0 CHEMBL2325757,1 78.262,2 48,3 71,4 958.68,5 119,6 6.2,7 42,8 35,9 95.5,10 65,11 18,12 74.121,13 34,14 11,15 45,16 8.301}
{0 CHEMBL2325758,1 75.154,2 47,3 68,4 895.59,5 115,6 5.5,7 40,8 35,9 90.5,10 62,11 17,12 71.198,13 34,14 11,15 45,16 8.215}
{0 CHEMBL2325759,1 75.154,2 47,3 68,4 895.59,5 115,6 5.5,7 40,8 35,9 90.5,10 62,11 17,12 71.198,13 34,14 11,15 45,16 8.229}
{0 CHEMBL2325760,1 75.358,2 47,3 68,4 895.58,5 115,6 6.4,7 40,8 35,9 90.5,10 62,11 17,12 71.397,13 35,14 11,15 46,16 8.328}
{0 CHEMBL2325761,1 81.194,2 54,3 71,4 936.69,5 125,6 5,7 40,8 35,9 93.5,10 65,11 19,12 76.284,13 35,14 14,15 49,16 8.086}
{0 CHEMBL2325762,1 82.955,2 56,3 72,4 950.72,5 128,6 4.9,7 40,8 35,9 94.5,10 66,11 20,12 77.81,13 35,14 15,15 50,16 7.796}
{0 CHEMBL2325763,1 84.302,2 55,3 74,4 999.78,5 129,6 5.7,7 42,8 35,9 98.5,10 68,11 19,12 79.207,13 35,14 14,15 49,16 8.155}
{0 CHEMBL2325764,1 86.063,2 57,3 75,4 1013.81,5 132,6 5.6,7 42,8 35,9 99.5,10 69,11 19,12 80.734,13 35,14 15,15 50,16 8.161}
{0 CHEMBL2325765,1 84.961,2 57,3 75,4 977.75,5 132,6 4.8,7 40,8 35,9 97.5,10 68,11 17,12 79.832,13 35,14 16,15 51,16 8.027}
{0 CHEMBL2325766,1 82.54,2 53,3 73,4 985.75,5 126,6 5.8,7 42,8 35,9 97.5,10 67,11 18,12 77.68,13 35,14 13,15 48,16 8.301}
{0 CHEMBL2325767,1 76.62,2 49,3 67,4 899.06,5 116,6 3.6,7 39,8 35,9 88.5,10 61,11 16,12 71.628,13 34,14 12,15 46,16 7.921}
{0 CHEMBL2325768,1 77.336,2 49,3 70,4 932.62,5 119,6 3.5,7 39,8 35,9 91.5,10 64,11 16,12 73.477,13 34,14 13,15 47,16 7.886}
{0 CHEMBL2325769,1 77.006,2 49,3 68,4 889.63,5 117,6 3.6,7 40,8 35,9 91.5,10 62,11 16,12 72.295,13 34,14 12,15 47,16 8.347}
{0 CHEMBL2325770,1 77.484,2 47,3 72,4 962.6,5 119,6 5.3,7 40,8 35,9 94.5,10 66,11 17,12 74.38,13 35,14 12,15 47,16 8.222}
{0 CHEMBL2325771,1 76.768,2 47,3 69,4 929.04,5 116,6 5.5,7 40,8 35,9 91.5,10 63,11 17,12 72.531,13 35,14 11,15 46,16 8.328}
{0 CHEMBL2325772,1 71.484,2 45,3 64,4 837.55,5 109,6 3.9,7 39,8 35,9 85.5,10 58,11 16,12 67.241,13 33,14 10,15 43,16 7.745}
{0 CHEMBL2325773,1 71.484,2 45,3 64,4 837.55,5 109,6 3.9,7 39,8 35,9 85.5,10 58,11 16,12 67.241,13 33,14 10,15 43,16 7.495}
{0 CHEMBL2325774,1 73.245,2 47,3 65,4 851.58,5 112,6 3.8,7 39,8 35,9 86.5,10 59,11 16,12 68.768,13 33,14 11,15 44,16 7.824}
{0 CHEMBL2326037,1 73.245,2 47,3 65,4 851.58,5 112,6 3.8,7 39,8 35,9 86.5,10 59,11 16,12 68.768,13 33,14 11,15 44,16 7.585}
{0 CHEMBL2326038,1 70.932,2 44,3 64,4 838.53,5 108,6 4.9,7 39,8 35,9 85.5,10 58,11 16,12 66.935,13 33,14 10,15 43,16 7.658}
{0 CHEMBL2326039,1 78.262,2 48,3 71,4 958.68,5 119,6 6.2,7 42,8 35,9 95.5,10 65,11 18,12 74.121,13 34,14 11,15 45,16 8.081}
{0 CHEMBL2326040,1 78.222,2 51,3 69,4 907.65,5 120,6 4.4,7 40,8 35,9 91.5,10 63,11 17,12 73.537,13 35,14 12,15 47,16 7.854}
{0 CHEMBL2326041,1 86.722,2 59,3 76,4 991.78,5 135,6 4.7,7 40,8 35,9 98.5,10 69,11 18,12 81.359,13 35,14 17,15 52,16 7.824}
{0 CHEMBL2326745,1 75.984,2 49,3 68,4 928.66,5 117,6 3.6,7 34,8 30,9 87,10 62,11 16,12 71.664,13 28,14 16,15 44,16 7.62}
{0 CHEMBL2326746,1 75.921,2 48,3 69,4 946.65,5 117,6 3.6,7 34,8 30,9 88,10 63,11 16,12 72.047,13 28,14 16,15 44,16 7.131}
{0 CHEMBL2326747,1 77.745,2 51,3 69,4 942.69,5 120,6 3.5,7 34,8 30,9 88,10 63,11 16,12 73.191,13 28,14 17,15 45,16 6.939}
{0 CHEMBL2333140,1 30.903,2 13,3 30,4 412.87,5 43,6 9.8,7 22,8 18,9 43,10 28,11 6,12 30.077,13 20,15 20,16 6.301}
{0 CHEMBL2333153,1 29.563,2 19,3 27,4 317.42,5 46,6 2.3,7 18,8 15,9 37.5,10 24,11 3,12 27.993,13 17,14 3,15 20,16 5.329}
{0 CHEMBL2333154,1 32.727,2 11,3 31,4 535.63,5 42,6 10,7 21,8 18,9 43,10 29,11 4,12 31.263,13 19,15 19,16 5.387}
{0 CHEMBL2333155,1 66.921,2 42,3 59,4 784.47,5 101,6 5.2,7 35,8 30,9 79,10 54,11 15,12 62.892,13 31,14 10,15 41,16 7.678}
{0 CHEMBL266944,1 73.148,2 48,3 64,4 857.18,5 112,6 6.5,7 37,8 30,9 86,10 59,11 17,12 68.756,13 31,14 12,15 43,16 6.337}
{0 CHEMBL268908,1 66.495,2 47,3 57,4 762.05,5 104,6 7,7 29,8 24,9 74,10 53,11 17,12 62.548,13 25,14 14,15 39,16 6.824}
{0 CHEMBL27963,1 42.614,2 32,3 36,4 484.6,5 68,6 10.4,7 16,8 12,9 46,10 35,11 12,12 40.948,13 16,14 10,15 26,16 4.523}
{0 CHEMBL281240,1 40.779,2 37,3 30,4 419.63,5 67,6 6,7 9,8 6,9 36,10 30,11 10,12 37.879,13 9,14 14,15 23,16 5.48}
{0 CHEMBL28137,1 41.989,2 38,3 31,4 434.64,5 69,6 7.2,7 9,8 6,9 37,10 31,11 11,12 39.099,13 9,14 15,15 24,16 6.107}
{0 CHEMBL282624,1 42.466,2 34,3 34,4 454.62,5 68,6 7.5,7 15,8 12,9 43,10 33,11 10,12 40.046,13 15,14 11,15 26,16 5.994}
{0 CHEMBL284686,1 38.466,2 34,3 29,4 406.58,5 63,6 7.9,7 9,8 6,9 35,10 29,11 10,12 36.046,13 9,14 13,15 22,16 5.732}
{0 CHEMBL28478,1 47.228,2 36,3 39,4 504.68,5 75,6 6.8,7 20,8 17,9 50.5,10 37,11 10,12 44.572,13 19,14 11,15 30,16 5.117}
{0 CHEMBL28504,1 36.705,2 32,3 28,4 392.55,5 60,6 8.3,7 9,8 6,9 34,10 28,11 9,12 34.519,13 9,14 12,15 21,16 4.96}
{0 CHEMBL286715,1 40.228,2 36,3 30,4 420.61,5 66,6 7.6,7 9,8 6,9 36,10 30,11 10,12 37.572,13 9,14 14,15 23,16 6.076}
{0 CHEMBL286730,1 45.659,2 40,3 35,4 492.68,5 75,6 9.3,7 10,8 6,9 42,10 35,11 13,12 43.056,13 10,14 16,15 26,16 4.523}
{0 CHEMBL288542,1 28.727,2 17,3 26,4 409.26,5 43,6 11.9,7 10,8 6,9 34,10 25,11 7,12 27.856,13 10,14 6,15 17,16 4.23}
{0 CHEMBL28872,1 38.466,2 34,3 29,4 406.58,5 63,6 7.9,7 9,8 6,9 35,10 29,11 10,12 36.046,13 9,14 13,15 22,16 5.748}
{0 CHEMBL28926,1 42.466,2 34,3 34,4 454.62,5 68,6 7.5,7 15,8 12,9 43,10 33,11 10,12 40.046,13 15,14 11,15 26,16 4.962}
{0 CHEMBL28938,1 42.137,2 36,3 33,4 464.62,5 69,6 10.1,7 10,8 6,9 40,10 33,11 12,12 40.002,13 10,14 14,15 24,16 4.523}
{0 CHEMBL29180,1 22.159,2 16,3 19,4 264.31,5 35,6 11.4,7 9,8 6,9 25,10 19,11 5,12 21.59,13 9,14 4,15 13,16 4.523}
{0 CHEMBL29843,1 47.375,2 34,3 41,4 534.66,5 75,6 9.6,7 21,8 17,9 53.5,10 39,11 12,12 45.475,13 20,14 10,15 30,16 4.523}
{0 CHEMBL330959,1 59.478,2 44,3 46,4 611.75,5 90,7 26,8 24,9 60,10 43,11 14,12 54.287,13 28,14 11,15 39,16 5}
{0 CHEMBL334615,1 19.534,2 10,3 20,4 262.23,5 30,6 20.7,7 10,8 6,9 27,10 19,11 2,12 19.923,13 12,14 1,15 13,16 5.585}
{0 CHEMBL335265,1 27.347,2 14,3 23,4 400.34,5 37,6 8.3,7 10,8 6,9 30,10 22,11 4,12 25.253,13 11,14 4,15 15,16 5.03}
{0 CHEMBL339835,1 17.773,2 8,3 19,4 248.2,5 27,6 23.1,7 10,8 6,9 26,10 18,11 1,12 18.396,13 12,15 12,16 5.131}
{0 CHEMBL370835,1 59.824,2 45,3 49,4 667.98,5 94,6 5.5,7 23,8 18,9 63,10 46,11 15,12 55.591,13 19,14 15,15 34,16 5.689}
{0 CHEMBL370836,1 56.302,2 41,3 47,4 639.92,5 88,6 5.9,7 23,8 18,9 61,10 44,11 14,12 52.538,13 19,14 13,15 32,16 4.682}
{0 CHEMBL370837,1 69.711,2 49,3 61,4 804.09,5 110,6 7.6,7 29,8 24,9 78,10 56,11 18,12 65.789,13 25,14 16,15 41,16 5.338}
{0 CHEMBL371861,1 43.136,2 22,3 41,4 551.66,5 63,6 8.3,7 29,8 24,9 58,10 38,11 10,12 41.664,13 25,14 2,15 27,16 5.301}
{0 CHEMBL372834,1 51.398,2 30,3 47,4 634.79,5 77,6 9.5,7 30,8 24,9 65,10 44,11 12,12 49.312,13 26,14 5,15 31,16 5}
{0 CHEMBL373544,1 62.546,2 40,3 55,4 724.98,5 95,6 5.5,7 31,8 24,9 75,10 51,11 14,12 59.032,13 27,14 10,15 38,16 5.959}
{0 CHEMBL373577,1 62.04,2 47,3 51,4 698.01,5 98,6 6.3,7 23,8 18,9 65,10 48,11 16,12 57.833,13 19,14 16,15 35,16 6.341}
{0 CHEMBL373631,1 61.239,2 40,3 54,4 717.96,5 94,6 5.6,7 30,8 24,9 72,10 50,11 14,12 57.921,13 27,14 10,15 37,16 6.364}
{0 CHEMBL373712,1 64.279,2 45,3 55,4 732.02,5 100,6 6.3,7 29,8 24,9 72,10 51,11 16,12 60.306,13 25,14 13,15 38,16 6.496}
{0 CHEMBL373713,1 63.762,2 42,3 57,4 743,5 99,6 6.4,7 30,8 24,9 75,10 52,11 14,12 60.274,13 26,14 12,15 38,16 4.301}
{0 CHEMBL374097,1 71.114,2 52,3 60,4 785.14,5 112,6 4.7,7 29,8 24,9 77,10 55,11 16,12 66.193,13 25,14 17,15 42,16 6.469}
{0 CHEMBL374214,1 62.159,2 40,3 54,4 734.41,5 94,6 5.6,7 30,8 24,9 72,10 50,11 14,12 58.365,13 27,14 10,15 37,16 6.25}
{0 CHEMBL374270,1 63.802,2 49,3 52,4 712.04,5 101,6 6.1,7 23,8 18,9 66,10 49,11 18,12 59.36,13 19,14 17,15 36,16 5.097}
{0 CHEMBL374271,1 66.563,2 51,3 55,4 738.08,5 106,6 5.9,7 23,8 18,9 69,10 51,11 16,12 61.886,13 19,14 19,15 38,16 6.509}
{0 CHEMBL374303,1 62.159,2 40,3 54,4 734.41,5 94,6 5.6,7 30,8 24,9 72,10 50,11 14,12 58.365,13 27,14 10,15 37,16 6.306}
{0 CHEMBL374309,1 68.83,2 46,3 60,4 779.08,5 106,6 5,7 35,8 30,9 80,10 55,11 16,12 64.613,13 31,14 11,15 42,16 7.484}
{0 CHEMBL374941,1 60.546,2 40,3 53,4 700.96,5 93,6 5.6,7 30,8 24,9 71,10 49,11 14,12 57.032,13 26,14 10,15 36,16 5.637}
{0 CHEMBL375299,1 69.052,2 49,3 60,4 788.1,5 109,6 5.8,7 29,8 24,9 77,10 55,11 16,12 64.876,13 25,14 15,15 40,16 6.367}
{0 CHEMBL375628,1 65.137,2 44,3 56,4 766.46,5 100,6 6.3,7 29,8 24,9 73,10 52,11 16,12 61.133,13 25,14 13,15 38,16 6.686}
{0 CHEMBL375770,1 66.04,2 47,3 56,4 746.05,5 103,6 6.1,7 29,8 24,9 73,10 52,11 16,12 61.833,13 25,14 14,15 39,16 6.824}
{0 CHEMBL375841,1 65.137,2 44,3 56,4 766.46,5 100,6 6.3,7 29,8 24,9 73,10 52,11 16,12 61.133,13 25,14 13,15 38,16 6.549}
{0 CHEMBL375842,1 64.216,2 44,3 56,4 750.01,5 100,6 6.3,7 29,8 24,9 73,10 52,11 16,12 60.689,13 25,14 13,15 38,16 6.745}
{0 CHEMBL376254,1 62.875,2 40,3 57,4 767.97,5 97,6 5.4,7 30,8 24,9 75,10 53,11 14,12 60.214,13 27,14 11,15 38,16 6.674}
{0 CHEMBL376408,1 69.688,2 45,3 61,4 813.52,5 106,6 5,7 35,8 30,9 81,10 56,11 16,12 65.44,13 31,14 11,15 42,16 9.151}
{0 CHEMBL376409,1 76.353,2 50,3 67,4 855.18,5 117,6 4.5,7 41,8 36,9 90,10 61,11 17,12 71.666,13 37,14 11,15 48,16 7.329}
{0 CHEMBL376410,1 70.404,2 45,3 64,4 847.08,5 109,6 4.8,7 35,8 30,9 84,10 59,11 16,12 67.289,13 31,14 12,15 43,16 7.31}
{0 CHEMBL376659,1 63.517,2 43,3 55,4 730,5 98,6 6.4,7 30,8 24,9 73,10 51,11 15,12 59.779,13 27,14 11,15 38,16 6.321}
{0 CHEMBL376696,1 67.739,2 46,3 60,4 787.06,5 106,6 6.9,7 30,8 24,9 78,10 55,11 15,12 64.042,13 26,14 14,15 40,16 4.699}
{0 CHEMBL376921,1 61.307,2 42,3 53,4 702.98,5 95,6 5.5,7 29,8 24,9 70,10 49,11 15,12 57.559,13 25,14 11,15 36,16 5.959}
{0 CHEMBL378808,1 53.466,2 34,3 47,4 634.84,5 81,6 7.7,7 29,8 24,9 64,10 44,11 14,12 50.651,13 25,14 7,15 32,16 6.089}
{0 CHEMBL378820,1 59.517,2 43,3 51,4 681.96,5 94,6 6.7,7 23,8 18,9 65,10 47,11 13,12 55.779,13 19,14 15,15 34,16 5.218}
{0 CHEMBL379013,1 55.995,2 39,3 48,4 653.9,5 87,6 7.1,7 24,8 18,9 63,10 45,11 12,12 52.726,13 20,14 12,15 32,16 5.709}
{0 CHEMBL379173,1 48.983,2 35,3 43,4 577.58,5 78,6 4.1,7 14,8 12,9 51,10 39,11 7,12 46.224,13 14,14 15,15 29,16 4.301}
{0 CHEMBL379895,1 56.302,2 41,3 47,4 639.92,5 88,6 5.9,7 23,8 18,9 61,10 44,11 13,12 52.538,13 19,14 13,15 32,16 5.219}
{0 CHEMBL380433,1 55.228,2 36,3 48,4 648.87,5 84,6 7.4,7 29,8 24,9 65,10 45,11 15,12 52.177,13 25,14 8,15 33,16 6.556}
{0 CHEMBL380502,1 58.063,2 43,3 48,4 653.95,5 91,6 5.7,7 23,8 18,9 62,10 45,11 14,12 54.064,13 19,14 14,15 33,16 4.851}
{0 CHEMBL380709,1 66.495,2 47,3 57,4 762.05,5 104,6 7,7 29,8 24,9 74,10 53,11 19,12 62.548,13 25,14 14,15 39,16 5.281}
{0 CHEMBL382018,1 54.921,2 34,3 49,4 662.85,5 83,6 8.8,7 30,8 24,9 67,10 46,11 14,12 52.365,13 26,14 7,15 33,16 6}
{0 CHEMBL382361,1 53.159,2 32,3 48,4 648.82,5 80,6 9.1,7 30,8 24,9 66,10 45,11 13,12 50.839,13 26,14 6,15 32,16 5}
{0 CHEMBL382648,1 68.256,2 49,3 58,4 776.08,5 107,6 6.8,7 29,8 24,9 75,10 54,11 19,12 64.074,13 25,14 15,15 40,16 5.294}
{0 CHEMBL383229,1 48.25,2 32,3 42,4 568.78,5 74,6 7,7 23,8 18,9 56,10 39,11 10,12 45.409,13 19,14 9,15 28,16 6.186}
{0 CHEMBL383399,1 66.188,2 45,3 58,4 776.03,5 103,6 8.1,7 30,8 24,9 76,10 54,11 17,12 62.736,13 26,14 13,15 39,16 5.505}
{0 CHEMBL384217,1 71.046,2 48,3 62,4 809.11,5 110,6 5.7,7 35,8 30,9 82,10 57,11 17,12 66.854,13 31,14 12,15 43,16 6.585}
{0 CHEMBL384218,1 71.046,2 48,3 62,4 809.11,5 110,6 5.7,7 35,8 30,9 82,10 57,11 17,12 66.854,13 31,14 12,15 43,16 7.373}
{0 CHEMBL385101,1 61.239,2 40,3 54,4 717.96,5 94,6 5.6,7 30,8 24,9 72,10 50,11 14,12 57.921,13 27,14 10,15 37,16 6.352}
{0 CHEMBL385104,1 61,2 40,3 54,4 716.96,5 94,6 6.7,7 30,8 24,9 72,10 50,11 14,12 57.747,13 26,14 10,15 36,16 4.836}
{0 CHEMBL385119,1 63.523,2 44,3 55,4 733.01,5 99,6 6.3,7 29,8 24,9 72,10 51,11 16,12 59.801,13 25,14 12,15 37,16 6.409}
{0 CHEMBL386955,1 65.523,2 44,3 58,4 757.03,5 102,6 6.2,7 30,8 24,9 76,10 53,11 15,12 61.801,13 26,14 13,15 39,16 5.631}
{0 CHEMBL387141,1 51.773,2 36,3 44,4 596.84,5 80,6 6.5,7 23,8 18,9 58,10 41,11 10,12 48.463,13 19,14 11,15 30,16 6.386}
{0 CHEMBL387142,1 63.069,2 44,3 54,4 717.01,5 98,6 5.3,7 29,8 24,9 71,10 50,11 15,12 59.086,13 25,14 12,15 37,16 6.621}
{0 CHEMBL408194,1 29.563,2 19,3 27,4 317.42,5 46,6 2.3,7 18,8 15,9 37.5,10 24,11 3,12 27.993,13 17,14 3,15 20,16 6.046}
{0 CHEMBL410802,1 203.314,2 169,3 170,4 2438.11,5 339,6 10,7 36,8 5,9 203.5,10 170,11 85,12 196.535,13 34,14 66,15 100,16 7.187}
{0 CHEMBL425792,1 32.659,2 24,3 28,4 372.46,5 52,6 9.8,7 10,8 6,9 36,10 27,11 9,12 31.412,13 10,14 9,15 20,16 4.151}
{0 CHEMBL426535,1 65.137,2 44,3 56,4 766.46,5 100,6 6.3,7 29,8 24,9 73,10 52,11 16,12 61.133,13 25,14 13,15 38,16 6.638}
{0 CHEMBL426558,1 65.631,2 44,3 56,4 810.91,5 100,6 6.3,7 29,8 24,9 73,10 52,11 16,12 61.331,13 25,14 13,15 38,16 7.111}
{0 CHEMBL433422,1 40.228,2 36,3 30,4 420.61,5 66,6 7.6,7 9,8 6,9 36,10 30,11 10,12 37.572,13 9,14 14,15 23,16 5.233}
{0 CHEMBL434952,1 51.154,2 31,3 46,4 621.79,5 77,6 9.5,7 29,8 24,9 63,10 43,11 14,12 48.817,13 25,14 6,15 31,16 5.529}
{0 CHEMBL437146,1 62.006,2 41,3 55,4 731.98,5 96,6 6.5,7 30,8 24,9 73,10 51,11 14,12 58.768,13 26,14 10,15 36,16 4.301}
{0 CHEMBL437148,1 65.625,2 44,3 57,4 781.08,5 101,6 7.2,7 31,8 24,9 76,10 53,11 16,12 61.702,13 25,14 12,15 37,16 5.26}
{0 CHEMBL439495,1 63.864,2 42,3 56,4 767.05,5 98,6 7.4,7 31,8 24,9 75,10 52,11 15,12 60.176,13 25,14 11,15 36,16 4.699}
{0 CHEMBL441321,1 146.12,2 125,3 120,4 1725.22,5 245,6 9.8,7 23,9 143,10 121,11 60,12 141.03,13 23,14 49,15 72,16 8.456}
{0 CHEMBL443684,1 80.927,2 55,3 71,4 974.73,5 126,6 5,7 30,8 24,9 89,10 65,11 16,12 76.158,13 27,14 20,15 47,16 7.444}
{0 CHEMBL446334,1 150.12,2 125,3 125,4 1773.26,5 250,6 9.6,7 29,8 6,9 151,10 125,11 61,12 145.03,13 29,14 47,15 76,16 6.648}
{0 CHEMBL448237,1 50.557,2 32,3 46,4 590.2,5 78,6 4.1,7 21,8 17,9 58.5,10 41,11 8,12 47.641,13 21,14 10,15 31,16 5.18}
{0 CHEMBL448672,1 149.512,2 122,3 127,4 1804.23,5 249,6 10.4,7 31,8 6,9 155,10 127,11 61,12 145.428,13 29,14 46,15 75,16 5.834}
{0 CHEMBL448869,1 145.848,2 121,3 123,4 1749.2,5 244,6 9.8,7 28,8 5,9 148.5,10 123,11 60,12 141.493,13 26,14 46,15 72,16 5.291}
{0 CHEMBL449695,1 55.08,2 36,3 50,4 630.27,5 86,6 3.8,7 21,8 17,9 62.5,10 44,11 9,12 51.695,13 21,14 13,15 34,16 5.108}
{0 CHEMBL450460,1 153.12,2 125,3 129,4 1809.29,5 254,6 9.5,7 34,8 11,9 157.5,10 128,11 60,12 148.03,13 33,14 46,15 79,16 6.524}
{0 CHEMBL451196,1 50.557,2 32,3 46,4 590.2,5 78,6 4.1,7 21,8 17,9 58.5,10 41,11 8,12 47.641,13 21,14 10,15 31,16 5.244}
{0 CHEMBL451588,1 153.12,2 125,3 129,4 1809.29,5 254,6 9.5,7 34,8 11,9 157.5,10 128,11 60,12 148.03,13 33,14 46,15 79,16 6.903}
{0 CHEMBL452612,1 148.359,2 123,3 124,4 1759.23,5 247,6 9.7,7 29,8 6,9 150,10 124,11 60,12 143.503,13 29,14 46,15 75,16 6.393}
{0 CHEMBL455503,1 146.12,2 125,3 120,4 1725.22,5 245,6 9.8,7 23,9 143,10 121,11 61,12 141.03,13 23,14 49,15 72,16 6.184}
{0 CHEMBL455535,1 140.836,2 119,3 117,4 1683.13,5 236,6 10.1,7 23,9 140,10 118,11 58,12 136.45,13 23,14 46,15 69,16 4.77}
{0 CHEMBL467309,1 49.091,2 40,3 42,4 504.74,5 82,6 3.9,7 10,8 6,9 49,10 37,11 7,12 45.712,13 12,14 18,15 30,16 4}
{0 CHEMBL467508,1 49.091,2 40,3 42,4 504.74,5 82,6 3.9,7 10,8 6,9 49,10 37,11 7,12 45.712,13 12,14 18,15 30,16 4}
{0 CHEMBL467709,1 44.563,2 35,3 39,4 461.66,5 74,6 4.3,7 10,8 6,9 46,10 34,11 5,12 41.637,13 12,14 16,15 28,16 4}
{0 CHEMBL469424,1 26.727,2 16,3 26,4 348.33,5 42,6 19.5,7 14,8 12,9 34,10 25,11 6,12 26.933,13 14,14 3,15 17,16 4.266}
{0 CHEMBL470541,1 49.779,2 37,3 44,4 527.72,5 81,6 5.3,7 16,8 12,9 54,10 39,11 8,12 46.879,13 18,14 14,15 32,16 4}
{0 CHEMBL481409,1 27.762,2 18,3 24,4 290.38,5 42,6 5,7 18,8 18,9 33,10 22,11 4,12 26.171,13 18,14 2,15 20,16 5.071}
{0 CHEMBL498869,1 153.12,2 125,3 129,4 1809.29,5 254,6 9.5,7 34,8 11,9 157.5,10 128,11 60,12 148.03,13 33,14 46,15 79,16 6.896}
{0 CHEMBL500002,1 150.643,2 129,3 124,4 1765.29,5 253,6 9.5,7 23,9 147,10 124,11 60,12 145.084,13 23,14 52,15 75,16 6.66}
{0 CHEMBL501005,1 149.217,2 122,3 125,4 1793.67,5 247,6 9.7,7 29,8 6,9 151,10 125,11 60,12 144.331,13 29,14 46,15 75,16 7.252}
{0 CHEMBL501241,1 153.12,2 125,3 129,4 1809.29,5 254,6 9.5,7 34,8 11,9 157.5,10 128,11 60,12 148.03,13 33,14 46,15 79,16 7.114}
{0 CHEMBL501427,1 52.694,2 46,3 43,4 542.78,5 89,6 8.2,7 5,9 48,10 39,12 49.12,13 8,14 24,15 32,16 5.022}
{0 CHEMBL501763,1 55.08,2 36,3 50,4 630.27,5 86,6 3.8,7 21,8 17,9 62.5,10 44,11 9,12 51.695,13 21,14 13,15 34,16 5.244}
{0 CHEMBL501793,1 53.716,2 36,3 50,4 593.75,5 86,6 5,7 22,8 18,9 63,10 44,11 7,12 51.262,13 24,14 12,15 36,16 4}
{0 CHEMBL502211,1 55.08,2 36,3 50,4 630.27,5 86,6 3.8,7 21,8 17,9 62.5,10 44,11 8,12 51.695,13 21,14 13,15 34,16 5.222}
{0 CHEMBL502454,1 48.245,2 29,3 45,4 577.15,5 74,6 5.8,7 21,8 17,9 57.5,10 40,11 8,12 45.808,13 21,14 9,15 30,16 4}
{0 CHEMBL503642,1 148.359,2 123,3 124,4 1759.23,5 247,6 9.7,7 29,8 6,9 150,10 124,11 60,12 143.503,13 29,14 46,15 75,16 5.669}
{0 CHEMBL504112,1 146.12,2 125,3 120,4 1725.22,5 245,6 9.8,7 23,9 143,10 121,11 61,12 141.03,13 23,14 49,15 72,16 6.498}
{0 CHEMBL504719,1 147.603,2 122,3 124,4 1760.22,5 246,6 9.8,7 29,8 6,9 150,10 124,11 60,12 142.998,13 28,14 46,15 74,16 5.011}
{0 CHEMBL504721,1 156.217,2 122,3 134,4 1877.74,5 256,6 9.4,7 40,8 17,9 165.5,10 132,11 60,12 151.331,13 39,14 43,15 82,16 7.276}
{0 CHEMBL504810,1 150.643,2 129,3 124,4 1765.29,5 253,6 9.5,7 23,9 147,10 124,11 60,12 145.084,13 23,14 52,15 75,16 7.237}
{0 CHEMBL504811,1 151.018,2 122,3 125,4 1885.12,5 247,6 9.7,7 29,8 6,9 151,10 125,11 60,12 144.82,13 29,14 46,15 75,16 7.347}
{0 CHEMBL505043,1 142.598,2 121,3 118,4 1697.16,5 239,6 10,7 23,9 141,10 119,11 59,12 137.977,13 23,14 47,15 70,16 4.824}
{0 CHEMBL505165,1 140.836,2 119,3 117,4 1683.13,5 236,6 10.1,7 23,9 140,10 118,11 58,12 136.45,13 23,14 46,15 69,16 4.032}
{0 CHEMBL505706,1 153.12,2 125,3 129,4 1809.29,5 254,6 9.5,7 34,8 11,9 157.5,10 128,11 60,12 148.03,13 33,14 46,15 79,16 5}
{0 CHEMBL506024,1 150.12,2 125,3 125,4 1773.26,5 250,6 9.6,7 29,8 6,9 151,10 125,11 61,12 145.03,13 29,14 47,15 76,16 6.517}
{0 CHEMBL506360,1 48.245,2 29,3 45,4 577.15,5 74,6 5.8,7 21,8 17,9 57.5,10 40,11 8,12 45.808,13 21,14 9,15 30,16 4}
{0 CHEMBL506389,1 147.882,2 127,3 121,4 1739.25,5 248,6 9.6,7 23,9 144,10 122,11 62,12 142.557,13 23,14 50,15 73,16 7.149}
{0 CHEMBL506763,1 49.279,2 33,3 44,4 566.57,5 77,6 4.2,7 16,8 12,9 54,10 39,11 6,12 46.292,13 18,14 13,15 31,16 4}
{0 CHEMBL507043,1 146.12,2 125,3 120,4 1725.22,5 245,6 9.8,7 23,9 143,10 121,11 61,12 141.03,13 23,14 49,15 72,16 6.928}
{0 CHEMBL507140,1 148.814,2 123,3 125,4 1775.23,5 248,6 10.1,7 29,8 6,9 151,10 125,11 60,12 144.218,13 29,14 46,15 75,16 6.799}
{0 CHEMBL507169,1 155.882,2 127,3 131,4 1835.33,5 258,6 9.3,7 35,8 12,9 160,10 130,11 61,12 150.557,13 35,14 46,15 81,16 6.573}
{0 CHEMBL507173,1 150.575,2 125,3 126,4 1789.26,5 251,6 10,7 29,8 6,9 152,10 126,11 60,12 145.745,13 29,14 47,15 76,16 5.442}
{0 CHEMBL508232,1 58.222,2 51,3 48,4 597.87,5 99,6 7.4,7 5,9 53,10 43,12 54.195,13 8,14 27,15 35,16 5.301}
{0 CHEMBL508385,1 151.365,2 124,3 128,4 1798.27,5 252,6 9.6,7 33,8 10,9 156,10 127,11 60,12 146.525,13 31,14 46,15 77,16 6.426}
{0 CHEMBL508545,1 155.882,2 127,3 131,4 1835.33,5 258,6 9.3,7 35,8 12,9 160,10 130,11 61,12 150.557,13 35,14 46,15 81,16 5.904}
{0 CHEMBL508790,1 146.007,2 123,3 120,4 1743.26,5 243,6 9.8,7 23,9 143,10 121,11 61,12 140.69,13 23,14 48,15 71,16 5.844}
{0 CHEMBL509472,1 55.54,2 39,3 50,4 589.79,5 89,6 4.8,7 22,8 18,9 63,10 44,11 8,12 52.406,13 24,14 13,15 37,16 4}
{0 CHEMBL510724,1 55.08,2 36,3 50,4 630.27,5 86,6 3.8,7 21,8 17,9 62.5,10 44,11 8,12 51.695,13 21,14 13,15 34,16 4.959}
{0 CHEMBL510828,1 47.455,2 30,3 44,4 570.53,5 74,6 4.3,7 16,8 12,9 54,10 39,11 5,12 45.149,13 18,14 12,15 30,16 4}
{0 CHEMBL510860,1 149.512,2 122,3 127,4 1804.23,5 249,6 10.4,7 31,8 6,9 155,10 127,11 61,12 145.428,13 29,14 46,15 75,16 6.226}
{0 CHEMBL51483,1 45.057,2 30,3 41,4 518.6,5 71,6 11.8,7 24,8 22,9 54,10 38,11 5,12 43.62,13 22,14 8,15 30,16 6.31}
{0 CHEMBL523927,1 47.716,2 42,3 38,4 486.71,5 80,6 7.8,7 5,9 43,10 35,12 44.352,13 9,14 20,15 29,16 4.91}
{0 CHEMBL524525,1 153.12,2 125,3 129,4 1809.29,5 254,6 9.5,7 34,8 11,9 157.5,10 128,11 60,12 148.03,13 33,14 46,15 79,16 5.887}
{0 CHEMBL524905,1 144.507,2 121,3 121,4 1741.17,5 242,6 10.7,7 24,9 145,10 122,11 61,12 140.406,13 24,14 47,15 71,16 5}
{0 CHEMBL525454,1 154.882,2 127,3 130,4 1823.32,5 257,6 9.4,7 34,8 11,9 158.5,10 129,11 61,12 149.557,13 33,14 47,15 80,16 6.456}
{0 CHEMBL525562,1 149.217,2 122,3 125,4 1793.67,5 247,6 9.7,7 29,8 6,9 151,10 125,11 60,12 144.331,13 29,14 46,15 75,16 6.699}
{0 CHEMBL525638,1 149.217,2 122,3 125,4 1793.67,5 247,6 9.7,7 29,8 6,9 151,10 125,11 60,12 144.331,13 29,14 46,15 75,16 6.445}
{0 CHEMBL526537,1 155.359,2 123,3 133,4 1843.3,5 256,6 9.4,7 40,8 17,9 164.5,10 131,11 60,12 150.503,13 39,14 43,15 82,16 7.268}
{0 CHEMBL526727,1 149.217,2 122,3 125,4 1793.67,5 247,6 9.7,7 29,8 6,9 151,10 125,11 60,12 144.331,13 29,14 46,15 75,16 7.42}
{0 CHEMBL526854,1 148.359,2 123,3 124,4 1759.23,5 247,6 9.7,7 29,8 6,9 150,10 124,11 60,12 143.503,13 29,14 46,15 75,16 7.268}
{0 CHEMBL538412,1 66.841,2 60,3 55,4 704.99,5 115,6 10,7 4,9 59,10 50,11 8,12 62.667,13 5,14 34,15 39,16 4}
{0 CHEMBL538616,1 62.114,2 40,3 57,4 700.84,5 97,6 8.7,7 36,8 34,9 76,10 52,11 9,12 59.77,13 34,14 8,15 42,16 6.409}
{0 CHEMBL538895,1 68.603,2 62,3 56,4 719.02,5 118,6 9.7,7 4,9 60,10 51,11 8,12 64.194,13 5,14 35,15 40,16 5.143}
{0 CHEMBL539481,1 60.307,2 34,3 57,4 741.66,5 91,6 9.3,7 36,8 34,9 76,10 52,11 7,12 58.372,13 34,14 6,15 40,16 6.764}
{0 CHEMBL539907,1 56.978,2 52,3 45,4 572.86,5 97,6 7.5,7 4,9 49,10 41,11 6,12 52.7,13 5,14 29,15 34,16 4.75}
{0 CHEMBL539908,1 60.41,2 56,3 49,4 620.91,5 105,6 9,7 2,9 51,10 44,11 4,12 56.184,13 3,14 32,15 35,16 4}
{0 CHEMBL540988,1 57.069,2 52,3 44,4 552.87,5 96,6 5.4,7 5,9 49,10 40,11 4,12 52.271,13 7,14 28,15 35,16 4}
{0 CHEMBL541004,1 59.637,2 44,3 53,4 656.84,5 97,6 8.7,7 24,8 22,9 66,10 48,11 7,12 56.824,13 22,14 16,15 38,16 5.959}
{0 CHEMBL541427,1 60.591,2 36,3 59,4 696.8,5 95,6 9.1,7 36,8 34,9 78,10 52,11 5,12 58.717,13 34,14 8,15 42,16 6.071}
{0 CHEMBL541496,1 65.637,2 44,3 59,4 728.9,5 103,6 8.2,7 36,8 34,9 78,10 54,11 11,12 62.824,13 34,14 10,15 44,16 6.477}
{0 CHEMBL542004,1 67.148,2 62,3 54,4 691.01,5 116,6 9,7 3,9 57,10 49,11 7,12 62.479,13 4,14 35,15 39,16 4}
{0 CHEMBL550027,1 48.569,2 44,3 36,4 468.74,5 80,6 5.1,7 6,9 42,10 34,11 8,12 44.449,13 10,14 20,15 30,16 4}
{0 CHEMBL551288,1 42.148,2 30,3 37,4 462.58,5 67,6 9.4,7 22,8 22,9 48,10 34,11 3,12 40.191,13 20,14 8,15 28,16 5.601}
{0 CHEMBL552287,1 58.591,2 36,3 55,4 672.78,5 91,6 9.3,7 36,8 34,9 74,10 50,11 9,12 56.717,13 34,14 6,15 40,16 6.097}
{0 CHEMBL552716,1 70.057,2 62,3 58,4 747.03,5 120,6 10.4,7 5,9 63,10 53,11 10,12 65.908,13 6,14 35,15 41,16 4}
{0 CHEMBL552717,1 57.523,2 52,3 45,4 568.87,5 97,6 6.5,7 5,9 50,10 41,11 5,12 52.986,13 7,14 28,15 35,16 5.276}
{0 CHEMBL552735,1 53.671,2 34,3 49,4 586.72,5 83,6 7.7,7 34,8 34,9 66,10 44,11 7,12 51.244,13 32,14 6,15 38,16 5.456}
{0 CHEMBL553474,1 60.307,2 34,3 57,4 741.66,5 91,6 9.3,7 36,8 34,9 76,10 52,11 9,12 58.372,13 34,14 6,15 40,16 5.201}
{0 CHEMBL553855,1 70.364,2 64,3 57,4 733.05,5 121,6 9.5,7 4,9 61,10 52,11 9,12 65.72,13 5,14 36,15 41,16 4}
{0 CHEMBL554122,1 57.523,2 52,3 45,4 568.87,5 97,6 6.5,7 5,9 50,10 41,11 5,12 52.986,13 7,14 28,15 35,16 5.119}
{0 CHEMBL554545,1 65.637,2 44,3 59,4 728.9,5 103,6 8.2,7 36,8 34,9 78,10 54,11 7,12 62.824,13 34,14 10,15 44,16 6.097}
{0 CHEMBL555367,1 57.069,2 52,3 44,4 552.87,5 96,6 5.4,7 5,9 49,10 40,11 4,12 52.271,13 7,14 28,15 35,16 4}
{0 CHEMBL556082,1 48.569,2 44,3 36,4 468.74,5 80,6 5.1,7 6,9 42,10 34,11 8,12 44.449,13 10,14 20,15 30,16 4.967}
{0 CHEMBL557340,1 66.841,2 60,3 55,4 704.99,5 115,6 10,7 4,9 59,10 50,11 8,12 62.667,13 5,14 34,15 39,16 4.851}
{0 CHEMBL558462,1 55.523,2 52,3 43,4 544.85,5 95,6 6.6,7 3,9 46,10 39,11 5,12 50.986,13 4,14 29,15 33,16 4}
{0 CHEMBL560651,1 68.603,2 62,3 56,4 719.02,5 118,6 9.7,7 4,9 60,10 51,11 9,12 64.194,13 5,14 35,15 40,16 4}
{0 CHEMBL571296,1 26.04,2 15,3 24,4 337.47,5 39,6 5.4,7 12,8 10,9 31,10 22,11 5,12 24.545,13 8,14 5,15 13,16 4.44}
{0 CHEMBL578585,1 17.614,2 10,3 16,4 222.29,5 26,6 8,7 11,8 10,9 22,10 15,11 3,12 16.767,13 8,14 2,15 10,16 4.274}
{0 CHEMBL595134,1 27.926,2 13,3 28,4 331.42,5 41,6 2.7,7 15,8 11,9 38.5,10 24,11 1,12 26.6,13 14,14 4,15 19,16 6.204}
{0 CHEMBL596599,1 41.193,2 22,3 38,4 506.64,5 60,6 8.8,7 22,8 18,9 51,10 35,11 8,12 39.259,13 22,14 4,15 26,16 4}
{0 CHEMBL602758,1 26.636,2 12,3 28,4 332.33,5 40,6 10.8,7 16,8 12,9 39,10 25,11 2,12 26.536,13 17,14 1,15 19,16 5.292}
{0 CHEMBL605114,1 41.193,2 22,3 38,4 506.64,5 60,6 8.8,7 22,8 18,9 51,10 35,11 8,12 39.259,13 22,14 4,15 26,16 5.451}
{0 CHEMBL66953,1 16.318,2 8,3 17,4 220.19,5 25,6 20.8,7 9,8 6,9 23,10 16,12 16.681,13 11,15 11,16 5.658}
