"molecule_id","AMW","C.","H.","Me","Mi","Mp","Mv","MW","N.","nAB","nAT","nB","nBM","nBO","nBR","nBT","nC","nCL","nCsp","nCsp2","nCsp3","nDB","nF","nH","nHet","nHM","nI","nN","nO","nP","nS","nSK","nTB","nX","O.","RBF","RBN","SCBO","Se","Si","Sp","Sv","X.","pXC50"
{1 5.898,2 34.6,3 58,4 0.988,5 1.137,6 0.602,7 0.552,8 477.76,9 1.2,10 5,11 81,13 8,14 34,16 81,17 28,20 7,21 21,22 3,24 47,25 6,28 1,29 5,32 34,35 6.2,36 0.259,37 21,38 39.5,39 80.061,40 92.095,41 48.79,42 44.712,44 5.42}
{0 CHEMBL112566,1 5.794,2 37.5,3 58,4 0.979,5 1.131,6 0.618,7 0.561,8 509.85,9 1.1,10 11,11 88,13 13,14 38,16 89,17 33,20 12,21 21,22 2,24 51,25 4,28 1,29 3,32 37,35 3.4,36 0.236,37 21,38 45.5,39 86.174,40 99.507,41 54.404,42 49.336,44 5.155}
{0 CHEMBL112571,1 5.596,2 34.7,3 60,4 0.98,5 1.137,6 0.602,7 0.543,8 419.72,9 1.3,10 5,11 75,13 7,14 30,16 75,17 26,20 6,21 20,22 2,24 45,25 4,28 1,29 3,32 30,35 4,36 0.267,37 20,38 34.5,39 73.523,40 85.261,41 45.12,42 40.755,44 4.854}
{0 CHEMBL112593,1 5.131,2 31.8,3 63.6,4 0.973,5 1.144,6 0.586,7 0.52,8 338.65,9 3,11 66,13 1,14 24,16 66,17 21,20 1,21 20,22 1,24 42,25 3,28 2,29 1,32 24,35 1.5,36 0.242,37 16,38 25,39 64.203,40 75.51,41 38.694,42 34.294,44 4.886}
{0 CHEMBL114214,1 5.794,2 37.5,3 58,4 0.979,5 1.131,6 0.618,7 0.561,8 509.85,9 1.1,10 11,11 88,13 13,14 38,16 89,17 33,20 12,21 21,22 2,24 51,25 4,28 1,29 3,32 37,35 3.4,36 0.236,37 21,38 45.5,39 86.174,40 99.507,41 54.404,42 49.336,44 4.921}
{0 CHEMBL114371,1 5.528,2 34.6,3 60.5,4 0.979,5 1.137,6 0.601,7 0.541,8 447.78,9 1.2,10 5,11 81,13 7,14 32,16 81,17 28,20 6,21 22,22 2,24 49,25 4,28 1,29 3,32 32,35 3.7,36 0.247,37 20,38 36.5,39 79.29,40 92.091,41 48.643,42 43.809,44 5.046}
{0 CHEMBL114466,1 5.996,2 34.7,3 57.3,4 0.991,5 1.137,6 0.604,7 0.555,8 449.7,9 1.3,10 5,11 75,13 8,14 32,16 75,17 26,20 7,21 19,22 3,24 43,25 6,28 1,29 5,32 32,35 6.7,36 0.253,37 19,38 37.5,39 74.294,40 85.265,41 45.268,42 41.658,44 5.409}
{0 CHEMBL114530,1 5.855,2 34.5,3 58.3,4 0.987,5 1.137,6 0.602,7 0.55,8 491.79,9 1.2,10 5,11 84,13 8,14 35,16 84,17 29,20 7,21 22,22 3,24 49,25 6,28 1,29 5,32 35,35 6,36 0.262,37 22,38 40.5,39 82.945,40 95.51,41 50.552,42 46.239,44 5.444}
{0 CHEMBL114650,1 5.794,2 37.5,3 58,4 0.979,5 1.131,6 0.618,7 0.561,8 509.85,9 1.1,10 11,11 88,13 13,14 38,16 89,17 33,20 12,21 21,22 2,24 51,25 4,28 1,29 3,32 37,35 3.4,36 0.236,37 21,38 45.5,39 86.174,40 99.507,41 54.404,42 49.336,44 5}
{0 CHEMBL114702,1 5.418,2 34.4,3 61.3,4 0.977,5 1.137,6 0.599,7 0.537,8 503.9,9 1.1,10 5,11 93,13 7,14 36,16 93,17 32,20 6,21 26,22 2,24 57,25 4,28 1,29 3,32 36,35 3.2,36 0.258,37 24,38 40.5,39 90.825,40 105.752,41 55.688,42 49.916,44 5}
{0 CHEMBL114709,1 5.528,2 34.6,3 60.5,4 0.979,5 1.137,6 0.601,7 0.541,8 447.78,9 1.2,10 5,11 81,13 7,14 32,16 81,17 28,20 6,21 22,22 2,24 49,25 4,28 1,29 3,32 32,35 3.7,36 0.247,37 20,38 36.5,39 79.29,40 92.091,41 48.643,42 43.809,44 4.886}
{0 CHEMBL114902,1 5.561,2 34.6,3 60.3,4 0.98,5 1.137,6 0.601,7 0.542,8 433.75,9 1.3,10 5,11 78,13 7,14 31,16 78,17 27,20 6,21 21,22 2,24 47,25 4,28 1,29 3,32 31,35 3.8,36 0.244,37 19,38 35.5,39 76.407,40 88.676,41 46.881,42 42.282,44 5}
{0 CHEMBL115014,1 6.111,2 34.8,3 56.5,4 0.993,5 1.137,6 0.605,7 0.559,8 421.64,9 1.4,10 5,11 69,13 8,14 30,16 69,17 24,20 7,21 17,22 3,24 39,25 6,28 1,29 5,32 30,35 7.2,36 0.246,37 17,38 35.5,39 68.527,40 78.434,41 41.745,42 38.605,44 5.097}
{0 CHEMBL115056,1 5.635,2 34.7,3 59.7,4 0.981,5 1.137,6 0.602,7 0.545,8 405.69,9 1.4,10 5,11 72,13 7,14 29,16 72,17 25,20 6,21 19,22 2,24 43,25 4,28 1,29 3,32 29,35 4.2,36 0.264,37 19,38 33.5,39 70.639,40 81.846,41 43.359,42 39.229,44 4.824}
{0 CHEMBL115248,1 5.498,2 34.5,3 60.7,4 0.978,5 1.137,6 0.6,7 0.54,8 461.81,9 1.2,10 5,11 84,13 7,14 33,16 84,17 29,20 6,21 23,22 2,24 51,25 4,28 1,29 3,32 33,35 3.6,36 0.25,37 21,38 37.5,39 82.174,40 95.507,41 50.404,42 45.336,44 4.959}
{0 CHEMBL115274,1 5.898,2 34.6,3 58,4 0.988,5 1.137,6 0.602,7 0.552,8 477.76,9 1.2,10 5,11 81,13 8,14 34,16 81,17 28,20 7,21 21,22 3,24 47,25 6,28 1,29 5,32 34,35 6.2,36 0.259,37 21,38 39.5,39 80.061,40 92.095,41 48.79,42 44.712,44 5.432}
{0 CHEMBL115454,1 5.855,2 34.5,3 58.3,4 0.987,5 1.137,6 0.602,7 0.55,8 491.79,9 1.2,10 5,11 84,13 8,14 35,16 84,17 29,20 7,21 22,22 3,24 49,25 6,28 1,29 5,32 35,35 6,36 0.262,37 22,38 40.5,39 82.945,40 95.51,41 50.552,42 46.239,44 5.481}
{0 CHEMBL116169,1 5.826,2 35,3 58.3,4 0.985,5 1.136,6 0.605,7 0.552,8 349.57,9 1.7,10 5,11 60,13 7,14 25,16 60,17 21,20 6,21 15,22 2,24 35,25 4,28 1,29 3,32 25,35 5,36 0.217,37 13,38 29.5,39 59.105,40 68.185,41 36.313,42 33.121,44 4.959}
{0 CHEMBL116561,1 5.418,2 34.4,3 61.3,4 0.977,5 1.137,6 0.599,7 0.537,8 503.9,9 1.1,10 5,11 93,13 7,14 36,16 93,17 32,20 6,21 26,22 2,24 57,25 4,28 1,29 3,32 36,35 3.2,36 0.258,37 24,38 40.5,39 90.825,40 105.752,41 55.688,42 49.916,44 5}
{0 CHEMBL279640,1 6.692,2 38.3,3 51.7,4 1,5 1.13,6 0.628,7 0.592,8 401.55,9 1.7,10 10,11 60,13 13,14 30,16 61,17 23,20 11,21 12,22 3,24 31,25 6,28 1,29 5,32 29,35 8.3,36 0.23,37 14,38 38,39 59.992,40 67.773,41 37.699,42 35.497,44 4.481}
{0 CHEMBL281211,1 6.366,2 37.5,3 55.4,4 0.998,5 1.148,6 0.611,7 0.568,8 356.52,11 56,13 5,14 24,16 55,17 21,20 9,21 12,22 5,23 3,24 31,25 4,29 1,32 25,34 3,35 1.8,36 0.255,37 14,38 29,39 55.887,40 64.287,41 34.211,42 31.82,43 5.4,44 4.959}
{0 CHEMBL312824,1 6.775,2 40.3,3 50.6,4 0.998,5 1.125,6 0.639,7 0.602,8 521.71,9 1.3,10 16,11 77,13 19,14 40,16 79,17 31,20 17,21 14,22 3,24 39,25 7,28 1,29 6,32 38,35 7.8,36 0.228,37 18,38 51,39 76.854,40 86.644,41 49.199,42 46.319,44 5.796}
{0 CHEMBL313460,1 6.227,2 37.2,3 55.1,4 0.991,5 1.132,6 0.619,7 0.573,8 485.73,9 1.3,10 10,11 78,13 13,14 36,16 79,17 29,20 11,21 18,22 3,24 43,25 6,28 1,29 5,32 35,35 6.4,36 0.253,37 20,38 44,39 77.294,40 88.265,41 48.268,42 44.658,44 5.796}
{0 CHEMBL313642,1 6.531,2 40.8,3 52.1,4 0.99,5 1.124,6 0.641,7 0.597,8 463.67,9 1.4,10 16,11 71,13 18,14 36,16 73,17 29,20 16,21 13,22 2,24 37,25 5,28 1,29 4,32 34,35 5.6,36 0.205,37 15,38 46,39 70.316,40 79.81,41 45.529,42 42.363,44 4.469}
{0 CHEMBL313643,1 6.612,2 41.2,3 51.5,4 0.992,5 1.123,6 0.644,7 0.601,8 449.64,9 1.5,10 16,11 68,13 18,14 35,16 70,17 28,20 16,21 12,22 2,24 35,25 5,28 1,29 4,32 33,35 5.9,36 0.2,37 14,38 45,39 67.432,40 76.394,41 43.767,42 40.836,44 5.155}
{0 CHEMBL314654,1 6.877,2 38.6,3 52.6,4 0.994,5 1.128,6 0.643,7 0.595,8 391.98,9 1.8,10 10,11 57,13 12,14 28,16 58,17 22,18 1,20 10,21 12,22 2,24 30,25 5,26 1,28 1,29 3,32 27,34 1,35 5.3,36 0.207,37 12,38 35,39 56.661,40 64.299,41 36.648,42 33.895,43 1.8,44 5.097}
{0 CHEMBL316279,1 6.612,2 41.2,3 51.5,4 0.992,5 1.123,6 0.644,7 0.601,8 449.64,9 1.5,10 16,11 68,13 18,14 35,16 70,17 28,20 16,21 12,22 2,24 35,25 5,28 1,29 4,32 33,35 5.9,36 0.2,37 14,38 45,39 67.432,40 76.394,41 43.767,42 40.836,44 5}
{0 CHEMBL324279,1 5.469,2 34.5,3 60.9,4 0.978,5 1.137,6 0.6,7 0.539,8 475.84,9 1.1,10 5,11 87,13 7,14 34,16 87,17 30,20 6,21 24,22 2,24 53,25 4,28 1,29 3,32 34,35 3.4,36 0.253,37 22,38 38.5,39 85.057,40 98.922,41 52.166,42 46.863,44 4.959}
{0 CHEMBL324810,1 5.757,2 37.4,3 58.2,4 0.979,5 1.131,6 0.617,7 0.559,8 523.88,9 1.1,10 11,11 91,13 13,14 39,16 92,17 34,20 12,21 22,22 2,24 53,25 4,28 1,29 3,32 38,35 3.3,36 0.239,37 22,38 46.5,39 89.057,40 102.922,41 56.166,42 50.863,44 4.921}
{0 CHEMBL325179,1 5.996,2 34.7,3 57.3,4 0.991,5 1.137,6 0.604,7 0.555,8 449.7,9 1.3,10 5,11 75,13 8,14 32,16 75,17 26,20 7,21 19,22 3,24 43,25 6,28 1,29 5,32 32,35 6.7,36 0.253,37 19,38 37.5,39 74.294,40 85.265,41 45.268,42 41.658,44 4.959}
{0 CHEMBL326063,1 5.757,2 37.4,3 58.2,4 0.979,5 1.131,6 0.617,7 0.559,8 523.88,9 1.1,10 11,11 91,13 13,14 39,16 92,17 34,20 12,21 22,22 2,24 53,25 4,28 1,29 3,32 38,35 3.3,36 0.228,37 21,38 46.5,39 89.057,40 102.922,41 56.166,42 50.863,44 5.046}
{0 CHEMBL326138,1 5.498,2 34.5,3 60.7,4 0.978,5 1.137,6 0.6,7 0.54,8 461.81,9 1.2,10 5,11 84,13 7,14 33,16 84,17 29,20 6,21 23,22 2,24 51,25 4,28 1,29 3,32 33,35 3.6,36 0.25,37 21,38 37.5,39 82.174,40 95.507,41 50.404,42 45.336,44 5.097}
{0 CHEMBL326627,1 5.945,2 34.6,3 57.7,4 0.989,5 1.137,6 0.603,7 0.554,8 463.73,9 1.3,10 5,11 78,13 8,14 33,16 78,17 27,20 7,21 20,22 3,24 45,25 6,28 1,29 5,32 33,35 6.4,36 0.256,37 20,38 38.5,39 77.178,40 88.68,41 47.029,42 43.185,44 5.252}
{0 CHEMBL327129,1 5.945,2 34.6,3 57.7,4 0.989,5 1.137,6 0.603,7 0.554,8 463.73,9 1.3,10 5,11 78,13 8,14 33,16 78,17 27,20 7,21 20,22 3,24 45,25 6,28 1,29 5,32 33,35 6.4,36 0.256,37 20,38 38.5,39 77.178,40 88.68,41 47.029,42 43.185,44 5.469}
{0 CHEMBL327256,1 6.354,2 37.7,3 54.1,4 0.993,5 1.131,6 0.623,7 0.579,8 387.57,9 1.6,10 10,11 61,13 12,14 29,16 62,17 23,20 10,21 13,22 2,24 33,25 5,28 1,29 4,32 28,35 6.6,36 0.21,37 13,38 36,39 60.549,40 68.979,41 38.006,42 35.309,44 5.097}
{0 CHEMBL328567,1 6.531,2 40.8,3 52.1,4 0.99,5 1.124,6 0.641,7 0.597,8 463.67,9 1.4,10 16,11 71,13 18,14 36,16 73,17 29,20 16,21 13,22 2,24 37,25 5,28 1,29 4,32 34,35 5.6,36 0.205,37 15,38 46,39 70.316,40 79.81,41 45.529,42 42.363,44 5.155}
{0 CHEMBL329539,1 5.843,2 37.2,3 57.7,4 0.981,5 1.132,6 0.617,7 0.561,8 455.75,9 1.3,10 10,11 78,13 12,14 34,16 79,17 29,20 10,21 19,22 2,24 45,25 4,28 1,29 3,32 33,35 3.8,36 0.241,37 19,38 41,39 76.523,40 88.261,41 48.12,42 43.755,44 4.481}
{0 CHEMBL329600,1 6.46,2 39.2,3 52.9,4 0.992,5 1.128,6 0.633,7 0.589,8 329.48,9 2,10 10,11 51,13 12,14 25,16 52,17 20,20 10,21 10,22 2,24 27,25 4,28 1,29 3,32 24,35 5.9,36 0.192,37 10,38 32,39 50.571,40 57.524,41 32.267,42 30.014,44 4.745}
{0 CHEMBL329898,1 6.531,2 40.8,3 52.1,4 0.99,5 1.124,6 0.641,7 0.597,8 463.67,9 1.4,10 16,11 71,13 18,14 36,16 73,17 29,20 16,21 13,22 2,24 37,25 5,28 1,29 4,32 34,35 5.6,36 0.205,37 15,38 46,39 70.316,40 79.81,41 45.529,42 42.363,44 4.959}
{0 CHEMBL330088,1 6.877,2 38.6,3 52.6,4 0.994,5 1.128,6 0.643,7 0.595,8 391.98,9 1.8,10 10,11 57,13 12,14 28,16 58,17 22,18 1,20 10,21 12,22 2,24 30,25 5,26 1,28 1,29 3,32 27,34 1,35 5.3,36 0.207,37 12,38 35,39 56.661,40 64.299,41 36.648,42 33.895,43 1.8,44 5.046}
{0 CHEMBL330711,1 5.887,2 35.1,3 57.9,4 0.986,5 1.136,6 0.606,7 0.554,8 335.54,9 1.8,10 5,11 57,13 7,14 24,16 57,17 20,20 6,21 14,22 2,24 33,25 4,28 1,29 3,32 24,35 5.3,36 0.211,37 12,38 28.5,39 56.221,40 64.77,41 34.552,42 31.595,44 4.959}
{0 CHEMBL422774,1 6.612,2 41.2,3 51.5,4 0.992,5 1.123,6 0.644,7 0.601,8 449.64,9 1.5,10 16,11 68,13 18,14 35,16 70,17 28,20 16,21 12,22 2,24 35,25 5,28 1,29 4,32 33,35 5.9,36 0.2,37 14,38 45,39 67.432,40 76.394,41 43.767,42 40.836,44 5.155}
{0 CHEMBL442012,1 5.771,2 34.9,3 58.7,4 0.984,5 1.137,6 0.604,7 0.55,8 363.6,9 1.6,10 5,11 63,13 7,14 26,16 63,17 22,20 6,21 16,22 2,24 37,25 4,28 1,29 3,32 26,35 4.8,36 0.222,37 14,38 30.5,39 61.989,40 71.6,41 38.074,42 34.648,44 4.886}
{0 CHEMBL87987,1 6.861,2 40.5,3 50,4 1,5 1.125,6 0.641,7 0.605,8 507.68,9 1.4,10 16,11 74,13 19,14 39,16 76,17 30,20 17,21 13,22 3,24 37,25 7,28 1,29 6,32 37,35 8.1,36 0.224,37 17,38 50,39 73.97,40 83.228,41 47.438,42 44.793,44 6.301}
{0 CHEMBL88258,1 6.273,2 38.6,3 54.4,4 0.988,5 1.129,6 0.628,7 0.58,8 357.54,9 1.8,10 10,11 57,13 12,14 27,16 58,17 22,20 10,21 12,22 2,24 31,25 4,28 1,29 3,32 26,35 5.3,36 0.207,37 12,38 34,39 56.338,40 64.355,41 35.79,42 33.068,44 5.097}
{0 CHEMBL88352,1 6.698,2 40,3 51.1,4 0.996,5 1.127,6 0.639,7 0.599,8 301.42,9 2.2,10 10,11 45,13 12,14 23,16 46,17 18,20 10,21 8,22 2,24 23,25 4,28 1,29 3,32 22,35 6.7,36 0.174,37 8,38 30,39 44.803,40 50.694,41 28.745,42 26.961,44 4.481}
{0 CHEMBL88762,1 6.807,2 41.9,3 50,4 0.995,5 1.122,6 0.648,7 0.609,8 503.69,9 1.4,10 16,11 74,13 20,14 39,16 76,17 31,20 19,21 12,22 4,24 37,25 6,28 1,29 5,32 37,35 6.8,36 0.211,37 16,38 51,39 73.643,40 83.019,41 47.983,42 45.078,44 5.387}
{0 CHEMBL88829,1 6.588,2 38.6,3 52.6,4 0.997,5 1.135,6 0.627,7 0.587,8 375.53,9 1.8,10 10,11 57,13 12,14 28,16 58,17 22,20 10,21 12,22 2,23 1,24 30,25 5,28 1,29 3,32 27,34 1,35 5.3,36 0.207,37 12,38 35,39 56.85,40 64.694,41 35.728,42 33.451,43 1.8,44 4.959}
{0 CHEMBL89888,1 6.289,2 37.3,3 54.7,4 0.992,5 1.131,6 0.62,7 0.575,8 471.7,9 1.3,10 10,11 75,13 13,14 35,16 76,17 28,20 11,21 17,22 3,24 41,25 6,28 1,29 5,32 34,35 6.7,36 0.25,37 19,38 43,39 74.41,40 84.849,41 46.506,42 43.131,44 5.523}
{0 CHEMBL90033,1 6.121,2 38.1,3 55.6,4 0.986,5 1.13,6 0.624,7 0.573,8 385.6,9 1.6,10 10,11 63,13 12,14 29,16 64,17 24,20 10,21 14,22 2,24 35,25 4,28 1,29 3,32 28,35 4.8,36 0.219,37 14,38 36,39 62.105,40 71.185,41 39.313,42 36.121,44 5.097}
{0 CHEMBL90083,1 5.937,2 36.5,3 57.3,4 0.985,5 1.133,6 0.613,7 0.561,8 569.91,9 1,10 10,11 96,13 13,14 42,16 97,17 35,20 11,21 24,22 3,24 55,25 6,28 1,29 5,32 41,35 5.2,36 0.268,37 26,38 50,39 94.596,40 108.756,41 58.836,42 53.819,44 5.854}
{0 CHEMBL90088,1 5.131,2 31.8,3 63.6,4 0.973,5 1.144,6 0.586,7 0.52,8 338.65,9 3,11 66,13 1,14 24,16 66,17 21,20 1,21 20,22 1,24 42,25 3,28 2,29 1,32 24,35 1.5,36 0.242,37 16,38 25,39 64.203,40 75.51,41 38.694,42 34.294,44 4.886}
{0 CHEMBL90122,1 5.687,2 36.7,3 58.9,4 0.978,5 1.132,6 0.613,7 0.554,8 511.87,9 1.1,10 10,11 90,13 12,14 38,16 91,17 33,20 10,21 23,22 2,24 53,25 4,28 1,29 3,32 37,35 3.3,36 0.253,37 23,38 45,39 88.057,40 101.922,41 55.166,42 49.863,44 5.046}
{0 CHEMBL90205,1 6.531,2 40.8,3 52.1,4 0.99,5 1.124,6 0.641,7 0.597,8 463.67,9 1.4,10 16,11 71,13 18,14 36,16 73,17 29,20 16,21 13,22 2,24 37,25 5,28 1,29 4,32 34,35 5.6,36 0.205,37 15,38 46,39 70.316,40 79.81,41 45.529,42 42.363,44 5.155}
{0 CHEMBL90297,1 6.861,2 40.5,3 50,4 1,5 1.125,6 0.641,7 0.605,8 507.68,9 1.4,10 16,11 74,13 19,14 39,16 76,17 30,20 17,21 13,22 3,24 37,25 7,28 1,29 6,32 37,35 8.1,36 0.224,37 17,38 50,39 73.97,40 83.228,41 47.438,42 44.793,44 5.721}
{0 CHEMBL90404,1 6.44,2 37.9,3 53.4,4 0.994,5 1.13,6 0.625,7 0.582,8 373.54,9 1.7,10 10,11 58,13 12,14 28,16 59,17 22,20 10,21 12,22 2,24 31,25 5,28 1,29 4,32 27,35 6.9,36 0.203,37 12,38 35,39 57.665,40 65.564,41 36.245,42 33.783,44 5}
{0 CHEMBL90412,1 6.877,2 38.6,3 52.6,4 0.994,5 1.128,6 0.643,7 0.595,8 391.98,9 1.8,10 10,11 57,13 12,14 28,16 58,17 22,18 1,20 10,21 12,22 2,24 30,25 5,26 1,28 1,29 3,32 27,34 1,35 5.3,36 0.207,37 12,38 35,39 56.661,40 64.299,41 36.648,42 33.895,43 1.8,44 5.046}
{0 CHEMBL90527,1 6.654,2 40.8,3 51.3,4 0.994,5 1.124,6 0.641,7 0.6,8 505.71,9 1.3,10 16,11 76,13 19,14 39,16 78,17 31,20 17,21 14,22 3,24 39,25 6,28 1,29 5,32 37,35 6.6,36 0.218,37 17,38 50,39 75.527,40 85.434,41 48.745,42 45.605,44 5.367}
{0 CHEMBL90537,1 6.357,2 37.5,3 54.2,4 0.993,5 1.131,6 0.621,7 0.578,8 457.67,9 1.4,10 10,11 72,13 13,14 34,16 73,17 27,20 11,21 16,22 3,24 39,25 6,28 1,29 5,32 33,35 6.9,36 0.247,37 18,38 42,39 71.527,40 81.434,41 44.745,42 41.605,44 5.097}
{0 CHEMBL90890,1 5.655,2 36.6,3 59.1,4 0.978,5 1.133,6 0.612,7 0.553,8 525.9,9 1.1,10 10,11 93,13 12,14 39,16 94,17 34,20 10,21 24,22 2,24 55,25 4,28 1,29 3,32 38,35 3.2,36 0.255,37 24,38 46,39 90.941,40 105.337,41 56.927,42 51.389,44 5}
{0 CHEMBL91312,1 6.531,2 40.8,3 52.1,4 0.99,5 1.124,6 0.641,7 0.597,8 463.67,9 1.4,10 16,11 71,13 18,14 36,16 73,17 29,20 16,21 13,22 2,24 37,25 5,28 1,29 4,32 34,35 5.6,36 0.205,37 15,38 46,39 70.316,40 79.81,41 45.529,42 42.363,44 5}
{0 CHEMBL91323,1 6.17,2 37,3 55.6,4 0.99,5 1.132,6 0.618,7 0.57,8 499.76,9 1.2,10 10,11 81,13 13,14 37,16 82,17 30,20 11,21 19,22 3,24 45,25 6,28 1,29 5,32 36,35 6.2,36 0.256,37 21,38 45,39 80.178,40 91.68,41 50.029,42 46.185,44 5.796}
{0 CHEMBL91419,1 6.067,2 36.8,3 56.3,4 0.988,5 1.132,6 0.616,7 0.566,8 527.82,9 1.1,10 10,11 87,13 13,14 39,16 88,17 32,20 11,21 21,22 3,24 49,25 6,28 1,29 5,32 38,35 5.7,36 0.261,37 23,38 47,39 85.945,40 98.51,41 53.552,42 49.239,44 5.854}
{0 CHEMBL91502,1 6.775,2 40.3,3 50.6,4 0.998,5 1.125,6 0.639,7 0.602,8 521.71,9 1.3,10 16,11 77,13 19,14 40,16 79,17 31,20 17,21 14,22 3,24 39,25 7,28 1,29 6,32 38,35 7.8,36 0.228,37 18,38 51,39 76.854,40 86.644,41 49.199,42 46.319,44 5.796}
{0 CHEMBL91612,1 6.654,2 40.8,3 51.3,4 0.994,5 1.124,6 0.641,7 0.6,8 505.71,9 1.3,10 16,11 76,13 19,14 39,16 78,17 31,20 17,21 14,22 3,24 39,25 6,28 1,29 5,32 37,35 6.6,36 0.218,37 17,38 50,39 75.527,40 85.434,41 48.745,42 45.605,44 5.398}
{0 CHEMBL91625,1 6.807,2 41.9,3 50,4 0.995,5 1.122,6 0.648,7 0.609,8 503.69,9 1.4,10 16,11 74,13 20,14 39,16 76,17 31,20 19,21 12,22 4,24 37,25 6,28 1,29 5,32 37,35 6.8,36 0.211,37 16,38 51,39 73.643,40 83.019,41 47.983,42 45.078,44 5.276}
{0 CHEMBL92423,1 5.89,2 37.3,3 57.3,4 0.982,5 1.131,6 0.618,7 0.563,8 441.72,9 1.3,10 10,11 75,13 12,14 33,16 76,17 28,20 10,21 18,22 2,24 43,25 4,28 1,29 3,32 32,35 4,36 0.237,37 18,38 40,39 73.639,40 84.846,41 46.359,42 42.229,44 5.097}
{0 CHEMBL93788,1 6.823,2 37.3,3 50.8,4 1.004,5 1.133,6 0.626,7 0.593,8 402.54,9 3.4,10 10,11 59,13 14,14 30,16 60,17 22,20 10,21 12,22 4,24 30,25 7,28 2,29 5,32 29,35 8.5,36 0.217,37 13,38 39,39 59.211,40 66.856,41 36.943,42 34.992,44 5}
