{
  "data_features": {
    "feature": [
      {
        "data_type": "nominal",
        "index": "0",
        "is_ignore": "false",
        "is_row_identifier": "true",
        "is_target": "false",
        "name": "molecule_id",
        "nominal_value": [
          "CHEMBL1200469",
          "CHEMBL1201102",
          "CHEMBL1276946",
          "CHEMBL1300506",
          "CHEMBL1314026",
          "CHEMBL1314049",
          "CHEMBL1314074",
          "CHEMBL1314111",
          "CHEMBL1314149",
          "CHEMBL1314294",
          "CHEMBL1314554",
          "CHEMBL1315444",
          "CHEMBL1316039",
          "CHEMBL1318312",
          "CHEMBL1318391",
          "CHEMBL1318543",
          "CHEMBL1323615",
          "CHEMBL1325140",
          "CHEMBL1329357",
          "CHEMBL1330018",
          "CHEMBL1331532",
          "CHEMBL1331821",
          "CHEMBL1331838",
          "CHEMBL1331887",
          "CHEMBL1332171",
          "CHEMBL1332917",
          "CHEMBL1334632",
          "CHEMBL1342313",
          "CHEMBL1348462",
          "CHEMBL1349751",
          "CHEMBL1350157",
          "CHEMBL1353985",
          "CHEMBL1354115",
          "CHEMBL1354139",
          "CHEMBL1354164",
          "CHEMBL1354183",
          "CHEMBL1354204",
          "CHEMBL1354497",
          "CHEMBL1354612",
          "CHEMBL1355341",
          "CHEMBL1355822",
          "CHEMBL1356469",
          "CHEMBL1357284",
          "CHEMBL1358377",
          "CHEMBL1358723",
          "CHEMBL1362864",
          "CHEMBL1377821",
          "CHEMBL1393937",
          "CHEMBL1393979",
          "CHEMBL1394037",
          "CHEMBL1394054",
          "CHEMBL1394104",
          "CHEMBL1395104",
          "CHEMBL1395493",
          "CHEMBL1395784",
          "CHEMBL1396515",
          "CHEMBL1396694",
          "CHEMBL1397941",
          "CHEMBL1398496",
          "CHEMBL1400134",
          "CHEMBL1401860",
          "CHEMBL1404241",
          "CHEMBL1408592",
          "CHEMBL1408679",
          "CHEMBL1409343",
          "CHEMBL1411769",
          "CHEMBL1413226",
          "CHEMBL1425567",
          "CHEMBL1433287",
          "CHEMBL1433288",
          "CHEMBL1433366",
          "CHEMBL1433370",
          "CHEMBL1433379",
          "CHEMBL1433380",
          "CHEMBL1433381",
          "CHEMBL1433416",
          "CHEMBL1433973",
          "CHEMBL1434013",
          "CHEMBL1434086",
          "CHEMBL1434402",
          "CHEMBL1434483",
          "CHEMBL1434771",
          "CHEMBL1435967",
          "CHEMBL1437772",
          "CHEMBL1449547",
          "CHEMBL1450360",
          "CHEMBL1472463",
          "CHEMBL1472474",
          "CHEMBL1472537",
          "CHEMBL1472557",
          "CHEMBL1472564",
          "CHEMBL1472573",
          "CHEMBL1473057",
          "CHEMBL1473456",
          "CHEMBL1475468",
          "CHEMBL1476649",
          "CHEMBL1489079",
          "CHEMBL1511840",
          "CHEMBL1511877",
          "CHEMBL1511878",
          "CHEMBL1511904",
          "CHEMBL1511928",
          "CHEMBL1511945",
          "CHEMBL1511947",
          "CHEMBL1511987",
          "CHEMBL1513460",
          "CHEMBL1514168",
          "CHEMBL1515783",
          "CHEMBL1515889",
          "CHEMBL1516467",
          "CHEMBL1517979",
          "CHEMBL1526463",
          "CHEMBL1527096",
          "CHEMBL1528228",
          "CHEMBL1530026",
          "CHEMBL1550870",
          "CHEMBL1550872",
          "CHEMBL1550969",
          "CHEMBL1550992",
          "CHEMBL1550997",
          "CHEMBL1550999",
          "CHEMBL1551000",
          "CHEMBL1551006",
          "CHEMBL1551019",
          "CHEMBL1551996",
          "CHEMBL1552484",
          "CHEMBL1552577",
          "CHEMBL1552619",
          "CHEMBL1553503",
          "CHEMBL1553680",
          "CHEMBL1554785",
          "CHEMBL1554930",
          "CHEMBL1567692",
          "CHEMBL1568527",
          "CHEMBL1568616",
          "CHEMBL1589696",
          "CHEMBL1589710",
          "CHEMBL1589730",
          "CHEMBL1589732",
          "CHEMBL1589765",
          "CHEMBL1589775",
          "CHEMBL1589810",
          "CHEMBL1590058",
          "CHEMBL1591034",
          "CHEMBL1592130",
          "CHEMBL1593278",
          "CHEMBL1593461",
          "CHEMBL1594059",
          "CHEMBL1596206",
          "CHEMBL1926690",
          "CHEMBL1927145",
          "CHEMBL1927146",
          "CHEMBL1927147",
          "CHEMBL1927148",
          "CHEMBL1927149",
          "CHEMBL1927150",
          "CHEMBL1927151",
          "CHEMBL1927152",
          "CHEMBL1927153",
          "CHEMBL1927154",
          "CHEMBL1927155",
          "CHEMBL1927156",
          "CHEMBL1927157",
          "CHEMBL1927158",
          "CHEMBL1927159",
          "CHEMBL1927160",
          "CHEMBL223225",
          "CHEMBL224501",
          "CHEMBL224702",
          "CHEMBL224741",
          "CHEMBL224913",
          "CHEMBL225083",
          "CHEMBL225270",
          "CHEMBL278262",
          "CHEMBL284153",
          "CHEMBL34173",
          "CHEMBL355832",
          "CHEMBL358678",
          "CHEMBL376139",
          "CHEMBL389656",
          "CHEMBL390388",
          "CHEMBL390793",
          "CHEMBL407734",
          "CHEMBL413785",
          "CHEMBL422",
          "CHEMBL427244",
          "CHEMBL434759",
          "CHEMBL441558",
          "CHEMBL541018",
          "CHEMBL567",
          "CHEMBL587104",
          "CHEMBL64404",
          "CHEMBL71",
          "CHEMBL726",
          "CHEMBL828"
        ],
        "number_of_missing_values": "0"
      },
      {
        "data_type": "numeric",
        "index": "1",
        "is_ignore": "false",
        "is_row_identifier": "false",
        "is_target": "false",
        "name": "AMW",
        "number_of_missing_values": "0"
      },
      {
        "data_type": "numeric",
        "index": "2",
        "is_ignore": "false",
        "is_row_identifier": "false",
        "is_target": "false",
        "name": "C.",
        "number_of_missing_values": "0"
      },
      {
        "data_type": "numeric",
        "index": "3",
        "is_ignore": "false",
        "is_row_identifier": "false",
        "is_target": "false",
        "name": "H.",
        "number_of_missing_values": "0"
      },
      {
        "data_type": "numeric",
        "index": "4",
        "is_ignore": "false",
        "is_row_identifier": "false",
        "is_target": "false",
        "name": "Me",
        "number_of_missing_values": "0"
      },
      {
        "data_type": "numeric",
        "index": "5",
        "is_ignore": "false",
        "is_row_identifier": "false",
        "is_target": "false",
        "name": "Mi",
        "number_of_missing_values": "0"
      },
      {
        "data_type": "numeric",
        "index": "6",
        "is_ignore": "false",
        "is_row_identifier": "false",
        "is_target": "false",
        "name": "Mp",
        "number_of_missing_values": "0"
      },
      {
        "data_type": "numeric",
        "index": "7",
        "is_ignore": "false",
        "is_row_identifier": "false",
        "is_target": "false",
        "name": "Mv",
        "number_of_missing_values": "0"
      },
      {
        "data_type": "numeric",
        "index": "8",
        "is_ignore": "false",
        "is_row_identifier": "false",
        "is_target": "false",
        "name": "MW",
        "number_of_missing_values": "0"
      },
      {
        "data_type": "numeric",
        "index": "9",
        "is_ignore": "false",
        "is_row_identifier": "false",
        "is_target": "false",
        "name": "N.",
        "number_of_missing_values": "0"
      },
      {
        "data_type": "numeric",
        "index": "10",
        "is_ignore": "false",
        "is_row_identifier": "false",
        "is_target": "false",
        "name": "nAB",
        "number_of_missing_values": "0"
      },
      {
        "data_type": "numeric",
        "index": "11",
        "is_ignore": "false",
        "is_row_identifier": "false",
        "is_target": "false",
        "name": "nAT",
        "number_of_missing_values": "0"
      },
      {
        "data_type": "numeric",
        "index": "12",
        "is_ignore": "false",
        "is_row_identifier": "false",
        "is_target": "false",
        "name": "nB",
        "number_of_missing_values": "0"
      },
      {
        "data_type": "numeric",
        "index": "13",
        "is_ignore": "false",
        "is_row_identifier": "false",
        "is_target": "false",
        "name": "nBM",
        "number_of_missing_values": "0"
      },
      {
        "data_type": "numeric",
        "index": "14",
        "is_ignore": "false",
        "is_row_identifier": "false",
        "is_target": "false",
        "name": "nBO",
        "number_of_missing_values": "0"
      },
      {
        "data_type": "numeric",
        "index": "15",
        "is_ignore": "false",
        "is_row_identifier": "false",
        "is_target": "false",
        "name": "nBR",
        "number_of_missing_values": "0"
      },
      {
        "data_type": "numeric",
        "index": "16",
        "is_ignore": "false",
        "is_row_identifier": "false",
        "is_target": "false",
        "name": "nBT",
        "number_of_missing_values": "0"
      },
      {
        "data_type": "numeric",
        "index": "17",
        "is_ignore": "false",
        "is_row_identifier": "false",
        "is_target": "false",
        "name": "nC",
        "number_of_missing_values": "0"
      },
      {
        "data_type": "numeric",
        "index": "18",
        "is_ignore": "false",
        "is_row_identifier": "false",
        "is_target": "false",
        "name": "nCL",
        "number_of_missing_values": "0"
      },
      {
        "data_type": "numeric",
        "index": "19",
        "is_ignore": "false",
        "is_row_identifier": "false",
        "is_target": "false",
        "name": "nCsp",
        "number_of_missing_values": "0"
      },
      {
        "data_type": "numeric",
        "index": "20",
        "is_ignore": "false",
        "is_row_identifier": "false",
        "is_target": "false",
        "name": "nCsp2",
        "number_of_missing_values": "0"
      },
      {
        "data_type": "numeric",
        "index": "21",
        "is_ignore": "false",
        "is_row_identifier": "false",
        "is_target": "false",
        "name": "nCsp3",
        "number_of_missing_values": "0"
      },
      {
        "data_type": "numeric",
        "index": "22",
        "is_ignore": "false",
        "is_row_identifier": "false",
        "is_target": "false",
        "name": "nDB",
        "number_of_missing_values": "0"
      },
      {
        "data_type": "numeric",
        "index": "23",
        "is_ignore": "false",
        "is_row_identifier": "false",
        "is_target": "false",
        "name": "nF",
        "number_of_missing_values": "0"
      },
      {
        "data_type": "numeric",
        "index": "24",
        "is_ignore": "false",
        "is_row_identifier": "false",
        "is_target": "false",
        "name": "nH",
        "number_of_missing_values": "0"
      },
      {
        "data_type": "numeric",
        "index": "25",
        "is_ignore": "false",
        "is_row_identifier": "false",
        "is_target": "false",
        "name": "nHet",
        "number_of_missing_values": "0"
      },
      {
        "data_type": "numeric",
        "index": "26",
        "is_ignore": "false",
        "is_row_identifier": "false",
        "is_target": "false",
        "name": "nHM",
        "number_of_missing_values": "0"
      },
      {
        "data_type": "numeric",
        "index": "27",
        "is_ignore": "false",
        "is_row_identifier": "false",
        "is_target": "false",
        "name": "nI",
        "number_of_missing_values": "0"
      },
      {
        "data_type": "numeric",
        "index": "28",
        "is_ignore": "false",
        "is_row_identifier": "false",
        "is_target": "false",
        "name": "nN",
        "number_of_missing_values": "0"
      },
      {
        "data_type": "numeric",
        "index": "29",
        "is_ignore": "false",
        "is_row_identifier": "false",
        "is_target": "false",
        "name": "nO",
        "number_of_missing_values": "0"
      },
      {
        "data_type": "numeric",
        "index": "30",
        "is_ignore": "false",
        "is_row_identifier": "false",
        "is_target": "false",
        "name": "nP",
        "number_of_missing_values": "0"
      },
      {
        "data_type": "numeric",
        "index": "31",
        "is_ignore": "false",
        "is_row_identifier": "false",
        "is_target": "false",
        "name": "nS",
        "number_of_missing_values": "0"
      },
      {
        "data_type": "numeric",
        "index": "32",
        "is_ignore": "false",
        "is_row_identifier": "false",
        "is_target": "false",
        "name": "nSK",
        "number_of_missing_values": "0"
      },
      {
        "data_type": "numeric",
        "index": "33",
        "is_ignore": "false",
        "is_row_identifier": "false",
        "is_target": "false",
        "name": "nTB",
        "number_of_missing_values": "0"
      },
      {
        "data_type": "numeric",
        "index": "34",
        "is_ignore": "false",
        "is_row_identifier": "false",
        "is_target": "false",
        "name": "nX",
        "number_of_missing_values": "0"
      },
      {
        "data_type": "numeric",
        "index": "35",
        "is_ignore": "false",
        "is_row_identifier": "false",
        "is_target": "false",
        "name": "O.",
        "number_of_missing_values": "0"
      },
      {
        "data_type": "numeric",
        "index": "36",
        "is_ignore": "false",
        "is_row_identifier": "false",
        "is_target": "false",
        "name": "RBF",
        "number_of_missing_values": "0"
      },
      {
        "data_type": "numeric",
        "index": "37",
        "is_ignore": "false",
        "is_row_identifier": "false",
        "is_target": "false",
        "name": "RBN",
        "number_of_missing_values": "0"
      },
      {
        "data_type": "numeric",
        "index": "38",
        "is_ignore": "false",
        "is_row_identifier": "false",
        "is_target": "false",
        "name": "SCBO",
        "number_of_missing_values": "0"
      },
      {
        "data_type": "numeric",
        "index": "39",
        "is_ignore": "false",
        "is_row_identifier": "false",
        "is_target": "false",
        "name": "Se",
        "number_of_missing_values": "0"
      },
      {
        "data_type": "numeric",
        "index": "40",
        "is_ignore": "false",
        "is_row_identifier": "false",
        "is_target": "false",
        "name": "Si",
        "number_of_missing_values": "0"
      },
      {
        "data_type": "numeric",
        "index": "41",
        "is_ignore": "false",
        "is_row_identifier": "false",
        "is_target": "false",
        "name": "Sp",
        "number_of_missing_values": "0"
      },
      {
        "data_type": "numeric",
        "index": "42",
        "is_ignore": "false",
        "is_row_identifier": "false",
        "is_target": "false",
        "name": "Sv",
        "number_of_missing_values": "0"
      },
      {
        "data_type": "numeric",
        "index": "43",
        "is_ignore": "false",
        "is_row_identifier": "false",
        "is_target": "false",
        "name": "X.",
        "number_of_missing_values": "0"
      },
      {
        "data_type": "numeric",
        "index": "44",
        "is_ignore": "false",
        "is_row_identifier": "false",
        "is_target": "true",
        "name": "pXC50",
        "number_of_missing_values": "0"
      }
    ]
  }
}