{
  "data_set_description": {
    "collection_date": "November 2013",
    "creator": "Dr Jeremy Besnard, Dr Ivan Olier, Dr Noureddin Sadawi, Dr Larisa Soldatova, Dr Crina Grosan, Prof Ross King, Dr Richard Bickerton, Prof Andrew Hopkins and Dr Willem van Hoorn",
    "default_target_attribute": "pXC50",
    "description": "This dataset contains QSAR data (from ChEMBL version 17) showing activity values (unit is pseudo-pCI50) of several compounds on drug target ChEMBL_ID: CHEMBL1287628 (TID: 103630), and it has 195 rows and 43 features (not including molecule IDs and class feature: molecule_id and pXC50). The features represent Basic Molecular Descriptors which were generated from SMILES strings.  Missing value imputation was applied to this dataset (By choosing the Median).",
    "description_version": "1",
    "file_id": "3350468",
    "format": "ARFF",
    "id": "28110",
    "licence": "Public",
    "md5_checksum": "fb49886b9fd3631ba71177216ed2a64e",
    "minio_url": "https://data.openml.org/datasets/0002/28110/dataset_28110.pq",
    "name": "QSAR-DATASET-FOR-DRUG-TARGET-CHEMBL1287628",
    "original_data_url": "https://www.ebi.ac.uk/chembl/target/inspect/CHEMBL1287628",
    "parquet_url": "https://data.openml.org/datasets/0002/28110/dataset_28110.pq",
    "processing_date": "2018-10-04 01:23:18",
    "row_id_attribute": "molecule_id",
    "status": "deactivated",
    "tag": [
      "MetaQSAR",
      "study_13"
    ],
    "upload_date": "2016-07-14T23:10:49",
    "url": "https://api.openml.org/data/v1/download/3350468/QSAR-DATASET-FOR-DRUG-TARGET-CHEMBL1287628.arff",
    "version": "8",
    "visibility": "public"
  }
}