{
  "data_set_description": {
    "collection_date": "November 2013",
    "creator": "Dr Jeremy Besnard, Dr Ivan Olier, Dr Noureddin Sadawi, Dr Larisa Soldatova, Dr Crina Grosan, Prof Ross King, Dr Richard Bickerton, Prof Andrew Hopkins and Dr Willem van Hoorn",
    "default_target_attribute": "pXC50",
    "description": "This dataset contains QSAR data (from ChEMBL version 17) showing activity values (unit is pseudo-pCI50) of several compounds on drug target ChEMBL_ID: CHEMBL3709 (TID: 10308), and it has 59 rows and 1195 features (not including molecule IDs and class feature: molecule_id and pXC50). The features represent Molecular Descriptors which were generated from SMILES strings. Missing value imputation was applied to this dataset (By choosing the Median).",
    "description_version": "1",
    "file_id": "3350401",
    "format": "ARFF",
    "id": "28109",
    "licence": "Public",
    "md5_checksum": "03c8edcc7982690e587e5413bbb814c8",
    "minio_url": "https://data.openml.org/datasets/0002/28109/dataset_28109.pq",
    "name": "QSAR-DATASET-FOR-DRUG-TARGET-CHEMBL3709",
    "original_data_url": "https://www.ebi.ac.uk/chembl/target/inspect/CHEMBL3709",
    "parquet_url": "https://data.openml.org/datasets/0002/28109/dataset_28109.pq",
    "processing_date": "2018-10-04 00:51:26",
    "row_id_attribute": "molecule_id",
    "status": "deactivated",
    "tag": [
      "MetaQSAR",
      "study_13"
    ],
    "upload_date": "2016-07-14T23:10:38",
    "url": "https://api.openml.org/data/v1/download/3350401/QSAR-DATASET-FOR-DRUG-TARGET-CHEMBL3709.arff",
    "version": "8",
    "visibility": "public"
  }
}