"molecule_id","FCFP4_1024b1","FCFP4_1024b10","FCFP4_1024b100","FCFP4_1024b1000","FCFP4_1024b1001","FCFP4_1024b1002","FCFP4_1024b1003","FCFP4_1024b1004","FCFP4_1024b1005","FCFP4_1024b1006","FCFP4_1024b1007","FCFP4_1024b1008","FCFP4_1024b1009","FCFP4_1024b101","FCFP4_1024b1010","FCFP4_1024b1011","FCFP4_1024b1012","FCFP4_1024b1013","FCFP4_1024b1014","FCFP4_1024b1015","FCFP4_1024b1016","FCFP4_1024b1017","FCFP4_1024b1018","FCFP4_1024b1019","FCFP4_1024b102","FCFP4_1024b1020","FCFP4_1024b1021","FCFP4_1024b1022","FCFP4_1024b1023","FCFP4_1024b1024","FCFP4_1024b103","FCFP4_1024b104","FCFP4_1024b105","FCFP4_1024b106","FCFP4_1024b107","FCFP4_1024b108","FCFP4_1024b109","FCFP4_1024b11","FCFP4_1024b110","FCFP4_1024b111","FCFP4_1024b112","FCFP4_1024b113","FCFP4_1024b114","FCFP4_1024b115","FCFP4_1024b116","FCFP4_1024b117","FCFP4_1024b118","FCFP4_1024b119","FCFP4_1024b12","FCFP4_1024b120","FCFP4_1024b121","pXC50"
{1 1,16 1,24 1,50 1,52 5.1}
{0 CHEMBL101253,1 1,52 5.1}
{0 CHEMBL103667,1 1,2 1,35 1,52 5}
{0 CHEMBL105442,1 1,52 5}
{0 CHEMBL1084546,1 1,35 1,49 1,52 5.2}
{0 CHEMBL1090356,1 1,35 1,37 1,52 5.2}
{0 CHEMBL1090360,1 1,35 1,37 1,52 5.2}
{0 CHEMBL116070,1 1,52 6.1}
{0 CHEMBL1173655,1 1,2 1,35 1,52 5}
{0 CHEMBL117697,1 1,52 5.2}
{0 CHEMBL1190711,1 1,52 5.2}
{0 CHEMBL119385,1 1,7 1,18 1,52 5}
{0 CHEMBL1230020,1 1,35 1,52 5}
{0 CHEMBL1230122,1 1,35 1,52 5.2}
{0 CHEMBL1236107,1 1,52 5}
{0 CHEMBL1240703,1 1,8 1,44 1,52 5}
{0 CHEMBL1241674,1 1,26 1,52 5.585}
{0 CHEMBL1242373,1 1,21 1,26 1,27 1,35 1,52 5.2}
{0 CHEMBL124660,1 1,2 1,35 1,52 5}
{0 CHEMBL127898,1 1,2 1,19 1,50 1,52 5.2}
{0 CHEMBL1287853,1 1,2 1,52 5}
{0 CHEMBL1289926,1 1,4 1,27 1,36 1,50 1,52 5}
{0 CHEMBL1336,1 1,35 1,36 1,49 1,52 5}
{0 CHEMBL1375418,1 1,35 1,52 5.2}
{0 CHEMBL1375640,1 1,26 1,45 1,52 5.2}
{0 CHEMBL1419458,1 1,24 1,26 1,39 1,52 5.2}
{0 CHEMBL1421,1 1,2 1,16 1,35 1,52 5.1}
{0 CHEMBL1461728,1 1,4 1,29 1,35 1,52 5.2}
{0 CHEMBL14762,1 1,35 1,52 5.538}
{0 CHEMBL1516890,1 1,35 1,52 5.2}
{0 CHEMBL1614701,1 1,39 1,52 5}
{0 CHEMBL1614705,1 1,4 1,50 1,52 5.2}
{0 CHEMBL162,1 1,36 1,44 1,52 5}
{0 CHEMBL1624529,1 1,11 1,52 5.2}
{0 CHEMBL1682540,4 1,29 1,38 1,52 5.8}
{0 CHEMBL1682545,4 1,29 1,38 1,52 5.2}
{0 CHEMBL1682546,1 1,4 1,20 1,29 1,35 1,38 1,52 5.2}
{0 CHEMBL1682552,1 1,4 1,29 1,35 1,52 6.1}
{0 CHEMBL1682553,1 1,4 1,29 1,35 1,52 5.2}
{0 CHEMBL1682558,1 1,2 1,4 1,29 1,52 5.2}
{0 CHEMBL1721885,1 1,2 1,35 1,50 1,52 6.244}
{0 CHEMBL1727312,1 1,35 1,52 5.2}
{0 CHEMBL17370,1 1,16 1,24 1,52 5.4}
{0 CHEMBL178737,1 1,31 1,52 5.2}
{0 CHEMBL1789941,1 1,2 1,39 1,52 5}
{0 CHEMBL180022,1 1,2 1,35 1,52 5.108}
{0 CHEMBL1825138,1 1,26 1,52 5.2}
{0 CHEMBL1834657,1 1,2 1,16 1,35 1,52 5}
{0 CHEMBL183844,1 1,6 1,35 1,52 5.2}
{0 CHEMBL184847,1 1,35 1,52 5.2}
{0 CHEMBL185569,1 1,35 1,52 5.2}
{0 CHEMBL1908391,1 1,2 1,35 1,38 1,52 5}
{0 CHEMBL1908392,1 1,2 1,8 1,52 5}
{0 CHEMBL1908393,1 1,2 1,35 1,52 5}
{0 CHEMBL1908394,1 1,2 1,49 1,52 5}
{0 CHEMBL1908395,1 1,2 1,24 1,35 1,52 5}
{0 CHEMBL1908396,1 1,35 1,52 5}
{0 CHEMBL1908397,1 1,4 1,50 1,52 5.921}
{0 CHEMBL191003,1 1,23 1,26 1,52 5.102}
{0 CHEMBL1958401,1 1,52 5.6}
{0 CHEMBL196363,1 1,21 1,26 1,27 1,35 1,52 5.3}
{0 CHEMBL1964290,1 1,26 1,52 7.1}
{0 CHEMBL1964444,1 1,35 1,49 1,52 5.2}
{0 CHEMBL1964644,1 1,35 1,51 1,52 5.2}
{0 CHEMBL1964687,1 1,21 1,24 1,26 1,27 1,35 1,52 5.2}
{0 CHEMBL1964692,1 1,26 1,35 1,49 1,52 6.2}
{0 CHEMBL1964777,1 1,52 5.7}
{0 CHEMBL1964804,1 1,52 5.2}
{0 CHEMBL1964937,1 1,52 5.2}
{0 CHEMBL1965131,1 1,35 1,52 5.2}
{0 CHEMBL1965423,1 1,26 1,37 1,39 1,50 1,52 5.2}
{0 CHEMBL1965507,1 1,21 1,26 1,35 1,52 5.2}
{0 CHEMBL1965570,1 1,16 1,26 1,35 1,52 5.8}
{0 CHEMBL1965589,1 1,35 1,52 5.3}
{0 CHEMBL1965660,1 1,26 1,52 8}
{0 CHEMBL1965836,1 1,4 1,50 1,52 6.3}
{0 CHEMBL1965845,1 1,52 5.2}
{0 CHEMBL1966035,1 1,12 1,38 1,52 5.3}
{0 CHEMBL1966087,1 1,25 1,52 5.2}
{0 CHEMBL1966279,1 1,24 1,35 1,52 5.2}
{0 CHEMBL1966343,1 1,4 1,26 1,52 5.8}
{0 CHEMBL1966425,1 1,2 1,52 5.2}
{0 CHEMBL1966628,1 1,35 1,52 7.3}
{0 CHEMBL1966703,1 1,4 1,50 1,52 5.2}
{0 CHEMBL1966722,1 1,35 1,52 6}
{0 CHEMBL1966808,1 1,16 1,35 1,52 5.2}
{0 CHEMBL1966816,1 1,9 1,35 1,49 1,52 5.2}
{0 CHEMBL1967094,1 1,4 1,40 1,52 5.2}
{0 CHEMBL1967302,1 1,6 1,35 1,43 1,52 5.2}
{0 CHEMBL1967531,1 1,21 1,26 1,27 1,35 1,52 6}
{0 CHEMBL1967544,1 1,52 5.2}
{0 CHEMBL1967564,1 1,4 1,35 1,40 1,52 5.2}
{0 CHEMBL1967720,1 1,26 1,35 1,52 5.3}
{0 CHEMBL1967878,1 1,2 1,35 1,52 5.7}
{0 CHEMBL1967887,1 1,4 1,50 1,52 5.5}
{0 CHEMBL1968127,1 1,2 1,32 1,35 1,37 1,52 6}
{0 CHEMBL1968151,1 1,16 1,35 1,52 5.2}
{0 CHEMBL1968380,1 1,2 1,17 1,52 6.1}
{0 CHEMBL1968406,1 1,21 1,26 1,27 1,35 1,52 5.2}
{0 CHEMBL1968590,1 1,26 1,36 1,52 5.2}
{0 CHEMBL1968705,1 1,2 1,4 1,29 1,35 1,38 1,52 5.2}
{0 CHEMBL1968791,1 1,2 1,26 1,27 1,52 5.2}
{0 CHEMBL1968926,1 1,4 1,16 1,52 5.2}
{0 CHEMBL1969042,4 1,52 5.2}
{0 CHEMBL1969049,1 1,16 1,24 1,52 5.2}
{0 CHEMBL1969126,1 1,37 1,52 5.2}
{0 CHEMBL1969190,1 1,26 1,35 1,52 5.2}
{0 CHEMBL1969301,1 1,2 1,24 1,35 1,39 1,52 6.1}
{0 CHEMBL1969372,1 1,17 1,35 1,52 5.7}
{0 CHEMBL1969502,1 1,28 1,35 1,39 1,43 1,52 5.2}
{0 CHEMBL1969506,1 1,35 1,42 1,52 5.2}
{0 CHEMBL1969537,1 1,52 5.5}
{0 CHEMBL1969588,1 1,35 1,52 7.7}
{0 CHEMBL1969664,1 1,2 1,52 5.2}
{0 CHEMBL1969735,1 1,32 1,35 1,52 5.2}
{0 CHEMBL1969755,1 1,16 1,35 1,52 5.2}
{0 CHEMBL1969843,1 1,4 1,10 1,29 1,47 1,52 6.8}
{0 CHEMBL1969879,1 1,10 1,52 5.2}
{0 CHEMBL1970104,1 1,3 1,4 1,31 1,52 5.2}
{0 CHEMBL1970142,1 1,26 1,35 1,36 1,52 5.2}
{0 CHEMBL1970189,1 1,2 1,4 1,16 1,50 1,52 5.2}
{0 CHEMBL1970203,1 1,21 1,24 1,26 1,35 1,52 5.2}
{0 CHEMBL1970217,1 1,16 1,52 5.2}
{0 CHEMBL1970314,1 1,6 1,26 1,52 5.2}
{0 CHEMBL1970340,26 1,52 5.2}
{0 CHEMBL1970369,1 1,4 1,8 1,29 1,52 5.2}
{0 CHEMBL1970522,1 1,52 5.6}
{0 CHEMBL1970709,1 1,4 1,29 1,35 1,52 5.2}
{0 CHEMBL1970735,1 1,2 1,26 1,35 1,52 5.2}
{0 CHEMBL1970806,1 1,35 1,52 5.2}
{0 CHEMBL1970903,1 1,4 1,43 1,50 1,52 7}
{0 CHEMBL1970913,1 1,35 1,52 5.2}
{0 CHEMBL1971021,1 1,24 1,35 1,49 1,52 5.2}
{0 CHEMBL1971141,1 1,6 1,35 1,52 5.2}
{0 CHEMBL1971149,1 1,32 1,35 1,52 5.2}
{0 CHEMBL1971186,1 1,35 1,37 1,52 6.6}
{0 CHEMBL1971245,1 1,2 1,52 5.2}
{0 CHEMBL1971430,1 1,24 1,52 5.2}
{0 CHEMBL1971649,1 1,7 1,26 1,35 1,52 5.2}
{0 CHEMBL1971694,1 1,35 1,52 5.2}
{0 CHEMBL1971943,1 1,19 1,26 1,52 5.2}
{0 CHEMBL1972119,1 1,35 1,49 1,52 5.2}
{0 CHEMBL1972125,1 1,6 1,26 1,43 1,52 5.2}
{0 CHEMBL1972142,1 1,6 1,52 5.2}
{0 CHEMBL1972158,1 1,4 1,26 1,52 6.3}
{0 CHEMBL1972183,1 1,2 1,52 5.2}
{0 CHEMBL1972221,1 1,4 1,35 1,52 5.2}
{0 CHEMBL1972258,1 1,25 1,52 5.2}
{0 CHEMBL1972276,1 1,2 1,31 1,35 1,52 5.2}
{0 CHEMBL1972489,1 1,4 1,35 1,52 5.2}
{0 CHEMBL1972568,1 1,25 1,52 5.2}
{0 CHEMBL1972576,1 1,21 1,26 1,35 1,52 5.2}
{0 CHEMBL1972584,1 1,2 1,6 1,26 1,35 1,52 5.2}
{0 CHEMBL1972659,1 1,52 5.2}
{0 CHEMBL1972820,1 1,15 1,52 5.2}
{0 CHEMBL1972849,1 1,37 1,52 5.2}
{0 CHEMBL1972937,1 1,52 5.2}
{0 CHEMBL1973098,1 1,52 5.9}
{0 CHEMBL1973142,1 1,35 1,52 5.2}
{0 CHEMBL1973145,1 1,21 1,26 1,27 1,35 1,52 5.2}
{0 CHEMBL1973211,1 1,2 1,26 1,35 1,52 5.8}
{0 CHEMBL1973348,1 1,6 1,26 1,43 1,52 5.2}
{0 CHEMBL1973483,1 1,35 1,49 1,52 5.6}
{0 CHEMBL1973540,1 1,35 1,52 5.8}
{0 CHEMBL1973808,1 1,4 1,29 1,35 1,52 5.2}
{0 CHEMBL1973860,1 1,16 1,35 1,52 5.2}
{0 CHEMBL1973893,1 1,4 1,35 1,52 5.2}
{0 CHEMBL1973937,1 1,4 1,10 1,26 1,35 1,52 5.2}
{0 CHEMBL1974254,1 1,26 1,35 1,52 5.2}
{0 CHEMBL1974288,1 1,16 1,52 5.2}
{0 CHEMBL1974310,1 1,52 5.6}
{0 CHEMBL1974328,1 1,35 1,52 5.6}
{0 CHEMBL1974416,1 1,35 1,52 5.2}
{0 CHEMBL1974664,1 1,24 1,39 1,52 5.2}
{0 CHEMBL1974702,1 1,9 1,34 1,52 5.2}
{0 CHEMBL1974803,1 1,35 1,52 5.2}
{0 CHEMBL1974870,1 1,4 1,50 1,52 6.6}
{0 CHEMBL1974935,1 1,25 1,43 1,52 5.2}
{0 CHEMBL1975121,1 1,16 1,52 5.2}
{0 CHEMBL1975138,1 1,35 1,52 5.2}
{0 CHEMBL1975208,1 1,15 1,21 1,42 1,52 5.2}
{0 CHEMBL1975233,1 1,2 1,35 1,52 5.2}
{0 CHEMBL1975256,1 1,26 1,52 5.2}
{0 CHEMBL1975490,1 1,52 5.2}
{0 CHEMBL1975500,1 1,13 1,35 1,42 1,52 5.2}
{0 CHEMBL1975534,1 1,26 1,52 5.2}
{0 CHEMBL1975647,1 1,9 1,35 1,52 5.2}
{0 CHEMBL1975900,1 1,35 1,52 6.9}
{0 CHEMBL1976090,21 1,26 1,52 5.9}
{0 CHEMBL1976093,1 1,2 1,17 1,32 1,35 1,52 5.2}
{0 CHEMBL1976134,4 1,52 5.4}
{0 CHEMBL1976220,1 1,26 1,35 1,52 5.2}
{0 CHEMBL1976240,1 1,16 1,52 5.2}
{0 CHEMBL1976420,1 1,52 5.2}
{0 CHEMBL1976455,1 1,35 1,49 1,52 5.6}
{0 CHEMBL1976732,1 1,37 1,52 5.2}
{0 CHEMBL1977135,1 1,16 1,52 5.2}
{0 CHEMBL1977148,1 1,23 1,26 1,35 1,52 5.2}
{0 CHEMBL1977346,1 1,35 1,36 1,52 5.2}
{0 CHEMBL1977374,1 1,52 5.2}
{0 CHEMBL1977604,1 1,8 1,52 5.2}
{0 CHEMBL1977681,1 1,4 1,36 1,40 1,52 6}
{0 CHEMBL1978014,1 1,2 1,26 1,47 1,52 6.2}
{0 CHEMBL1978099,1 1,36 1,52 5.2}
{0 CHEMBL1978200,1 1,35 1,52 5.5}
{0 CHEMBL1978448,1 1,2 1,35 1,52 6.8}
{0 CHEMBL1979057,1 1,31 1,52 5.2}
{0 CHEMBL1979093,1 1,26 1,35 1,52 5.2}
{0 CHEMBL1979176,1 1,35 1,49 1,52 5.2}
{0 CHEMBL1979252,1 1,24 1,35 1,49 1,52 6.3}
{0 CHEMBL1979318,1 1,2 1,4 1,16 1,50 1,52 5.2}
{0 CHEMBL1979357,1 1,24 1,25 1,52 5.2}
{0 CHEMBL1979516,1 1,26 1,35 1,52 5.2}
{0 CHEMBL1979855,1 1,2 1,35 1,52 5.2}
{0 CHEMBL1979883,1 1,2 1,26 1,35 1,52 5.3}
{0 CHEMBL1980142,1 1,35 1,49 1,52 5.2}
{0 CHEMBL1980144,1 1,21 1,26 1,35 1,52 5.3}
{0 CHEMBL1980163,1 1,52 5.2}
{0 CHEMBL1980297,1 1,23 1,26 1,35 1,52 5.2}
{0 CHEMBL1980391,1 1,4 1,8 1,52 5.2}
{0 CHEMBL1980489,1 1,35 1,52 6.8}
{0 CHEMBL1980540,1 1,9 1,35 1,49 1,52 5.2}
{0 CHEMBL1980704,1 1,52 5.2}
{0 CHEMBL1980896,1 1,21 1,26 1,27 1,35 1,52 5.2}
{0 CHEMBL1981047,1 1,2 1,3 1,4 1,29 1,35 1,50 1,52 5.2}
{0 CHEMBL1981079,1 1,26 1,52 7.5}
{0 CHEMBL1981410,1 1,35 1,36 1,49 1,52 5.2}
{0 CHEMBL1981725,1 1,2 1,6 1,35 1,52 5.2}
{0 CHEMBL1981782,1 1,4 1,29 1,35 1,52 5.5}
{0 CHEMBL1982122,1 1,16 1,35 1,52 5.8}
{0 CHEMBL1982135,1 1,21 1,26 1,27 1,35 1,52 5.2}
{0 CHEMBL1982361,1 1,35 1,52 6.9}
{0 CHEMBL1982383,1 1,32 1,35 1,52 5.9}
{0 CHEMBL1982466,1 1,26 1,35 1,52 5.2}
{0 CHEMBL1982506,1 1,52 5.2}
{0 CHEMBL1982563,1 1,32 1,35 1,52 5.6}
{0 CHEMBL1982610,1 1,38 1,52 5.2}
{0 CHEMBL1982660,1 1,35 1,49 1,52 5.2}
{0 CHEMBL1982711,1 1,34 1,35 1,52 5.8}
{0 CHEMBL1982866,1 1,17 1,50 1,52 5.2}
{0 CHEMBL1982874,1 1,26 1,37 1,39 1,50 1,52 5.2}
{0 CHEMBL1982924,1 1,35 1,52 5.2}
{0 CHEMBL1982957,1 1,6 1,52 5.2}
{0 CHEMBL1982980,1 1,50 1,52 5.2}
{0 CHEMBL1982992,21 1,52 5.2}
{0 CHEMBL1983111,1 1,35 1,42 1,49 1,52 5.2}
{0 CHEMBL1983195,1 1,35 1,52 5.2}
{0 CHEMBL1983309,1 1,11 1,35 1,52 5.5}
{0 CHEMBL1983449,1 1,12 1,24 1,52 6}
{0 CHEMBL1983534,1 1,16 1,20 1,35 1,52 5.2}
{0 CHEMBL1983923,1 1,2 1,4 1,16 1,50 1,52 5.2}
{0 CHEMBL1983932,1 1,35 1,52 5.2}
{0 CHEMBL1983945,1 1,25 1,35 1,43 1,52 5.2}
{0 CHEMBL1983963,1 1,21 1,26 1,27 1,35 1,52 5.6}
{0 CHEMBL1984038,1 1,20 1,35 1,52 5.2}
{0 CHEMBL1984039,1 1,50 1,52 5.2}
{0 CHEMBL1984044,1 1,2 1,31 1,52 5.2}
{0 CHEMBL1984191,4 1,50 1,52 5.2}
{0 CHEMBL1984274,1 1,2 1,48 1,52 5.8}
{0 CHEMBL1984363,1 1,4 1,26 1,35 1,52 5.2}
{0 CHEMBL1984367,1 1,4 1,40 1,52 5.2}
{0 CHEMBL1984586,1 1,21 1,26 1,27 1,35 1,52 5.5}
{0 CHEMBL1984633,1 1,16 1,52 5.2}
{0 CHEMBL1984700,1 1,35 1,52 5.3}
{0 CHEMBL1984788,1 1,31 1,52 5.2}
{0 CHEMBL1985074,1 1,52 5.2}
{0 CHEMBL1985092,4 1,52 5.2}
{0 CHEMBL1985095,1 1,4 1,26 1,29 1,52 5.2}
{0 CHEMBL1985406,1 1,4 1,35 1,40 1,52 5.2}
{0 CHEMBL1986139,21 1,52 5.2}
{0 CHEMBL1986186,1 1,12 1,41 1,52 6.3}
{0 CHEMBL1986263,1 1,52 6}
{0 CHEMBL1986328,1 1,35 1,52 5.6}
{0 CHEMBL1986499,1 1,4 1,26 1,52 5.9}
{0 CHEMBL1986530,1 1,24 1,39 1,52 5.2}
{0 CHEMBL1986597,1 1,2 1,18 1,24 1,31 1,35 1,52 5.2}
{0 CHEMBL1986603,1 1,35 1,52 5.2}
{0 CHEMBL1986781,1 1,35 1,37 1,52 6.5}
{0 CHEMBL1986869,1 1,16 1,21 1,26 1,35 1,52 5.2}
{0 CHEMBL1986943,1 1,35 1,52 6.2}
{0 CHEMBL1986970,1 1,4 1,29 1,52 5.2}
{0 CHEMBL1987007,1 1,2 1,4 1,40 1,52 5.2}
{0 CHEMBL1987009,1 1,4 1,40 1,52 5.5}
{0 CHEMBL1987034,1 1,2 1,52 5.2}
{0 CHEMBL1987359,1 1,13 1,30 1,35 1,52 5.2}
{0 CHEMBL1987533,1 1,4 1,35 1,52 5.2}
{0 CHEMBL1987679,1 1,35 1,43 1,52 5.2}
{0 CHEMBL1987793,1 1,52 5.2}
{0 CHEMBL1987910,1 1,26 1,35 1,49 1,52 5.2}
{0 CHEMBL1988075,1 1,26 1,35 1,52 5.2}
{0 CHEMBL1988153,1 1,49 1,52 6.3}
{0 CHEMBL1988163,1 1,36 1,52 5.2}
{0 CHEMBL1988173,1 1,35 1,52 6.5}
{0 CHEMBL1988300,1 1,26 1,31 1,52 5.2}
{0 CHEMBL1988387,1 1,26 1,35 1,52 5.2}
{0 CHEMBL1988537,1 1,52 5.2}
{0 CHEMBL1988594,1 1,21 1,26 1,35 1,52 5.2}
{0 CHEMBL1988608,1 1,4 1,12 1,29 1,35 1,52 5.2}
{0 CHEMBL1988717,1 1,26 1,35 1,49 1,52 5.2}
{0 CHEMBL1988838,1 1,52 5.2}
{0 CHEMBL1988995,1 1,37 1,52 5.2}
{0 CHEMBL1989029,1 1,4 1,16 1,33 1,52 5.2}
{0 CHEMBL1989265,1 1,52 5.2}
{0 CHEMBL1989474,1 1,17 1,50 1,52 5.2}
{0 CHEMBL1989518,1 1,25 1,52 5.2}
{0 CHEMBL1989646,1 1,4 1,26 1,52 7}
{0 CHEMBL1989708,1 1,26 1,35 1,52 5.3}
{0 CHEMBL1989805,1 1,2 1,27 1,52 5.8}
{0 CHEMBL1990254,1 1,16 1,52 5.2}
{0 CHEMBL1990288,1 1,35 1,37 1,52 6.7}
{0 CHEMBL1990415,1 1,4 1,35 1,40 1,52 5.2}
{0 CHEMBL1990482,1 1,16 1,31 1,52 5.2}
{0 CHEMBL1990496,1 1,52 5.2}
{0 CHEMBL1990821,1 1,24 1,50 1,52 5.2}
{0 CHEMBL1990884,1 1,24 1,26 1,52 5.2}
{0 CHEMBL1990885,1 1,2 1,35 1,50 1,52 6.3}
{0 CHEMBL1990904,1 1,17 1,35 1,52 6}
{0 CHEMBL1990912,1 1,35 1,52 5.2}
{0 CHEMBL1991063,1 1,4 1,50 1,52 6.8}
{0 CHEMBL1991078,1 1,4 1,35 1,47 1,52 7.1}
{0 CHEMBL1991138,1 1,2 1,26 1,52 5.2}
{0 CHEMBL1991143,1 1,52 5.2}
{0 CHEMBL1991188,1 1,16 1,52 5.2}
{0 CHEMBL1991285,1 1,2 1,35 1,52 5.2}
{0 CHEMBL1991356,1 1,35 1,52 5.2}
{0 CHEMBL1991395,1 1,17 1,32 1,35 1,52 5.4}
{0 CHEMBL1991429,1 1,23 1,35 1,37 1,52 5.2}
{0 CHEMBL1991434,1 1,7 1,26 1,52 5.2}
{0 CHEMBL1991674,1 1,14 1,35 1,40 1,52 5.3}
{0 CHEMBL1991725,1 1,2 1,43 1,52 5.2}
{0 CHEMBL1992306,1 1,35 1,36 1,49 1,52 5.2}
{0 CHEMBL1992323,1 1,52 5.2}
{0 CHEMBL1992342,1 1,4 1,26 1,35 1,52 5.2}
{0 CHEMBL1992536,1 1,4 1,12 1,29 1,52 5.2}
{0 CHEMBL1992555,1 1,31 1,48 1,52 5.2}
{0 CHEMBL1992634,52 5.2}
{0 CHEMBL1993243,1 1,26 1,36 1,52 5.2}
{0 CHEMBL1993424,1 1,52 5.2}
{0 CHEMBL1993548,1 1,52 5.2}
{0 CHEMBL1993584,1 1,25 1,43 1,52 5.2}
{0 CHEMBL1993661,1 1,20 1,36 1,52 5.2}
{0 CHEMBL1993941,1 1,26 1,35 1,52 5.2}
{0 CHEMBL1994040,1 1,35 1,52 5.2}
{0 CHEMBL1994074,4 1,52 5.2}
{0 CHEMBL1994538,1 1,35 1,49 1,52 5.2}
{0 CHEMBL1994693,1 1,21 1,26 1,27 1,35 1,52 5.3}
{0 CHEMBL1994830,26 1,52 7}
{0 CHEMBL1994864,1 1,12 1,52 6.6}
{0 CHEMBL1994938,1 1,26 1,36 1,50 1,52 5.2}
{0 CHEMBL1995172,1 1,4 1,52 5.2}
{0 CHEMBL1995736,1 1,31 1,52 5.2}
{0 CHEMBL1995813,1 1,35 1,52 6.6}
{0 CHEMBL1995832,1 1,32 1,35 1,52 5.5}
{0 CHEMBL1995927,1 1,11 1,35 1,52 5.2}
{0 CHEMBL1996066,1 1,2 1,26 1,38 1,52 7.4}
{0 CHEMBL1996111,1 1,4 1,29 1,52 5.2}
{0 CHEMBL1996208,1 1,6 1,16 1,52 5.2}
{0 CHEMBL1996234,1 1,26 1,52 5.2}
{0 CHEMBL1996500,1 1,35 1,52 5.2}
{0 CHEMBL1996587,1 1,52 5.2}
{0 CHEMBL1996791,1 1,26 1,52 5.2}
{0 CHEMBL1996817,1 1,52 5.2}
{0 CHEMBL1996831,1 1,15 1,39 1,52 6}
{0 CHEMBL1996923,11 1,52 5.2}
{0 CHEMBL1996931,1 1,16 1,35 1,52 5.2}
{0 CHEMBL1996979,1 1,35 1,52 5.2}
{0 CHEMBL1997023,1 1,35 1,42 1,52 5.2}
{0 CHEMBL1997340,1 1,4 1,29 1,52 5.2}
{0 CHEMBL1997349,1 1,2 1,39 1,52 5.9}
{0 CHEMBL1997503,1 1,35 1,52 5.2}
{0 CHEMBL1997534,1 1,4 1,52 5.2}
{0 CHEMBL1997597,1 1,4 1,26 1,35 1,52 5.2}
{0 CHEMBL1997617,1 1,2 1,26 1,27 1,52 5.2}
{0 CHEMBL1997764,1 1,35 1,52 5.2}
{0 CHEMBL1997846,1 1,14 1,35 1,40 1,52 5.7}
{0 CHEMBL1997872,1 1,6 1,52 5.2}
{0 CHEMBL1998112,1 1,52 5.2}
{0 CHEMBL1998121,1 1,4 1,29 1,35 1,52 6.1}
{0 CHEMBL1998159,1 1,4 1,20 1,24 1,49 1,50 1,52 7.1}
{0 CHEMBL1998193,1 1,35 1,52 5.2}
{0 CHEMBL1998414,1 1,4 1,40 1,50 1,52 6.3}
{0 CHEMBL1998435,1 1,16 1,35 1,52 5.2}
{0 CHEMBL1998545,1 1,16 1,35 1,52 5.2}
{0 CHEMBL1998551,1 1,52 5.2}
{0 CHEMBL1998585,1 1,21 1,26 1,27 1,35 1,49 1,52 5.2}
{0 CHEMBL1998611,1 1,9 1,26 1,34 1,52 5.2}
{0 CHEMBL1998829,1 1,35 1,52 5.2}
{0 CHEMBL1999112,1 1,2 1,27 1,52 5.2}
{0 CHEMBL1999126,1 1,2 1,39 1,52 5.2}
{0 CHEMBL1999321,1 1,35 1,52 5.2}
{0 CHEMBL1999428,1 1,16 1,52 5.2}
{0 CHEMBL1999496,1 1,24 1,35 1,52 5.2}
{0 CHEMBL1999590,1 1,52 5.2}
{0 CHEMBL1999714,1 1,35 1,52 5.2}
{0 CHEMBL1999718,1 1,2 1,35 1,49 1,52 5.2}
{0 CHEMBL1999811,1 1,35 1,39 1,52 5.8}
{0 CHEMBL1999931,1 1,4 1,35 1,47 1,52 8.1}
{0 CHEMBL2000071,1 1,35 1,52 5.2}
{0 CHEMBL2000114,1 1,35 1,52 5.2}
{0 CHEMBL2000335,1 1,21 1,26 1,27 1,35 1,52 5.6}
{0 CHEMBL2000354,1 1,52 5.4}
{0 CHEMBL2000393,1 1,11 1,35 1,52 5.2}
{0 CHEMBL2000408,1 1,32 1,35 1,52 5.4}
{0 CHEMBL2000429,1 1,32 1,35 1,52 5.5}
{0 CHEMBL2000481,1 1,13 1,24 1,35 1,52 5.2}
{0 CHEMBL2000508,16 1,37 1,52 6.2}
{0 CHEMBL2000568,1 1,6 1,50 1,52 5.2}
{0 CHEMBL2000801,1 1,35 1,42 1,49 1,52 5.2}
{0 CHEMBL2000832,1 1,35 1,52 5.5}
{0 CHEMBL2000894,1 1,16 1,34 1,52 5.2}
{0 CHEMBL2001224,1 1,2 1,35 1,52 5.2}
{0 CHEMBL2001239,1 1,26 1,52 5.6}
{0 CHEMBL2001257,1 1,2 1,26 1,35 1,52 5.2}
{0 CHEMBL2001288,1 1,26 1,29 1,52 5.2}
{0 CHEMBL2001485,1 1,26 1,35 1,52 5.2}
{0 CHEMBL2001547,1 1,35 1,52 5.6}
{0 CHEMBL2001668,1 1,38 1,52 5.2}
{0 CHEMBL2001751,1 1,6 1,27 1,35 1,43 1,52 5.9}
{0 CHEMBL2001920,1 1,35 1,52 5.2}
{0 CHEMBL2001957,1 1,32 1,35 1,52 5.4}
{0 CHEMBL2002165,1 1,26 1,35 1,52 5.2}
{0 CHEMBL2002240,1 1,2 1,26 1,35 1,52 5.2}
{0 CHEMBL2002373,1 1,16 1,52 5.2}
{0 CHEMBL2002479,1 1,11 1,52 5.7}
{0 CHEMBL2002649,1 1,35 1,52 5.2}
{0 CHEMBL2002682,1 1,50 1,52 5.2}
{0 CHEMBL2002702,1 1,35 1,50 1,52 5.4}
{0 CHEMBL2002726,1 1,4 1,50 1,52 6.3}
{0 CHEMBL2003271,1 1,35 1,52 5.2}
{0 CHEMBL2003286,1 1,52 5.5}
{0 CHEMBL2003341,1 1,16 1,52 5.2}
{0 CHEMBL2003420,1 1,52 5.2}
{0 CHEMBL2003456,1 1,35 1,52 5.2}
{0 CHEMBL2003482,1 1,4 1,35 1,40 1,52 5.2}
{0 CHEMBL2003638,1 1,4 1,35 1,47 1,52 7.7}
{0 CHEMBL2003768,1 1,12 1,52 5.4}
{0 CHEMBL2003817,1 1,35 1,49 1,52 5.2}
{0 CHEMBL2004290,1 1,26 1,35 1,52 5.2}
{0 CHEMBL2004311,1 1,24 1,35 1,52 5.2}
{0 CHEMBL2004365,1 1,27 1,52 5.8}
{0 CHEMBL2004419,1 1,9 1,26 1,37 1,39 1,50 1,52 5.2}
{0 CHEMBL2004447,1 1,2 1,4 1,16 1,50 1,52 5.2}
{0 CHEMBL2004544,1 1,35 1,52 5.7}
{0 CHEMBL2004615,1 1,14 1,26 1,52 5.2}
{0 CHEMBL2004692,1 1,26 1,52 5.2}
{0 CHEMBL2004716,1 1,2 1,26 1,35 1,36 1,52 5.2}
{0 CHEMBL2004771,1 1,52 5.2}
{0 CHEMBL2004871,1 1,16 1,52 5.2}
{0 CHEMBL2004872,1 1,50 1,52 5.2}
{0 CHEMBL2004892,1 1,4 1,26 1,35 1,52 5.2}
{0 CHEMBL2004934,1 1,16 1,52 5.2}
{0 CHEMBL2005112,1 1,2 1,39 1,52 5.2}
{0 CHEMBL2005186,1 1,4 1,29 1,38 1,52 5.2}
{0 CHEMBL2005375,1 1,17 1,52 5.5}
{0 CHEMBL2005475,1 1,4 1,40 1,52 5.2}
{0 CHEMBL2005528,1 1,50 1,52 5.2}
{0 CHEMBL2005828,1 1,21 1,26 1,27 1,35 1,52 5.7}
{0 CHEMBL2005886,1 1,2 1,28 1,31 1,52 5.2}
{0 CHEMBL2005899,1 1,41 1,52 6.2}
{0 CHEMBL2005936,1 1,4 1,35 1,40 1,52 6.3}
{0 CHEMBL2006010,1 1,35 1,49 1,52 5.5}
{0 CHEMBL2006156,1 1,35 1,52 5.5}
{0 CHEMBL2006188,1 1,16 1,35 1,52 5.2}
{0 CHEMBL2006237,1 1,2 1,31 1,35 1,52 5.2}
{0 CHEMBL2006263,1 1,26 1,35 1,52 5.7}
{0 CHEMBL2006276,1 1,35 1,52 5.2}
{0 CHEMBL2006439,1 1,35 1,52 7.5}
{0 CHEMBL2006481,1 1,4 1,29 1,52 5.2}
{0 CHEMBL2006493,1 1,49 1,52 5.2}
{0 CHEMBL2006580,21 1,52 5.2}
{0 CHEMBL2006715,1 1,23 1,35 1,37 1,52 5.2}
{0 CHEMBL2006785,1 1,2 1,35 1,52 5.2}
{0 CHEMBL2006836,1 1,2 1,15 1,39 1,52 5.2}
{0 CHEMBL2007002,1 1,4 1,35 1,52 5.2}
{0 CHEMBL2007064,1 1,35 1,50 1,52 5.2}
{0 CHEMBL2007296,1 1,16 1,52 5.2}
{0 CHEMBL2007372,1 1,32 1,35 1,36 1,52 5.2}
{0 CHEMBL2007592,1 1,35 1,52 5.2}
{0 CHEMBL207400,1 1,49 1,52 5.2}
{0 CHEMBL208637,1 1,2 1,26 1,35 1,52 5.2}
{0 CHEMBL210887,1 1,35 1,39 1,52 5.4}
{0 CHEMBL210928,1 1,26 1,35 1,52 5.2}
{0 CHEMBL210963,1 1,2 1,26 1,35 1,52 5.2}
{0 CHEMBL211378,1 1,26 1,35 1,52 5.2}
{0 CHEMBL213505,1 1,26 1,35 1,49 1,52 5.5}
{0 CHEMBL215152,1 1,2 1,4 1,35 1,50 1,52 5}
{0 CHEMBL220057,1 1,4 1,26 1,35 1,52 5.2}
{0 CHEMBL220241,1 1,2 1,26 1,35 1,38 1,39 1,52 5.2}
{0 CHEMBL2205766,1 1,6 1,16 1,26 1,52 5}
{0 CHEMBL221959,1 1,2 1,10 1,52 5}
{0 CHEMBL223360,1 1,4 1,26 1,35 1,52 5.1}
{0 CHEMBL225519,1 1,16 1,50 1,52 6.8}
{0 CHEMBL230011,26 1,52 5.06}
{0 CHEMBL2309006,1 1,7 1,44 1,52 5}
{0 CHEMBL2309609,1 1,8 1,44 1,52 5}
{0 CHEMBL231209,1 1,26 1,35 1,52 5.2}
{0 CHEMBL243088,1 1,15 1,52 6.6}
{0 CHEMBL244378,1 1,4 1,15 1,52 6.4}
{0 CHEMBL246970,1 1,20 1,35 1,52 5.2}
{0 CHEMBL24828,1 1,2 1,52 5}
{0 CHEMBL249697,1 1,35 1,52 5}
{0 CHEMBL253969,1 1,2 1,35 1,52 5.2}
{0 CHEMBL255863,1 1,35 1,49 1,52 5}
{0 CHEMBL256835,1 1,52 5.2}
{0 CHEMBL259084,1 1,15 1,52 5}
{0 CHEMBL259922,1 1,35 1,42 1,52 5.2}
{0 CHEMBL260135,4 1,26 1,40 1,52 5.2}
{0 CHEMBL260933,1 1,24 1,25 1,49 1,52 5.2}
{0 CHEMBL261849,1 1,26 1,52 5}
{0 CHEMBL262433,1 1,26 1,35 1,52 5.2}
{0 CHEMBL271381,1 1,26 1,35 1,52 5.2}
{0 CHEMBL272453,1 1,26 1,35 1,52 5.2}
{0 CHEMBL278041,16 1,24 1,52 5}
{0 CHEMBL288441,1 1,2 1,52 5}
{0 CHEMBL296468,1 1,35 1,45 1,52 5}
{0 CHEMBL300138,1 1,2 1,52 5}
{0 CHEMBL306380,1 1,26 1,52 5.2}
{0 CHEMBL316264,16 1,24 1,52 5.2}
{0 CHEMBL31965,1 1,2 1,35 1,52 5}
{0 CHEMBL340384,1 1,16 1,34 1,52 5.6}
{0 CHEMBL340921,1 1,16 1,34 1,52 5.2}
{0 CHEMBL362558,1 1,31 1,52 5.2}
{0 CHEMBL363648,1 1,6 1,16 1,35 1,52 5.3}
{0 CHEMBL371206,1 1,21 1,24 1,26 1,27 1,35 1,52 5.2}
{0 CHEMBL377300,1 1,50 1,52 5}
{0 CHEMBL377383,1 1,26 1,52 5.2}
{0 CHEMBL378627,1 1,2 1,26 1,35 1,52 5.2}
{0 CHEMBL379218,1 1,4 1,50 1,52 6.041}
{0 CHEMBL379835,1 1,52 5.2}
{0 CHEMBL384304,1 1,2 1,26 1,35 1,52 5}
{0 CHEMBL386051,1 1,52 5}
{0 CHEMBL387971,1 1,2 1,4 1,24 1,52 5.2}
{0 CHEMBL392642,1 1,20 1,35 1,52 5.4}
{0 CHEMBL394619,1 1,26 1,35 1,52 5.2}
{0 CHEMBL394790,1 1,26 1,35 1,52 5.2}
{0 CHEMBL396523,1 1,4 1,15 1,29 1,52 6.8}
{0 CHEMBL402846,1 1,26 1,35 1,52 5.8}
{0 CHEMBL404367,1 1,26 1,35 1,52 6.1}
{0 CHEMBL408982,1 1,25 1,52 6.538}
{0 CHEMBL411903,1 1,26 1,35 1,49 1,52 5.2}
{0 CHEMBL41783,1 1,2 1,4 1,35 1,40 1,52 5.2}
{0 CHEMBL422897,1 1,2 1,52 5.2}
{0 CHEMBL428690,1 1,2 1,52 5}
{0 CHEMBL440084,1 1,52 5}
{0 CHEMBL445813,1 1,4 1,35 1,52 5}
{0 CHEMBL450786,1 1,2 1,24 1,35 1,50 1,52 5}
{0 CHEMBL458997,1 1,36 1,52 5.2}
{0 CHEMBL462120,1 1,35 1,52 5.2}
{0 CHEMBL464552,1 1,2 1,36 1,52 5}
{0 CHEMBL468280,1 1,52 5.2}
{0 CHEMBL475251,1 1,20 1,35 1,47 1,52 5.1}
{0 CHEMBL477772,1 1,52 5}
{0 CHEMBL481491,1 1,49 1,52 5.2}
{0 CHEMBL482767,1 1,35 1,52 5.2}
{0 CHEMBL482967,1 1,26 1,52 5.2}
{0 CHEMBL483158,1 1,15 1,52 5.2}
{0 CHEMBL483321,1 1,36 1,52 5}
{0 CHEMBL484390,1 1,2 1,35 1,39 1,52 5.2}
{0 CHEMBL491473,1 1,2 1,50 1,52 5.1}
{0 CHEMBL494089,1 1,26 1,38 1,52 5}
{0 CHEMBL497151,52 5.7}
{0 CHEMBL508928,1 1,26 1,35 1,52 5.2}
{0 CHEMBL509032,1 1,2 1,52 5.1}
{0 CHEMBL513846,1 1,52 5.2}
{0 CHEMBL513909,1 1,2 1,17 1,52 5.62}
{0 CHEMBL519697,1 1,2 1,35 1,39 1,52 5.6}
{0 CHEMBL521851,1 1,2 1,4 1,38 1,52 5}
{0 CHEMBL522892,1 1,2 1,31 1,35 1,52 5}
{0 CHEMBL52387,1 1,35 1,52 5.2}
{0 CHEMBL525191,1 1,6 1,16 1,23 1,52 5}
{0 CHEMBL526133,1 1,4 1,29 1,52 5.8}
{0 CHEMBL535,1 1,2 1,35 1,50 1,52 6.62}
{0 CHEMBL535331,1 1,28 1,31 1,39 1,43 1,52 5.2}
{0 CHEMBL539474,1 1,23 1,35 1,52 5.2}
{0 CHEMBL553,1 1,8 1,52 5.1}
{0 CHEMBL554,1 1,31 1,52 5.1}
{0 CHEMBL558752,1 1,35 1,39 1,49 1,52 5}
{0 CHEMBL560813,1 1,2 1,15 1,35 1,52 5.2}
{0 CHEMBL565612,1 1,2 1,43 1,52 5.2}
{0 CHEMBL572878,1 1,2 1,4 1,16 1,35 1,50 1,52 5}
{0 CHEMBL572881,1 1,35 1,52 5}
{0 CHEMBL573339,1 1,21 1,38 1,52 5}
{0 CHEMBL574738,1 1,2 1,16 1,35 1,36 1,49 1,52 7.013}
{0 CHEMBL576982,1 1,2 1,35 1,38 1,52 5}
{0 CHEMBL583144,1 1,9 1,34 1,52 5.2}
{0 CHEMBL592030,1 1,4 1,26 1,29 1,52 5.2}
{0 CHEMBL601719,1 1,26 1,52 5}
{0 CHEMBL607707,1 1,2 1,35 1,52 5}
{0 CHEMBL608154,1 1,35 1,52 5}
{0 CHEMBL7064,1 1,4 1,40 1,52 6}
{0 CHEMBL91829,1 1,2 1,31 1,52 5}
{0 CHEMBL939,1 1,2 1,52 5.2}
{0 CHEMBL941,1 1,2 1,35 1,52 5.1}
{0 CHEMBL95692,1 1,52 5.2}
