{
  "data_features": {
    "feature": [
      {
        "data_type": "nominal",
        "index": "0",
        "is_ignore": "false",
        "is_row_identifier": "true",
        "is_target": "false",
        "name": "molecule_id",
        "nominal_value": [
          "CHEMBL1672539",
          "CHEMBL1688377",
          "CHEMBL1783985",
          "CHEMBL1830698",
          "CHEMBL1830707",
          "CHEMBL1830711",
          "CHEMBL2063423",
          "CHEMBL2151817",
          "CHEMBL2152119",
          "CHEMBL275079",
          "CHEMBL277475",
          "CHEMBL319279",
          "CHEMBL319732",
          "CHEMBL327783",
          "CHEMBL329920",
          "CHEMBL385336",
          "CHEMBL420262",
          "CHEMBL432038",
          "CHEMBL439775",
          "CHEMBL496882",
          "CHEMBL505105",
          "CHEMBL593590",
          "CHEMBL66654",
          "CHEMBL8759",
          "CHEMBL8839",
          "CHEMBL88553",
          "CHEMBL88612",
          "CHEMBL88999",
          "CHEMBL89000",
          "CHEMBL95868",
          "CHEMBL97200",
          "CHEMBL97574",
          "CHEMBL99462"
        ],
        "number_of_missing_values": "0"
      },
      {
        "data_type": "numeric",
        "index": "1",
        "is_ignore": "false",
        "is_row_identifier": "false",
        "is_target": "false",
        "name": "nC",
        "number_of_missing_values": "0"
      },
      {
        "data_type": "numeric",
        "index": "2",
        "is_ignore": "false",
        "is_row_identifier": "false",
        "is_target": "false",
        "name": "MW",
        "number_of_missing_values": "0"
      },
      {
        "data_type": "numeric",
        "index": "3",
        "is_ignore": "false",
        "is_row_identifier": "false",
        "is_target": "true",
        "name": "pXC50",
        "number_of_missing_values": "0"
      }
    ]
  }
}