"molecule_id","Eig01_EA.bo.","SM11_AEA.ri.","SpMax_EA.bo.","Eta_C_A","SpMax1_Bh.m.","Eig01_AEA.bo.","SpMax_AEA.bo.","SpMax2_Bh.m.","GATS8s","SM14_EA.bo.","ATSC8m","ATSC6p","P_VSA_s_3","Eta_L","GATS8v","P_VSA_MR_8","GATS8e","Eig01_AEA.ri.","SpMax_AEA.ri.","Eta_alpha_A","SpMax7_Bh.m.","Eig01_AEA.ed.","SpDiam_AEA.bo.","SpMax_AEA.ed.","SpDiam_EA.ed.","P_VSA_i_1","SpMax2_Bh.e.","SpMax1_Bh.i.","ATS8i","Eig03_EA.ri.","MATS6p","SpMax3_Bh.i.","SM06_EA.ed.","SM07_EA.ed.","SM08_EA.ed.","SM09_EA.ed.","SM10_EA.ed.","SM12_AEA.ed.","SM13_AEA.ed.","SM13_EA","SM14_AEA.ed.","SM15_AEA.ed.","SM15_EA.bo.","SpMin7_Bh.s.","MATS8i","Se","Si","P_VSA_LogP_7","Eig01_EA","SM09_AEA.bo.","SM15_EA","SpDiam_AEA.ri.","SpDiam_EA","SpMax_EA","SpMin7_Bh.m.","Eig01_EA.ed.","SM10_AEA.dm.","SM11_EA.ed.","SM12_EA.ed.","SM13_EA.ed.","SM14_EA.ed.","SM15_EA.ed.","pXC50"
{1 3.727,2 3.727,3 3.727,4 0.536,5 4.228,6 4.189,7 4.189,8 4.166,9 0.176,10 18.725,11 4.701,12 2.367,13 70.518,14 2.854,15 2.056,16 62.555,17 0.282,18 3.8,19 3.8,20 0.515,21 2.087,22 6.054,23 5.029,24 6.054,25 14.888,26 62.555,27 3.74,28 3.905,29 2.395,30 1.51,31 0.256,32 3.206,33 13.353,34 15.224,35 17.524,36 19.542,37 21.764,38 21.819,39 23.595,40 13.707,41 25.373,42 27.155,43 19.997,45 -0.438,46 18.669,47 19.96,48 62.555,49 2.842,50 2.842,51 15.768,52 4.924,53 4.842,54 2.842,55 0.121,56 8.701,57 8.701,58 23.851,59 26.04,60 28.162,61 30.336,62 32.477,63 5.646}
{0 CHEMBL176607,1 3.986,2 3.986,3 3.986,4 0.847,5 4.244,6 4.377,7 4.377,8 4.178,9 0.838,10 19.552,11 13.246,12 5.926,13 78.21,14 5.075,15 1.537,16 62.555,17 0.852,18 4.076,19 4.076,20 0.489,21 2.499,22 6.484,23 5.276,24 6.484,25 16.996,26 62.555,27 3.768,28 3.935,29 4.249,30 2.198,31 0.408,32 3.749,33 14.746,34 16.885,35 19.269,36 21.51,37 23.85,38 23.179,39 25.027,40 15.376,41 26.877,42 28.731,43 20.898,44 0.249,45 -0.298,46 35.96,47 39.537,48 168.495,49 3.14,50 3.14,51 17.621,52 5.22,53 5.14,54 3.14,55 1.177,56 10.192,57 10.192,58 26.133,59 28.456,60 30.756,61 33.073,62 35.38,63 5.335}
{0 CHEMBL178091,1 3.982,2 3.982,3 3.982,4 0.8,5 4.247,6 4.369,7 4.369,8 4.179,9 1.314,10 19.496,11 13.195,12 5.571,13 74.41,14 4.632,15 1.252,16 62.555,17 1.033,18 3.977,19 3.977,20 0.502,21 2.551,22 6.471,23 5.231,24 6.471,25 16.81,26 62.555,27 3.772,28 3.947,29 3.881,30 2.053,31 0.008,32 3.601,33 14.152,34 16.188,35 18.595,36 20.782,37 23.128,38 22.605,39 24.438,40 14.52,41 26.278,42 28.122,43 20.848,44 0.151,45 -0.056,46 31.531,47 34.83,48 168.495,49 3.027,50 3.027,51 16.7,52 5.109,53 5.027,54 3.027,55 0.887,56 10.031,57 10.031,58 25.381,59 27.702,60 29.984,61 32.296,62 34.591,63 6.056}
{0 CHEMBL178225,1 3.993,2 3.993,3 3.993,4 0.662,5 4.25,6 4.377,7 4.377,8 4.18,9 1.284,10 19.641,11 9.846,12 5.486,13 77.596,14 4.325,15 1.277,16 62.555,17 1.254,18 3.983,19 3.983,20 0.51,21 2.603,22 6.473,23 5.231,24 6.473,25 16.832,26 62.555,27 3.832,28 3.998,29 3.873,30 2.131,31 0.054,32 3.754,33 14.219,34 16.238,35 18.641,36 20.82,37 23.161,38 22.653,39 24.482,40 14.572,41 26.317,42 28.158,43 20.959,44 0.186,45 -0.154,46 31.32,47 34.205,48 144.953,49 3.031,50 3.031,51 16.748,52 5.115,53 5.031,54 3.031,55 0.977,56 10.043,57 10.043,58 25.409,59 27.729,60 30.008,61 32.32,62 34.614,63 5.42}
{0 CHEMBL178249,1 3.986,2 3.986,3 3.986,4 0.794,5 4.245,6 4.374,7 4.374,8 4.178,9 0.75,10 19.521,11 17.151,12 5.675,13 87.538,14 5.71,15 1.457,16 62.555,17 0.838,18 3.971,19 3.971,20 0.492,21 2.602,22 6.471,23 5.34,24 6.471,25 16.821,26 62.555,27 3.836,28 3.969,29 4.217,30 2.177,31 0.255,32 3.779,33 14.276,34 16.276,35 18.672,36 20.838,37 23.174,38 22.703,39 24.526,40 14.639,41 26.355,42 28.189,43 20.871,44 0.243,45 -0.306,46 37.734,47 41.826,48 180.266,49 3.029,50 3.029,51 16.8,52 5.11,53 5.029,54 3.029,55 1.119,56 10.033,57 10.033,58 25.415,59 27.73,60 30.006,61 32.314,62 34.605,63 6.066}
{0 CHEMBL178352,1 3.996,2 3.996,3 3.996,4 0.687,5 4.246,6 4.387,7 4.387,8 4.179,9 1.143,10 19.885,11 9.701,12 5.427,13 82.838,14 4.716,15 1.237,16 62.555,17 1.122,18 3.991,19 3.991,20 0.506,21 2.603,22 6.479,23 5.256,24 6.479,25 16.898,26 62.555,27 3.859,28 3.979,29 4.001,30 2.151,31 0.131,32 3.771,33 14.466,34 16.469,35 18.866,36 21.024,37 23.356,38 22.925,39 24.75,40 14.836,41 26.579,42 28.413,43 21.212,44 0.146,45 -0.12,46 33.189,47 35.442,48 109.64,49 3.044,50 3.044,51 17.005,52 5.129,53 5.044,54 3.044,55 1.022,56 10.063,57 10.063,58 25.586,59 27.894,60 30.158,61 32.458,62 34.741,63 5.738}
{0 CHEMBL178647,1 3.986,2 3.986,3 3.986,4 0.725,5 4.244,6 4.374,7 4.374,8 4.178,9 0.759,10 19.519,11 11.634,12 5.289,13 78.257,14 4.471,15 1.463,16 62.555,17 0.881,18 3.97,19 3.97,20 0.492,21 2.499,22 6.471,23 5.262,24 6.471,25 16.819,26 62.555,27 3.768,28 3.94,29 4.093,30 2.125,31 0.227,32 3.718,33 14.193,34 16.21,35 18.617,36 20.795,37 23.14,38 22.635,39 24.464,40 14.561,41 26.299,42 28.14,43 20.87,44 0.243,45 -0.258,46 33.851,47 37.411,48 156.724,49 3.028,50 3.028,51 16.733,52 5.107,53 5.028,54 3.028,55 1.12,56 10.033,57 10.033,58 25.389,59 27.709,60 29.99,61 32.301,62 34.595,63 4.979}
{0 CHEMBL178736,1 3.986,2 3.986,3 3.986,4 0.665,5 4.244,6 4.374,7 4.374,8 4.178,9 0.704,10 19.526,11 7.785,12 4.423,13 79.596,14 4.209,15 1.376,16 62.555,17 0.636,18 3.971,19 3.971,20 0.48,21 2.455,22 6.471,23 5.255,24 6.471,25 16.819,26 62.555,27 3.767,28 3.936,29 3.712,30 2.137,31 0.033,32 3.631,33 14.193,34 16.21,35 18.617,36 20.795,37 23.14,38 22.635,39 24.464,40 14.561,41 26.299,42 28.14,43 20.876,45 0.025,46 29.636,47 31.501,48 86.098,49 3.028,50 3.028,51 16.733,52 5.107,53 5.028,54 3.028,55 0.738,56 10.033,57 10.033,58 25.389,59 27.709,60 29.99,61 32.301,62 34.595,63 5.309}
{0 CHEMBL178764,1 3.986,2 3.986,3 3.986,4 0.788,5 4.245,6 4.374,7 4.374,8 4.178,9 0.744,10 19.521,11 18.099,12 5.723,13 91.654,14 5.712,15 1.465,16 62.555,17 0.789,18 3.971,19 3.971,20 0.486,21 2.717,22 6.471,23 5.374,24 6.471,25 16.821,26 62.555,27 3.803,28 3.953,29 4.25,30 2.159,31 0.261,32 3.775,33 14.276,34 16.272,35 18.671,36 20.836,37 23.173,38 22.701,39 24.524,40 14.628,41 26.353,42 28.188,43 20.871,44 0.246,45 -0.328,46 39.062,47 43.036,48 180.266,49 3.029,50 3.029,51 16.791,52 5.109,53 5.029,54 3.029,55 1.156,56 10.033,57 10.033,58 25.414,59 27.73,60 30.005,61 32.313,62 34.605,63 5.327}
{0 CHEMBL178815,1 3.988,2 3.988,3 3.988,4 0.708,5 4.245,6 4.38,7 4.38,8 4.179,9 1.362,10 19.546,11 11.158,12 5.159,13 81.221,14 4.812,15 1.118,16 62.555,17 1.309,18 4.004,19 4.004,20 0.496,21 2.455,22 6.48,23 5.328,24 6.48,25 16.907,26 62.555,27 3.849,28 3.995,29 3.817,30 2.147,31 -0.109,32 3.765,33 14.448,34 16.48,35 18.872,36 21.041,37 23.371,38 22.922,39 24.753,40 14.893,41 26.587,42 28.425,43 20.894,45 0.166,46 29.865,47 32.498,48 121.411,49 3.051,50 3.051,51 17.071,52 5.144,53 5.051,54 3.051,55 0.826,56 10.066,57 10.066,58 25.605,59 27.912,60 30.177,61 32.477,62 34.759,63 5.195}
{0 CHEMBL179174,1 3.981,2 3.981,3 3.981,4 0.828,5 4.247,6 4.368,7 4.368,8 4.18,9 0.234,10 19.495,11 10.745,12 4.866,13 74.41,14 4.646,15 1.355,16 62.555,17 0.417,18 3.976,19 3.976,20 0.512,21 2.499,22 6.47,23 5.223,24 6.47,25 16.795,26 62.555,27 3.775,28 3.954,29 3.698,30 2.064,31 0.04,32 3.64,33 14.129,34 16.171,35 18.58,36 20.771,37 23.117,38 22.582,39 24.419,40 14.499,41 26.261,42 28.107,43 20.847,44 0.126,45 -0.267,46 30.204,47 33.62,48 168.495,49 3.025,50 3.025,51 16.681,52 5.107,53 5.025,54 3.025,55 0.871,56 10.025,57 10.025,58 25.371,59 27.693,60 29.975,61 32.286,62 34.581,63 6.004}
{0 CHEMBL179175,1 3.979,2 3.979,3 3.979,4 0.796,5 4.246,6 4.363,7 4.363,8 4.179,9 1.476,10 19.487,11 12.813,12 5.431,13 79.48,14 4.79,15 1.315,16 62.555,17 1.446,18 3.965,19 3.965,20 0.512,21 2.455,22 6.462,23 5.221,24 6.462,25 16.714,26 62.555,27 3.772,28 3.949,29 3.825,30 1.855,31 0.038,32 3.646,33 14.084,34 16.137,35 18.539,36 20.733,37 23.074,38 22.549,39 24.388,40 14.441,41 26.232,42 28.08,43 20.838,44 0.072,45 -0.047,46 30.204,47 33.62,48 168.495,49 3.014,50 3.014,51 16.622,52 5.096,53 5.014,54 3.014,55 0.857,56 9.986,57 9.986,58 25.327,59 27.644,60 29.924,61 32.231,62 34.522,63 6.009}
{0 CHEMBL179357,1 3.958,2 3.958,3 3.958,4 0.57,5 4.239,6 4.342,7 4.342,8 4.176,9 0.577,10 19.424,11 3.748,12 2.61,13 71.447,14 3.006,15 2.313,16 62.555,17 0.593,18 3.932,19 3.932,20 0.507,21 2.204,22 6.402,23 5.184,24 6.402,25 16.323,26 62.555,27 3.751,28 3.919,29 2.773,30 1.702,31 0.331,32 3.223,33 13.917,34 15.932,35 18.314,36 20.471,37 22.787,38 22.434,39 24.265,40 14.322,41 26.101,42 27.94,43 20.77,45 -0.423,46 20.771,47 22.458,48 62.555,49 2.986,50 2.986,51 16.483,52 5.058,53 4.986,54 2.986,55 0.158,56 9.694,57 9.694,58 25.005,59 27.295,60 29.541,61 31.821,62 34.08,63 4.879}
{0 CHEMBL179431,1 3.986,2 3.986,3 3.986,4 0.696,5 4.244,6 4.373,7 4.373,8 4.178,9 0.777,10 19.521,11 12.053,12 4.562,13 87.935,14 4.516,15 1.466,16 62.555,17 0.812,18 3.969,19 3.969,20 0.481,21 2.547,22 6.471,23 5.274,24 6.471,25 16.814,26 62.555,27 3.765,28 3.934,29 3.837,30 2.128,31 0.212,32 3.633,33 14.179,34 16.2,35 18.606,36 20.788,37 23.133,38 22.625,39 24.454,40 14.545,41 26.29,42 28.132,43 20.871,45 -0.298,46 32.52,47 34.916,48 121.411,49 3.027,50 3.027,51 16.718,52 5.108,53 5.027,54 3.027,55 0.795,56 10.032,57 10.032,58 25.384,59 27.705,60 29.986,61 32.298,62 34.593,63 5.577}
{0 CHEMBL179543,1 3.98,2 3.98,3 3.98,4 0.707,5 4.247,6 4.365,7 4.365,8 4.179,9 1.485,10 19.612,11 14.209,12 6.721,13 80.131,14 4.825,15 1.374,16 62.555,17 1.561,18 3.968,19 3.968,20 0.51,21 2.603,22 6.463,23 5.232,24 6.463,25 16.723,26 62.555,27 3.856,28 3.993,29 4.081,30 2.156,31 0.267,32 3.776,33 14.184,34 16.204,35 18.594,36 20.771,37 23.103,38 22.634,39 24.461,40 14.527,41 26.294,42 28.132,43 20.925,44 0.218,45 -0.236,46 34.204,47 37.62,48 168.495,49 3.017,50 3.017,51 16.69,52 5.1,53 5.017,54 3.017,55 1.142,56 9.988,57 9.988,58 25.348,59 27.661,60 29.936,61 32.241,62 34.531,63 6.18}
{0 CHEMBL179582,1 3.979,2 3.979,3 3.979,4 1.06,5 4.247,6 4.363,7 4.363,8 4.179,9 0.925,10 19.487,11 28.067,12 10.969,13 97.221,14 8.29,15 1.116,16 62.555,17 0.959,18 3.965,19 3.965,20 0.508,21 2.952,22 6.462,23 5.317,24 6.462,25 16.714,26 62.555,27 3.797,28 3.964,29 4.803,30 1.941,31 0.14,32 3.796,33 14.091,34 16.137,35 18.54,36 20.733,37 23.074,38 22.552,39 24.39,40 14.441,41 26.233,42 28.08,43 20.838,44 0.495,45 -0.082,46 50.389,47 57.527,48 333.291,49 3.014,50 3.014,51 16.622,52 5.097,53 5.014,54 3.014,55 1.371,56 9.986,57 9.986,58 25.327,59 27.644,60 29.924,61 32.231,62 34.522,63 4}
{0 CHEMBL179656,1 3.995,2 3.995,3 3.995,4 0.651,5 4.246,6 4.385,7 4.385,8 4.179,9 1.04,10 19.857,11 9.823,12 5.453,13 88.458,14 4.585,15 1.299,16 62.555,17 1.018,18 3.989,19 3.989,20 0.488,21 2.636,22 6.479,23 5.255,24 6.479,25 16.89,26 62.555,27 3.861,28 3.984,29 4.016,30 2.182,31 0.174,32 3.772,33 14.445,34 16.449,35 18.842,36 21.001,37 23.331,38 22.913,39 24.737,40 14.813,41 26.565,42 28.399,43 21.181,44 0.146,45 -0.217,46 33.378,47 35.837,48 109.64,49 3.042,50 3.042,51 16.979,52 5.127,53 5.042,54 3.042,55 0.998,56 10.061,57 10.061,58 25.562,59 27.869,60 30.135,61 32.436,62 34.719,63 6.319}
{0 CHEMBL179759,1 3.958,2 3.958,3 3.958,4 0.634,5 4.241,6 4.342,7 4.342,8 4.177,9 0.276,10 19.424,11 3.911,12 2.928,13 71.876,14 3.193,15 2.323,16 62.555,17 0.268,18 3.938,19 3.938,20 0.514,21 2.211,22 6.402,23 5.184,24 6.402,25 16.323,26 62.555,27 3.758,28 3.926,29 2.874,30 1.721,31 0.399,32 3.249,33 13.917,34 15.932,35 18.314,36 20.471,37 22.787,38 22.434,39 24.265,40 14.322,41 26.101,42 27.94,43 20.77,45 -0.72,46 21.553,47 23.375,48 97.869,49 2.986,50 2.986,51 16.483,52 5.064,53 4.986,54 2.986,55 0.161,56 9.694,57 9.694,58 25.005,59 27.295,60 29.541,61 31.821,62 34.08,63 5.008}
{0 CHEMBL179906,1 3.789,2 3.789,3 3.789,4 0.761,5 4.205,6 4.224,7 4.224,8 3.864,9 0.366,10 19.06,11 17.784,12 5.169,13 48.759,14 4.858,15 0.916,16 31.278,17 0.344,18 4.071,19 4.071,20 0.474,21 2.602,22 6.446,23 5.109,24 6.446,25 16.378,26 31.278,27 3.782,28 3.971,29 4.479,30 2.402,31 0.154,32 3.766,33 14.499,34 16.588,35 18.927,36 21.134,37 23.44,38 22.915,39 24.734,40 15.183,41 26.558,42 28.386,43 20.3,44 0.224,45 0.184,46 38.767,47 43.033,48 160.76,49 3.133,50 3.133,51 17.406,52 5.172,53 5.133,54 3.133,55 1.201,56 10.157,57 10.157,58 25.699,59 27.998,60 30.281,61 32.582,62 34.879,63 4.202}
{0 CHEMBL179919,1 3.982,2 3.982,3 3.982,4 0.928,5 4.248,6 4.372,7 4.372,8 4.18,9 2.714,10 19.502,11 19.121,12 9.58,13 74.41,14 5.561,15 1.017,16 62.555,17 1.863,18 3.991,19 3.991,20 0.502,21 2.603,22 6.479,23 5.247,24 6.479,25 16.872,26 62.555,27 3.782,28 3.959,29 4.31,30 2.139,31 0.019,32 3.713,33 14.329,34 16.357,35 18.747,36 20.921,37 23.253,38 22.821,39 24.649,40 14.698,41 26.482,42 28.318,43 20.853,44 0.329,45 0.201,46 37.298,47 41.66,48 215.58,49 3.04,50 3.04,51 16.869,52 5.123,53 5.04,54 3.04,55 1.177,56 10.065,57 10.065,58 25.494,59 27.806,60 30.08,61 32.387,62 34.677,63 6.301}
{0 CHEMBL180070,1 3.986,2 3.986,3 3.986,4 0.697,5 4.244,6 4.373,7 4.373,8 4.178,9 1.077,10 19.636,11 14.302,12 6.461,13 88.522,14 5.327,15 1.079,16 62.555,17 1.024,18 3.969,19 3.969,20 0.491,21 2.687,22 6.471,23 5.296,24 6.471,25 16.813,26 62.555,27 3.886,28 3.961,29 4.244,30 2.335,31 0.128,32 3.786,33 14.255,34 16.255,35 18.649,36 20.819,37 23.156,38 22.689,39 24.51,40 14.6,41 26.339,42 28.174,43 20.951,44 0.243,45 0.007,46 39.96,47 43.537,48 168.495,49 3.027,50 3.027,51 16.761,52 5.109,53 5.027,54 3.027,55 1.177,56 10.032,57 10.032,58 25.4,59 27.717,60 29.994,61 32.304,62 34.597,63 5.951}
{0 CHEMBL180426,1 4.133,2 4.133,3 4.133,4 0.615,5 4.259,6 4.468,7 4.468,8 4.184,9 0.741,10 20.011,11 10.199,12 4.59,13 75.061,14 3.934,15 1.319,16 62.555,17 0.971,18 4.067,19 4.067,20 0.511,21 2.603,22 6.666,23 5.316,24 6.666,25 17.822,26 62.555,27 3.809,28 4.005,29 3.59,30 2.074,31 0.134,32 3.697,33 14.53,34 16.651,35 19.11,36 21.375,37 23.777,38 22.977,39 24.841,40 14.871,41 26.71,42 28.584,43 21.384,44 0.027,45 -0.042,46 28.436,47 30.79,48 121.411,49 3.113,50 3.113,51 17.111,52 5.2,53 5.113,54 3.113,55 0.871,56 10.709,57 10.709,58 26.102,59 28.485,60 30.836,61 33.211,62 35.573,63 5.467}
{0 CHEMBL180521,1 3.977,2 3.977,3 3.977,4 0.693,5 4.245,6 4.361,7 4.361,8 4.179,9 0.378,10 19.482,11 8.941,12 3.745,13 74.41,14 3.79,15 1.991,16 62.555,17 0.705,18 3.961,19 3.961,20 0.513,21 2.261,22 6.458,23 5.207,24 6.458,25 16.663,26 62.555,27 3.765,28 3.938,29 3.231,30 1.796,31 0.473,32 3.43,33 14.062,34 16.119,35 18.515,36 20.709,37 23.046,38 22.54,39 24.379,40 14.424,41 26.223,42 28.07,43 20.833,45 -0.389,46 24.436,47 26.79,48 121.411,49 3.01,50 3.01,51 16.602,52 5.09,53 5.01,54 3.01,55 0.552,56 9.959,57 9.959,58 25.298,59 27.611,60 29.888,61 32.193,62 34.482,63 5.117}
{0 CHEMBL181349,1 4.017,2 4.017,3 4.017,4 0.487,5 4.205,6 4.331,7 4.331,8 3.942,9 0.731,10 19.711,11 5.272,12 2.285,13 41.997,14 2.895,15 1.383,16 31.278,17 0.526,18 3.895,19 3.895,20 0.467,21 2.378,22 6.151,23 5.165,24 6.151,25 15.375,26 31.278,27 3.797,28 4.015,29 3.168,30 2.063,31 0.214,32 3.519,33 13.833,34 15.719,35 18.038,36 20.074,37 22.314,38 22.327,39 24.109,40 14.205,41 25.895,42 27.683,43 21.046,45 -0.246,46 24.349,47 25.957,48 54.82,49 2.921,50 2.921,51 16.3,52 4.991,53 4.921,54 2.921,55 0.565,56 9.041,57 9.041,58 24.424,59 26.633,60 28.781,61 30.978,62 33.147,63 4}
{0 CHEMBL182901,1 3.814,2 3.814,3 3.814,4 0.538,5 4.204,6 4.234,7 4.234,8 3.847,9 0.231,10 19.036,11 6.219,12 2.974,13 44.483,14 3.064,15 1.189,16 31.278,17 0.605,18 3.849,19 3.849,20 0.481,21 2.441,22 6.09,23 5.068,24 6.09,25 15.134,26 31.278,27 3.773,28 3.949,29 3.348,30 2.007,31 0.124,32 3.362,33 13.584,34 15.433,35 17.749,36 19.76,37 21.996,38 22.006,39 23.775,40 13.929,41 25.548,42 27.325,43 20.294,45 -0.151,46 25.687,47 28.079,48 90.133,49 2.879,50 2.879,51 16.004,52 4.945,53 4.879,54 2.879,55 0.61,56 8.867,57 8.867,58 24.089,59 26.292,60 28.427,61 30.616,62 32.772,63 4}
{0 CHEMBL182954,1 3.816,2 3.816,3 3.816,4 0.584,5 4.205,6 4.236,7 4.236,8 3.881,9 0.685,10 19.228,11 12.128,12 4.928,13 52.261,14 4.203,15 1.07,16 31.278,17 0.775,18 3.852,19 3.852,20 0.486,21 2.65,22 6.091,23 5.089,24 6.091,25 15.151,26 31.278,27 3.868,28 3.981,29 4.189,30 2.24,31 0.075,32 3.796,33 13.765,34 15.579,35 17.883,36 19.871,37 22.094,38 22.157,39 23.913,40 14.08,41 25.675,42 27.441,43 20.443,44 0.187,45 -0.192,46 35.454,47 38.91,48 137.218,49 2.883,50 2.883,51 16.138,52 4.953,53 4.883,54 2.883,55 1.083,56 8.876,57 8.876,58 24.171,59 26.363,60 28.488,61 30.669,62 32.819,63 4}
{0 CHEMBL183346,1 3.784,2 3.784,3 3.784,4 0.698,5 4.205,6 4.213,7 4.213,8 3.866,9 1.388,10 18.966,11 8.533,12 4.542,13 50.029,14 4.567,15 1.078,16 31.278,17 1.161,18 3.832,19 3.832,20 0.493,21 2.601,22 6.06,23 5.053,24 6.06,25 14.908,26 31.278,27 3.787,28 3.983,29 3.813,30 2.062,31 -0.048,32 3.678,33 13.548,34 15.38,35 17.673,36 19.665,37 21.878,38 21.983,39 23.745,40 13.876,41 25.511,42 27.282,43 20.21,44 0.034,45 -0.086,46 33.011,47 37.116,48 160.76,49 2.859,50 2.859,51 15.932,52 4.929,53 4.859,54 2.859,55 0.984,56 8.729,57 8.729,58 23.951,59 26.132,60 28.247,61 30.417,62 32.554,63 4}
{0 CHEMBL183436,1 3.815,2 3.815,3 3.815,4 0.587,5 4.205,6 4.236,7 4.236,8 3.851,9 0.486,10 19.048,11 8.855,12 3.857,13 49.188,14 3.66,15 1.118,16 31.278,17 0.633,18 3.852,19 3.852,20 0.47,21 2.537,22 6.091,23 5.084,24 6.091,25 15.149,26 31.278,27 3.774,28 3.951,29 3.788,30 2.157,31 -0.021,32 3.605,33 13.637,34 15.467,35 17.784,36 19.787,37 22.022,38 22.045,39 23.808,40 13.979,41 25.577,42 27.35,43 20.305,45 -0.068,46 30.116,47 32.787,48 90.133,49 2.882,50 2.882,51 16.047,52 4.95,53 4.882,54 2.882,55 0.8,56 8.875,57 8.875,58 24.111,59 26.314,60 28.447,61 30.635,62 32.791,63 4.769}
{0 CHEMBL183652,1 3.816,2 3.816,3 3.816,4 0.59,5 4.205,6 4.236,7 4.236,8 3.889,9 0.715,10 19.228,11 13.724,12 5.216,13 47.288,14 4.242,15 1.094,16 31.278,17 0.864,18 3.856,19 3.856,20 0.489,21 2.663,22 6.091,23 5.089,24 6.091,25 15.151,26 31.278,27 3.868,28 4.003,29 4.231,30 2.279,31 0.101,32 3.802,33 13.765,34 15.579,35 17.883,36 19.871,37 22.094,38 22.157,39 23.913,40 14.08,41 25.675,42 27.441,43 20.443,44 0.187,45 -0.21,46 36.229,47 40.199,48 137.218,49 2.883,50 2.883,51 16.138,52 4.953,53 4.883,54 2.883,55 1.088,56 8.876,57 8.876,58 24.171,59 26.363,60 28.488,61 30.669,62 32.819,63 4}
{0 CHEMBL183821,1 3.897,2 3.897,3 3.897,4 0.607,5 4.214,6 4.304,7 4.304,8 4.194,9 0.639,10 19.472,11 10.867,12 4.548,13 78.48,14 4.315,15 1.196,16 62.555,17 0.406,18 3.921,19 3.921,20 0.492,21 2.603,22 6.19,23 5.161,24 6.19,25 15.645,26 62.555,27 3.804,28 3.981,29 3.924,30 2.117,31 0.142,32 3.786,33 14.09,34 15.966,35 18.3,36 20.335,37 22.589,38 22.532,39 24.313,40 14.444,41 26.099,42 27.887,43 20.753,45 -0.002,46 32.084,47 34.581,48 97.869,49 2.947,50 2.947,51 16.542,52 5.031,53 4.947,54 2.947,55 0.886,56 9.187,57 9.187,58 24.703,59 26.925,60 29.08,61 31.29,62 33.468,63 4}
{0 CHEMBL183861,1 3.803,2 3.803,3 3.803,4 0.503,5 4.204,6 4.225,7 4.225,8 3.844,9 0.415,10 18.998,11 6.914,12 2.321,13 41.997,14 2.788,15 1.575,16 31.278,17 0.72,18 3.843,19 3.843,20 0.484,21 2.237,22 6.081,23 5.057,24 6.081,25 15.074,26 31.278,27 3.773,28 3.959,29 3.168,30 2.001,31 0.224,32 3.334,33 13.506,34 15.346,35 17.671,36 19.678,37 21.919,38 21.936,39 23.706,40 13.866,41 25.48,42 27.259,43 20.252,45 -0.246,46 23.578,47 25.953,48 54.82,49 2.87,50 2.87,51 15.939,52 4.937,53 4.87,54 2.87,55 0.586,56 8.822,57 8.822,58 24.009,59 26.212,60 28.344,61 30.532,62 32.685,63 4}
{0 CHEMBL186028,1 3.985,2 3.985,3 3.985,4 0.764,5 4.249,6 4.377,7 4.377,8 4.18,9 1.952,10 19.672,11 19.074,12 9.598,13 77.596,14 5.275,15 1.137,16 62.555,17 1.458,18 4,19 4,20 0.501,21 2.687,22 6.485,23 5.251,24 6.485,25 16.923,26 62.555,27 3.857,28 3.996,29 4.372,30 2.157,31 0.084,32 3.776,33 14.492,34 16.527,35 18.922,36 21.098,37 23.429,38 22.946,39 24.778,40 14.821,41 26.614,42 28.453,43 20.988,44 0.249,45 -0.029,46 38.414,47 42.245,48 192.037,49 3.048,50 3.048,51 16.996,52 5.133,53 5.048,54 3.048,55 1.177,56 10.094,57 10.094,58 25.668,59 27.976,60 30.245,61 32.546,62 34.83,63 6.347}
{0 CHEMBL188053,1 3.982,2 3.982,3 3.982,4 0.795,5 4.247,6 4.37,7 4.37,8 4.179,9 1.624,10 19.498,11 13.846,12 6.366,13 87.378,14 5.251,15 1.111,16 62.555,17 1.175,18 3.978,19 3.978,20 0.497,21 2.603,22 6.473,23 5.37,24 6.473,25 16.832,26 62.555,27 3.788,28 3.967,29 4.091,30 2.11,31 -0.168,32 3.733,33 14.219,34 16.238,35 18.641,36 20.82,37 23.161,38 22.653,39 24.482,40 14.572,41 26.317,42 28.158,43 20.85,44 0.213,45 -0.058,46 34.633,47 38.328,48 180.266,49 3.031,50 3.031,51 16.748,52 5.112,53 5.031,54 3.031,55 1.014,56 10.043,57 10.043,58 25.409,59 27.729,60 30.008,61 32.32,62 34.614,63 5.754}
{0 CHEMBL188195,1 3.991,2 3.991,3 3.991,4 0.899,5 4.248,6 4.414,7 4.414,8 4.18,9 1.188,10 19.556,11 14.178,12 6.166,13 74.41,14 4.966,15 1.124,16 62.555,17 0.921,18 4.188,19 4.188,20 0.502,21 2.565,22 6.766,23 5.28,24 6.766,25 18.036,26 62.555,27 3.78,28 3.958,29 4.026,30 2.136,31 -0.104,32 3.661,33 14.944,34 17.177,35 19.604,36 21.927,37 24.324,38 23.417,39 25.298,40 15.552,41 27.183,42 29.07,43 20.905,44 0.281,45 -0.055,46 34.414,47 38.245,48 192.037,49 3.241,50 3.241,51 17.855,52 5.32,53 5.241,54 3.241,55 1.177,56 11.089,57 11.089,58 26.684,59 29.074,60 31.451,61 33.84,62 36.226,63 5.493}
{0 CHEMBL188263,1 3.982,2 3.982,3 3.982,4 0.854,5 4.247,6 4.37,7 4.37,8 4.179,9 1.802,10 19.498,11 14.799,12 7.025,13 85.797,14 5.749,15 1.178,16 62.555,17 1.543,18 3.978,19 3.978,20 0.505,21 2.603,22 6.473,23 5.37,24 6.473,25 16.832,26 62.555,27 3.808,28 3.985,29 4.204,30 2.121,31 -0.037,32 3.76,33 14.219,34 16.238,35 18.641,36 20.82,37 23.161,38 22.653,39 24.482,40 14.572,41 26.317,42 28.158,43 20.85,44 0.277,45 -0.164,46 36.189,47 40.534,48 203.809,49 3.031,50 3.031,51 16.748,52 5.112,53 5.031,54 3.031,55 1.176,56 10.043,57 10.043,58 25.409,59 27.729,60 30.008,61 32.32,62 34.614,63 7.125}
{0 CHEMBL188429,1 3.979,2 3.979,3 3.979,4 0.893,5 4.247,6 4.364,7 4.364,8 4.179,9 1.995,10 19.489,11 20.217,12 8.187,13 88.331,14 6.224,15 1.358,16 62.555,17 1.721,18 3.967,19 3.967,20 0.505,21 2.655,22 6.463,23 5.364,24 6.463,25 16.723,26 62.555,27 3.823,28 3.982,29 4.37,30 2.151,31 0.219,32 3.778,33 14.184,34 16.204,35 18.594,36 20.771,37 23.103,38 22.634,39 24.461,40 14.527,41 26.294,42 28.132,43 20.839,44 0.352,45 -0.182,46 39.073,47 43.949,48 227.351,49 3.017,50 3.017,51 16.69,52 5.1,53 5.017,54 3.017,55 1.177,56 9.988,57 9.988,58 25.348,59 27.661,60 29.936,61 32.241,62 34.531,63 6.387}
{0 CHEMBL188575,1 3.979,2 3.979,3 3.979,4 0.709,5 4.246,6 4.364,7 4.364,8 4.179,9 0.569,10 19.746,11 17.78,12 6.627,13 89.38,14 5.27,15 1.263,16 62.555,17 0.562,18 3.966,19 3.966,20 0.494,21 2.687,22 6.462,23 5.273,24 6.462,25 16.715,26 62.555,27 3.886,28 3.965,29 4.198,30 2.166,31 0.27,32 3.788,33 14.379,34 16.397,35 18.776,36 20.94,37 23.258,38 22.864,39 24.69,40 14.717,41 26.52,42 28.354,43 21.062,44 0.223,45 -0.125,46 37.858,47 41.039,48 168.495,49 3.015,50 3.015,51 16.869,52 5.1,53 5.015,54 3.015,55 1.177,56 9.986,57 9.986,58 25.487,59 27.784,60 30.045,61 32.336,62 34.613,63 5.511}
{0 CHEMBL188759,1 3.979,2 3.979,3 3.979,4 0.738,5 4.246,6 4.363,7 4.363,8 4.179,9 0.718,10 19.491,11 11.217,12 5.406,13 86.194,14 4.53,15 1.644,16 62.555,17 0.728,18 3.965,19 3.965,20 0.493,21 2.455,22 6.462,23 5.244,24 6.462,25 16.715,26 62.555,27 3.768,28 3.941,29 3.864,30 2.103,31 0.406,32 3.593,33 14.101,34 16.145,35 18.545,36 20.736,37 23.075,38 22.566,39 24.401,40 14.459,41 26.241,42 28.086,43 20.841,45 -0.269,46 30.975,47 33.624,48 144.953,49 3.015,50 3.015,51 16.633,52 5.098,53 5.015,54 3.015,55 0.807,56 9.986,57 9.986,58 25.328,59 27.645,60 29.924,61 32.232,62 34.523,63 4.747}
{0 CHEMBL188796,1 4.697,2 4.697,3 4.697,4 0.774,5 4.729,6 4.844,7 4.844,8 4.244,9 0.602,10 21.775,11 19.263,12 8.362,13 83.739,14 5.773,15 1.287,16 62.555,17 0.58,18 4.29,19 4.29,20 0.501,21 2.844,22 7.293,23 5.757,24 7.293,25 19.556,26 70.305,27 3.907,28 4.041,29 4.301,30 2.396,31 0.063,32 3.79,33 15.463,34 17.817,35 20.343,36 22.793,37 25.3,38 24.101,39 26.053,40 16.045,41 28.011,42 29.973,43 23.298,44 0.269,45 -0.121,46 42.145,47 45.584,48 192.037,49 3.374,50 3.374,51 18.427,52 5.424,53 5.374,54 3.374,55 1.177,56 12.404,57 12.404,58 27.786,59 30.292,60 32.792,61 35.301,62 37.808,63 5.429}
{0 CHEMBL188845,1 3.982,2 3.982,3 3.982,4 0.803,5 4.247,6 4.37,7 4.37,8 4.18,9 1.637,10 19.498,11 12.95,12 6.069,13 83.262,14 5.249,15 1.136,16 62.555,17 1.418,18 3.979,19 3.979,20 0.505,21 2.583,22 6.473,23 5.309,24 6.473,25 16.833,26 62.555,27 3.806,28 3.986,29 4.013,30 2.122,31 -0.135,32 3.752,33 14.219,34 16.242,35 18.642,36 20.822,37 23.162,38 22.655,39 24.484,40 14.584,41 26.319,42 28.159,43 20.85,44 0.117,45 -0.101,46 33.305,47 37.119,48 180.266,49 3.031,50 3.031,51 16.758,52 5.116,53 5.031,54 3.031,55 0.883,56 10.043,57 10.043,58 25.411,59 27.729,60 30.009,61 32.32,62 34.614,63 6.456}
{0 CHEMBL188976,1 3.985,2 3.985,3 3.985,4 0.802,5 4.249,6 4.377,7 4.377,8 4.18,9 1.894,10 19.78,11 22.327,12 10.495,13 82.839,14 5.722,15 1.1,16 62.555,17 1.654,18 4.002,19 4.002,20 0.495,21 2.787,22 6.485,23 5.253,24 6.485,25 16.924,26 62.555,27 3.863,28 3.999,29 4.564,30 2.253,31 0.12,32 3.778,33 14.55,34 16.57,35 18.956,36 21.124,37 23.45,38 23,39 24.825,40 14.887,41 26.655,42 28.489,43 21.098,44 0.354,45 -0.01,46 42.625,47 46.87,48 215.58,49 3.05,50 3.05,51 17.055,52 5.135,53 5.05,54 3.05,55 1.181,56 10.095,57 10.095,58 25.685,59 27.99,60 30.257,61 32.556,62 34.839,63 6.509}
{0 CHEMBL189127,1 3.979,2 3.979,3 3.979,4 0.766,5 4.246,6 4.363,7 4.363,8 4.179,9 1.063,10 19.616,11 19.132,12 7.892,13 98.565,14 6.201,15 1.251,16 62.555,17 1.049,18 3.965,19 3.965,20 0.489,21 2.962,22 6.462,23 5.308,24 6.462,25 16.715,26 62.555,27 3.896,28 3.961,29 4.441,30 2.243,31 0.248,32 3.791,33 14.226,34 16.227,35 18.61,36 20.779,37 23.107,38 22.672,39 24.491,40 14.558,41 26.318,42 28.151,43 20.928,44 0.371,45 -0.103,46 44.953,47 49.079,48 215.58,49 3.015,50 3.015,51 16.708,52 5.101,53 5.015,54 3.015,55 1.181,56 9.986,57 9.986,58 25.35,59 27.66,60 29.935,61 32.239,62 34.528,63 6.26}
{0 CHEMBL189619,1 3.982,2 3.982,3 3.982,4 0.937,5 4.247,6 4.37,7 4.37,8 4.18,9 1.607,10 19.498,11 24.779,12 9.405,13 82.014,14 6.183,15 1.111,16 62.555,17 1.208,18 3.98,19 3.98,20 0.502,21 2.661,22 6.473,23 5.264,24 6.473,25 16.829,26 62.555,27 3.781,28 3.958,29 4.522,30 2.106,31 0.056,32 3.739,33 14.203,34 16.23,35 18.631,36 20.813,37 23.154,38 22.646,39 24.476,40 14.556,41 26.312,42 28.153,43 20.849,44 0.339,45 -0.039,46 40.182,47 45.075,48 239.122,49 3.03,50 3.03,51 16.733,52 5.113,53 5.03,54 3.03,55 1.177,56 10.042,57 10.042,58 25.404,59 27.724,60 30.005,61 32.316,62 34.611,63 6.347}
{0 CHEMBL189688,1 3.99,2 3.99,3 3.99,4 0.793,5 4.249,6 4.387,7 4.387,8 4.18,9 1.209,10 19.925,11 18.828,12 9.73,13 86.717,14 5.466,15 1.162,16 62.555,17 1.049,18 4.027,19 4.027,20 0.492,21 2.802,22 6.522,23 5.263,24 6.522,25 17.123,26 62.555,27 3.862,28 4.001,29 4.388,30 2.174,31 0.083,32 3.777,33 14.717,34 16.786,35 19.203,36 21.408,37 23.759,38 23.19,39 25.037,40 15.056,41 26.887,42 28.741,43 21.256,44 0.248,45 0.066,46 38.927,47 42.585,48 180.266,49 3.073,50 3.073,51 17.253,52 5.16,53 5.073,54 3.073,55 1.139,56 10.222,57 10.222,58 26.021,59 28.347,60 30.635,61 32.95,62 35.25,63 6.569}
{0 CHEMBL190195,1 3.979,2 3.979,3 3.979,4 0.731,5 4.246,6 4.363,7 4.363,8 4.179,9 1.024,10 19.61,11 19.625,12 7.255,13 86.781,14 5.341,15 1.18,16 62.555,17 0.881,18 3.965,19 3.965,20 0.501,21 2.687,22 6.462,23 5.27,24 6.462,25 16.714,26 62.555,27 3.884,28 3.967,29 4.263,30 2.166,31 0.21,32 3.788,33 14.184,34 16.203,35 18.592,36 20.769,37 23.1,38 22.634,39 24.46,40 14.521,41 26.293,42 28.131,43 20.923,44 0.239,45 -0.073,46 38.414,47 42.245,48 192.037,49 3.014,50 3.014,51 16.682,52 5.099,53 5.014,54 3.014,55 1.177,56 9.986,57 9.986,58 25.346,59 27.657,60 29.933,61 32.238,62 34.527,63 5.372}
{0 CHEMBL190342,1 4.052,2 4.052,3 4.052,4 0.724,5 4.254,6 4.462,7 4.462,8 4.182,9 1.051,10 19.83,11 13.897,12 7.957,13 75.061,14 4.832,15 1.062,16 62.555,17 1.002,18 4.115,19 4.115,20 0.502,21 2.687,22 6.777,23 5.32,24 6.777,25 18.469,26 62.555,27 3.832,28 4.001,29 4.138,30 2.136,31 -0.011,32 3.755,33 14.822,34 16.978,35 19.459,36 21.754,37 24.184,38 23.269,39 25.144,40 15.146,41 27.025,42 28.911,43 21.171,44 0.218,45 -0.091,46 35.531,47 38.83,48 168.495,49 3.168,50 3.168,51 17.411,52 5.25,53 5.168,54 3.168,55 1.177,56 11.108,57 11.108,58 26.539,59 28.951,60 31.334,61 33.741,62 36.136,63 6.125}
{0 CHEMBL190357,1 3.982,2 3.982,3 3.982,4 1.018,5 4.248,6 4.373,7 4.373,8 4.18,9 2.225,10 19.505,11 26.066,12 11.933,13 87.083,14 7.223,15 1.104,16 62.555,17 1.585,18 4,19 4,20 0.501,21 2.852,22 6.485,23 5.373,24 6.485,25 16.923,26 62.555,27 3.844,28 3.998,29 4.658,30 2.157,31 0.059,32 3.779,33 14.492,34 16.527,35 18.922,36 21.098,37 23.429,38 22.946,39 24.778,40 14.821,41 26.614,42 28.453,43 20.855,44 0.446,45 -0.016,46 44.065,47 49.491,48 262.664,49 3.048,50 3.048,51 16.996,52 5.133,53 5.048,54 3.048,55 1.35,56 10.094,57 10.094,58 25.668,59 27.976,60 30.245,61 32.546,62 34.83,63 6.398}
{0 CHEMBL313629,1 3.955,2 3.955,3 3.955,4 0.675,5 4.205,6 4.357,7 4.357,8 3.876,9 0.634,10 19.473,11 15.126,12 5.191,13 49.887,14 4.229,15 1.252,16 31.278,17 0.727,18 3.988,19 3.988,20 0.481,21 2.602,22 6.464,23 5.216,24 6.464,25 16.799,26 31.278,27 3.782,28 3.979,29 4.348,30 2.189,31 0.164,32 3.751,33 14.188,34 16.193,35 18.603,36 20.775,37 23.12,38 22.625,39 24.452,40 14.504,41 26.286,42 28.126,43 20.785,44 0.129,45 -0.085,46 35.556,47 39.408,48 137.218,49 3.013,50 3.013,51 16.665,52 5.086,53 5.013,54 3.013,55 1.022,56 10.011,57 10.011,58 25.365,59 27.684,60 29.961,61 32.271,62 34.563,63 6.114}
{0 CHEMBL313650,1 3.953,2 3.953,3 3.953,4 0.763,5 4.205,6 4.355,7 4.355,8 3.873,9 0.806,10 19.432,11 17.549,12 6.079,13 56.839,14 5.536,15 1.151,16 31.278,17 0.785,18 3.986,19 3.986,20 0.482,21 2.608,22 6.464,23 5.267,24 6.464,25 16.793,26 31.278,27 3.782,28 3.981,29 4.451,30 2.151,31 0.096,32 3.785,33 14.158,34 16.176,35 18.587,36 20.766,37 23.111,38 22.6,39 24.431,40 14.466,41 26.268,42 28.11,43 20.748,44 0.21,45 -0.026,46 40.323,47 45.238,48 184.302,49 3.012,50 3.012,51 16.635,52 5.085,53 5.012,54 3.012,55 1.116,56 10.01,57 10.01,58 25.359,59 27.679,60 29.958,61 32.268,62 34.56,63 6.208}
{0 CHEMBL313915,1 3.987,2 3.987,3 3.987,4 0.609,5 4.205,6 4.389,7 4.389,8 3.924,9 0.853,10 19.991,11 11.783,12 5.093,13 59.008,14 4.371,15 1.28,16 31.278,17 0.846,18 4.028,19 4.028,20 0.474,21 2.687,22 6.493,23 5.263,24 6.493,25 16.998,26 31.278,27 3.874,28 4.006,29 4.314,30 2.216,31 0.117,32 3.801,33 14.638,34 16.68,35 19.094,36 21.277,37 23.62,38 23.129,39 24.971,40 14.967,41 26.817,42 28.666,43 21.312,44 0.106,45 0.007,46 36.185,47 39.333,48 101.904,49 3.05,50 3.05,51 17.15,52 5.127,53 5.05,54 3.05,55 1.001,56 10.1,57 10.1,58 25.864,59 28.179,60 30.451,61 32.755,62 35.04,63 4}
{0 CHEMBL313951,1 3.987,2 3.987,3 3.987,4 0.603,5 4.205,6 4.389,7 4.389,8 3.917,9 0.873,10 19.991,11 11.104,12 4.636,13 63.981,14 4.342,15 1.268,16 31.278,17 0.862,18 4.014,19 4.014,20 0.472,21 2.667,22 6.493,23 5.263,24 6.493,25 16.998,26 31.278,27 3.874,28 3.984,29 4.278,30 2.194,31 0.06,32 3.797,33 14.638,34 16.68,35 19.094,36 21.277,37 23.62,38 23.129,39 24.971,40 14.967,41 26.817,42 28.666,43 21.312,44 0.105,45 0.017,46 35.411,47 38.044,48 101.904,49 3.05,50 3.05,51 17.15,52 5.119,53 5.05,54 3.05,55 0.981,56 10.1,57 10.1,58 25.864,59 28.179,60 30.451,61 32.755,62 35.04,63 4.796}
{0 CHEMBL314448,1 3.953,2 3.953,3 3.953,4 0.626,5 4.205,6 4.355,7 4.355,8 3.861,9 1.02,10 19.431,11 12.065,12 4.429,13 54.209,14 4.007,15 1.17,16 31.278,17 0.96,18 3.975,19 3.975,20 0.475,21 2.559,22 6.464,23 5.216,24 6.464,25 16.79,26 31.278,27 3.775,28 3.954,29 3.986,30 2.121,31 -0.044,32 3.64,33 14.147,34 16.171,35 18.581,36 20.763,37 23.108,38 22.595,39 24.427,40 14.46,41 26.265,42 28.107,43 20.748,45 0.084,46 30.898,47 33.704,48 113.675,49 3.012,50 3.012,51 16.629,52 5.076,53 5.012,54 3.012,55 0.913,56 10.009,57 10.009,58 25.357,59 27.677,60 29.956,61 32.266,62 34.558,63 6.42}
{0 CHEMBL314521,1 3.925,2 3.925,3 3.925,4 0.507,5 4.205,6 4.323,7 4.323,8 3.847,9 0.534,10 19.339,11 3.942,12 2.63,13 41.997,14 2.79,15 1.914,16 31.278,17 0.541,18 3.946,19 3.946,20 0.484,21 2.267,22 6.395,23 5.158,24 6.395,25 16.293,26 31.278,27 3.772,28 3.96,29 3.148,30 1.851,31 0.286,32 3.305,33 13.911,34 15.913,35 18.301,36 20.449,37 22.767,38 22.424,39 24.253,40 14.258,41 26.087,42 27.925,43 20.647,45 -0.242,46 23.578,47 25.953,48 54.82,49 2.971,50 2.971,51 16.409,52 5.041,53 4.971,54 2.971,55 0.559,56 9.673,57 9.673,58 24.98,59 27.269,60 29.512,61 31.79,62 34.046,63 4.484}
{0 CHEMBL315098,1 3.955,2 3.955,3 3.955,4 0.799,5 4.205,6 4.36,7 4.36,8 3.876,9 1.125,10 19.455,11 19.958,12 5.752,13 64.347,14 6.067,15 1.167,16 31.278,17 1.037,18 3.991,19 3.991,20 0.48,21 2.727,22 6.472,23 5.36,24 6.472,25 16.871,26 31.278,27 3.85,28 3.983,29 4.598,30 2.185,31 0.023,32 3.797,33 14.406,34 16.414,35 18.812,36 20.972,37 23.303,38 22.874,39 24.701,40 14.718,41 26.533,42 28.368,43 20.769,44 0.141,45 -0.039,46 40.549,47 44.95,48 184.302,49 3.027,50 3.027,51 16.88,52 5.095,53 5.027,54 3.027,55 1.046,56 10.04,57 10.04,58 25.533,59 27.84,60 30.104,61 32.404,62 34.685,63 6.495}
{0 CHEMBL315270,1 3.962,2 3.962,3 3.962,4 0.575,5 4.205,6 4.367,7 4.367,8 3.9,9 0.978,10 19.704,11 12.054,12 4.598,13 54.86,14 4.151,15 1.253,16 31.278,17 0.947,18 3.991,19 3.991,20 0.48,21 2.665,22 6.472,23 5.238,24 6.472,25 16.871,26 31.278,27 3.867,28 3.98,29 4.256,30 2.185,31 0.066,32 3.797,33 14.406,34 16.414,35 18.812,36 20.972,37 23.303,38 22.874,39 24.701,40 14.718,41 26.533,42 28.368,43 20.995,44 0.127,45 -0.079,46 34.898,47 37.704,48 113.675,49 3.027,50 3.027,51 16.88,52 5.095,53 5.027,54 3.027,55 0.997,56 10.04,57 10.04,58 25.533,59 27.84,60 30.104,61 32.404,62 34.685,63 5.987}
{0 CHEMBL315556,1 3.925,2 3.925,3 3.925,4 0.501,5 4.204,6 4.323,7 4.323,8 3.841,9 0.844,10 19.339,11 3.652,12 2.493,13 39.24,14 2.772,15 1.906,16 31.278,17 0.894,18 3.94,19 3.94,20 0.48,21 2.245,22 6.395,23 5.158,24 6.395,25 16.293,26 31.278,27 3.769,28 3.944,29 3.029,30 1.838,31 0.217,32 3.305,33 13.911,34 15.913,35 18.301,36 20.449,37 22.767,38 22.424,39 24.253,40 14.258,41 26.087,42 27.925,43 20.647,45 -0.265,46 22.804,47 24.664,48 54.82,49 2.971,50 2.971,51 16.409,52 5.035,53 4.971,54 2.971,55 0.499,56 9.673,57 9.673,58 24.98,59 27.269,60 29.512,61 31.79,62 34.046,63 5.313}
{0 CHEMBL315903,1 3.953,2 3.953,3 3.953,4 0.757,5 4.205,6 4.355,7 4.355,8 3.864,9 0.853,10 19.432,11 16.107,12 5.897,13 61.813,14 5.507,15 1.174,16 31.278,17 0.826,18 3.975,19 3.975,20 0.479,21 2.604,22 6.464,23 5.267,24 6.464,25 16.793,26 31.278,27 3.778,28 3.959,29 4.366,30 2.141,31 0.066,32 3.785,33 14.158,34 16.176,35 18.587,36 20.766,37 23.111,38 22.6,39 24.431,40 14.466,41 26.268,42 28.11,43 20.748,44 0.138,45 -0.048,46 39.549,47 43.95,48 184.302,49 3.012,50 3.012,51 16.635,52 5.078,53 5.012,54 3.012,55 1.024,56 10.01,57 10.01,58 25.359,59 27.679,60 29.958,61 32.268,62 34.56,63 5.759}
{0 CHEMBL316138,1 3.966,2 3.966,3 3.966,4 0.605,5 4.205,6 4.37,7 4.37,8 3.921,9 1.066,10 19.827,11 11.771,12 5.098,13 59.008,14 4.37,15 1.263,16 31.278,17 1.033,18 4.007,19 4.007,20 0.474,21 2.687,22 6.472,23 5.242,24 6.472,25 16.88,26 31.278,27 3.874,28 4.005,29 4.313,30 2.221,31 0.123,32 3.802,33 14.462,34 16.456,35 18.856,36 21.009,37 23.34,38 22.918,39 24.741,40 14.793,41 26.57,42 28.403,43 21.128,44 0.111,45 -0.057,46 36.185,47 39.333,48 101.904,49 3.03,50 3.03,51 16.953,52 5.106,53 5.03,54 3.03,55 1.023,56 10.042,57 10.042,58 25.566,59 27.873,60 30.134,61 32.433,62 34.712,63 4}
{0 CHEMBL316308,1 3.96,2 3.96,3 3.96,4 0.791,5 4.205,6 4.431,7 4.431,8 3.88,9 1.66,10 19.576,11 19.215,12 5.668,13 46.701,14 4.75,15 1.178,16 31.278,17 1.543,18 4.302,19 4.302,20 0.481,21 2.567,22 7.061,23 5.311,24 7.061,25 18.42,26 31.278,27 3.789,28 3.986,29 4.49,30 2.209,31 -0.108,32 3.777,33 15.093,34 17.345,35 19.802,36 22.15,37 24.575,38 23.793,39 25.714,40 15.777,41 27.64,42 29.569,43 20.888,44 0.23,45 0.124,46 37.44,47 41.823,48 160.76,49 3.299,50 3.299,51 18.117,52 5.4,53 5.299,54 3.299,55 1.222,56 11.387,57 11.387,58 26.962,59 29.379,60 31.783,61 34.199,62 36.612,63 6.469}
{0 CHEMBL316339,1 4.166,2 4.166,3 4.166,4 0.588,5 4.205,6 4.473,7 4.473,8 3.981,9 1.02,10 20.444,11 11.307,12 4.827,13 57.617,14 4.43,15 1.236,16 31.278,17 0.938,18 4.068,19 4.068,20 0.465,21 2.667,22 6.615,23 5.349,24 6.615,25 17.507,26 31.278,27 3.901,28 4.033,29 4.404,30 2.25,31 0.098,32 3.798,33 14.866,34 16.956,35 19.394,36 21.621,37 23.995,38 23.353,39 25.209,40 15.189,41 27.07,42 28.934,43 21.817,44 0.126,45 -0.04,46 37.771,47 40.206,48 101.904,49 3.094,50 3.094,51 17.402,52 5.173,53 5.094,54 3.094,55 1.013,56 10.466,57 10.466,58 26.281,59 28.629,60 30.94,61 33.279,62 35.602,63 4}
{0 CHEMBL327579,1 3.954,2 3.954,3 3.954,4 0.783,5 4.205,6 4.359,7 4.359,8 3.871,9 0.685,10 19.47,11 18.927,12 5.476,13 48.759,14 4.859,15 1.284,16 31.278,17 0.693,18 4.078,19 4.078,20 0.474,21 2.602,22 6.479,23 5.259,24 6.479,25 16.995,26 31.278,27 3.778,28 3.974,29 4.55,30 2.253,31 0.224,32 3.766,33 14.743,34 16.877,35 19.262,36 21.501,37 23.84,38 23.174,39 25.02,40 15.351,41 26.87,42 28.723,43 20.782,44 0.236,45 -0.117,46 38.767,47 43.033,48 160.76,49 3.139,50 3.139,51 17.594,52 5.179,53 5.139,54 3.139,55 1.27,56 10.189,57 10.189,58 26.121,59 28.444,60 30.743,61 33.059,62 35.365,63 5.475}
{0 CHEMBL328350,1 3.953,2 3.953,3 3.953,4 0.731,5 4.205,6 4.355,7 4.355,8 3.874,9 0.682,10 19.446,11 14.096,12 5.252,13 52.421,14 4.8,15 1.296,16 31.278,17 0.646,18 3.987,19 3.987,20 0.482,21 2.603,22 6.464,23 5.228,24 6.464,25 16.794,26 31.278,27 3.783,28 3.981,29 4.294,30 2.198,31 0.16,32 3.781,33 14.174,34 16.184,35 18.593,36 20.768,37 23.113,38 22.616,39 24.443,40 14.487,41 26.278,42 28.118,43 20.759,44 0.206,45 -0.179,46 38.44,47 42.823,48 160.76,49 3.012,50 3.012,51 16.649,52 5.085,53 5.012,54 3.012,55 1.142,56 10.01,57 10.01,58 25.36,59 27.68,60 29.958,61 32.268,62 34.56,63 6.854}
{0 CHEMBL328363,1 3.985,2 3.985,3 3.985,4 0.717,5 6.88,6 4.378,7 4.378,8 4.205,9 0.888,10 20.046,11 13.647,12 4.674,13 67.036,14 4.935,15 1.25,16 77.232,17 0.9,18 3.998,19 3.998,20 0.506,21 2.713,22 6.472,23 5.25,24 6.472,25 16.884,26 31.278,27 3.876,28 3.982,29 4.256,30 2.235,31 0.098,32 3.797,33 14.583,34 16.567,35 18.964,36 21.104,37 23.431,38 23.071,39 24.892,40 14.951,41 26.717,42 28.546,43 21.368,44 0.071,45 -0.139,46 35.64,47 37.885,48 90.133,49 3.036,50 3.036,51 17.113,52 5.102,53 5.036,54 3.036,55 0.93,56 10.043,57 10.043,58 25.647,59 27.948,60 30.202,61 32.496,62 34.77,63 5.469}
{0 CHEMBL32838,1 3.892,2 3.892,3 3.892,4 1.163,5 4.006,6 4.891,7 4.891,8 3.728,9 0.963,10 19.216,11 38.51,12 15.821,13 23.483,14 9.564,15 0.917,17 0.867,18 4.843,19 4.843,20 0.465,21 3.265,22 8.248,23 5.891,24 8.248,25 25.548,27 3.812,28 4.094,29 5.34,30 2.55,31 0.008,32 3.825,33 17.082,34 19.76,35 22.548,36 25.294,37 28.074,38 25.609,39 27.687,40 17.803,41 29.769,42 31.855,43 20.53,44 0.729,45 0.031,46 67.312,47 75.524,48 388.446,49 3.891,50 3.891,51 20.482,52 5.921,53 5.891,54 3.891,55 1.535,56 16.396,57 16.396,58 30.845,59 33.629,60 36.412,61 39.199,62 41.987,63 4}
{0 CHEMBL328555,1 3.96,2 3.96,3 3.96,4 0.633,5 4.205,6 4.431,7 4.431,8 3.879,9 1.372,10 19.576,11 6.878,12 4.195,13 46.701,14 4.012,15 1.461,16 31.278,17 1.417,18 4.164,19 4.164,20 0.45,21 2.528,22 7.061,23 5.311,24 7.061,25 18.42,26 31.278,27 3.779,28 3.975,29 3.775,30 2.195,31 0.078,32 3.622,33 15.093,34 17.345,35 19.802,36 22.15,37 24.575,38 23.793,39 25.714,40 15.777,41 27.64,42 29.569,43 20.888,45 -0.033,46 30.327,47 32.597,48 54.82,49 3.299,50 3.299,51 18.117,52 5.262,53 5.299,54 3.299,55 0.669,56 11.387,57 11.387,58 26.962,59 29.379,60 31.783,61 34.199,62 36.612,63 5.308}
{0 CHEMBL329320,1 3.964,2 3.964,3 3.964,4 0.602,5 4.205,6 4.369,7 4.369,8 3.92,9 0.85,10 19.797,11 11.731,12 5.084,13 59.008,14 4.37,15 1.269,16 31.278,17 0.865,18 4.005,19 4.005,20 0.474,21 2.687,22 6.472,23 5.24,24 6.472,25 16.872,26 31.278,27 3.874,28 4.005,29 4.302,30 2.224,31 0.126,32 3.802,33 14.441,34 16.436,35 18.831,36 20.985,37 23.315,38 22.906,39 24.728,40 14.769,41 26.556,42 28.388,43 21.094,44 0.099,45 -0.134,46 36.185,47 39.333,48 101.904,49 3.029,50 3.029,51 16.926,52 5.104,53 5.029,54 3.029,55 0.987,56 10.04,57 10.04,58 25.542,59 27.848,60 30.111,61 32.41,62 34.69,63 4}
{0 CHEMBL329455,1 3.955,2 3.955,3 3.955,4 0.805,5 4.205,6 4.36,7 4.36,8 3.886,9 1.132,10 19.455,11 20.41,12 6.209,13 59.374,14 6.096,15 1.19,16 31.278,17 1.107,18 4.004,19 4.004,20 0.483,21 2.756,22 6.472,23 5.36,24 6.472,25 16.871,26 31.278,27 3.85,28 4.004,29 4.624,30 2.201,31 0.075,32 3.802,33 14.406,34 16.414,35 18.812,36 20.972,37 23.303,38 22.874,39 24.701,40 14.718,41 26.533,42 28.368,43 20.769,44 0.229,45 -0.047,46 41.323,47 46.238,48 184.302,49 3.027,50 3.027,51 16.88,52 5.103,53 5.027,54 3.027,55 1.177,56 10.04,57 10.04,58 25.533,59 27.84,60 30.104,61 32.404,62 34.685,63 4}
{0 CHEMBL330035,1 3.531,2 3.531,3 3.531,4 1.314,5 3.939,6 4.286,7 4.286,8 3.849,9 0.891,10 18.872,11 86.355,12 21.855,13 55.711,14 14.12,15 1.048,17 0.877,18 4.129,19 4.129,20 0.453,21 3.511,22 6.734,23 5.279,24 6.734,25 18.292,27 3.912,28 4.064,29 6.121,30 2.83,31 -0.007,32 3.938,33 15.335,34 17.338,35 19.767,36 21.943,37 24.316,38 23.837,39 25.666,40 15.714,41 27.501,42 29.342,43 20.073,44 0.95,45 -0.025,46 104.41,47 118.461,48 447.302,49 3.162,50 3.162,51 17.901,52 5.188,53 5.162,54 3.162,55 1.78,56 10.887,57 10.887,58 26.583,59 28.943,60 31.259,61 33.62,62 35.964,63 4.022}
{0 CHEMBL359541,1 3.774,2 3.774,3 3.774,4 0.5,5 4.204,6 4.206,7 4.206,8 3.843,9 0.228,10 18.929,11 4.39,12 2.319,13 41.997,14 2.789,15 1.326,16 31.278,17 0.11,18 3.823,19 3.823,20 0.484,21 2.301,22 6.057,23 5.036,24 6.057,25 14.888,26 31.278,27 3.773,28 3.958,29 3.168,30 2.033,31 0.052,32 3.355,33 13.45,34 15.284,35 17.587,36 19.584,37 21.807,38 21.903,39 23.668,40 13.804,41 25.438,42 27.211,43 20.168,45 -0.185,46 23.578,47 25.953,48 54.82,49 2.852,50 2.852,51 15.861,52 4.918,53 4.852,54 2.852,55 0.577,56 8.717,57 8.717,58 23.885,59 26.074,60 28.194,61 30.368,62 32.509,63 5.614}
{0 CHEMBL359683,1 3.987,2 3.987,3 3.987,4 0.819,5 4.245,6 4.378,7 4.378,8 4.178,9 1.434,10 19.539,11 14.73,12 6.628,13 86.29,14 5.812,15 1.207,16 62.555,17 1.399,18 3.989,19 3.989,20 0.497,21 2.583,22 6.479,23 5.334,24 6.479,25 16.891,26 62.555,27 3.844,28 3.984,29 4.231,30 2.145,31 0.041,32 3.771,33 14.41,34 16.431,35 18.824,36 20.991,37 23.322,38 22.883,39 24.712,40 14.779,41 26.545,42 28.382,43 20.887,44 0.102,45 -0.036,46 35.633,47 39.328,48 168.495,49 3.042,50 3.042,51 16.949,52 5.128,53 5.042,54 3.042,55 0.913,56 10.061,57 10.061,58 25.555,59 27.864,60 30.131,61 32.432,62 34.716,63 6.886}
{0 CHEMBL359851,1 3.987,2 3.987,3 3.987,4 0.733,5 4.245,6 4.377,7 4.377,8 4.178,9 1.325,10 19.537,11 12.82,12 5.886,13 76.152,14 4.65,15 1.173,16 62.555,17 1.348,18 3.982,19 3.982,20 0.497,21 2.603,22 6.477,23 5.252,24 6.477,25 16.865,26 62.555,27 3.776,28 3.944,29 4.045,30 2.136,31 -0.027,32 3.722,33 14.306,34 16.322,35 18.718,36 20.886,37 23.222,38 22.804,39 24.631,40 14.686,41 26.463,42 28.299,43 20.886,44 0.021,45 0.047,46 32.749,47 35.913,48 144.953,49 3.037,50 3.037,51 16.854,52 5.119,53 5.037,54 3.037,55 0.935,56 10.051,57 10.051,58 25.461,59 27.775,60 30.048,61 32.356,62 34.645,63 6.432}
{0 CHEMBL359929,1 3.788,2 3.788,3 3.788,4 0.589,5 4.205,6 4.217,7 4.217,8 3.865,9 0.496,10 19.002,11 8.881,12 4.38,13 49.236,14 3.97,15 1.076,16 31.278,17 0.381,18 3.835,19 3.835,20 0.48,21 2.603,22 6.061,23 5.064,24 6.061,25 14.92,26 31.278,27 3.783,28 3.973,29 3.881,30 2.149,31 0.099,32 3.695,33 13.662,34 15.472,35 17.768,36 19.744,37 21.957,38 22.078,39 23.834,40 13.993,41 25.595,42 27.359,43 20.246,45 -0.042,46 32.673,47 35.993,48 113.675,49 2.864,50 2.864,51 16.042,52 4.933,53 4.864,54 2.864,55 0.936,56 8.734,57 8.734,58 24.019,59 26.198,60 28.305,61 30.47,62 32.602,63 4}
{0 CHEMBL360016,1 3.982,2 3.982,3 3.982,4 1.004,5 4.248,6 4.369,7 4.369,8 4.18,9 0.758,10 19.507,11 26.814,12 9.405,13 82.665,14 6.448,15 0.762,16 62.555,17 0.783,18 3.979,19 3.979,20 0.509,21 2.603,22 6.471,23 5.258,24 6.471,25 16.813,26 62.555,27 3.795,28 3.971,29 4.742,30 2.201,31 0.088,32 3.773,33 14.179,34 16.2,35 18.605,36 20.788,37 23.132,38 22.625,39 24.454,40 14.542,41 26.29,42 28.131,43 20.856,44 0.425,45 0.12,46 42.738,47 48.281,48 262.664,49 3.027,50 3.027,51 16.715,52 5.111,53 5.027,54 3.027,55 1.34,56 10.032,57 10.032,58 25.384,59 27.705,60 29.986,61 32.298,62 34.593,63 5.676}
{0 CHEMBL360353,1 3.986,2 3.986,3 3.986,4 0.738,5 4.244,6 4.374,7 4.374,8 4.178,9 0.583,10 19.53,11 14.106,12 5.58,13 90.47,14 5.066,15 1.227,16 62.555,17 0.528,18 3.971,19 3.971,20 0.482,21 2.603,22 6.471,23 5.288,24 6.471,25 16.82,26 62.555,27 3.769,28 3.938,29 4.004,30 2.146,31 0.102,32 3.68,33 14.222,34 16.229,35 18.633,36 20.806,37 23.149,38 22.66,39 24.485,40 14.585,41 26.318,42 28.156,43 20.879,44 0.113,45 0.012,46 35.404,47 38.332,48 144.953,49 3.029,50 3.029,51 16.752,52 5.108,53 5.029,54 3.029,55 1.002,56 10.033,57 10.033,58 25.395,59 27.714,60 29.993,61 32.304,62 34.597,63 6.174}
{0 CHEMBL360513,1 3.947,2 3.947,3 3.947,4 0.593,5 4.205,6 4.346,7 4.346,8 3.884,9 1.296,10 19.536,11 14.872,12 5.187,13 52.261,14 4.205,15 1.267,16 31.278,17 1.209,18 3.966,19 3.966,20 0.486,21 2.656,22 6.455,23 5.216,24 6.455,25 16.7,26 31.278,27 3.866,28 3.983,29 4.293,30 2.185,31 0.117,32 3.797,33 14.179,34 16.188,35 18.581,36 20.751,37 23.083,38 22.624,39 24.45,40 14.469,41 26.281,42 28.118,43 20.814,44 0.128,45 -0.08,46 35.454,47 38.91,48 137.218,49 3.001,50 3.001,51 16.621,52 5.068,53 5.001,54 3.001,55 0.997,56 9.966,57 9.966,58 25.324,59 27.635,60 29.908,61 32.211,62 34.497,63 6.114}
{0 CHEMBL360955,1 3.987,2 3.987,3 3.987,4 0.76,5 4.245,6 4.379,7 4.379,8 4.179,9 1.389,10 19.541,11 12.82,12 5.886,13 83.755,14 5.312,15 1.173,16 62.555,17 1.348,18 3.992,19 3.992,20 0.497,21 2.455,22 6.479,23 5.379,24 6.479,25 16.887,26 62.555,27 3.846,28 3.988,29 4.045,30 2.146,31 -0.027,32 3.768,33 14.419,34 16.439,35 18.833,36 21,37 23.33,38 22.891,39 24.72,40 14.809,41 26.554,42 28.391,43 20.889,44 0.236,45 0.047,46 32.749,47 35.913,48 144.953,49 3.044,50 3.044,51 16.981,52 5.129,53 5.044,54 3.044,55 1.002,56 10.062,57 10.062,58 25.565,59 27.872,60 30.139,61 32.44,62 34.724,63 6.602}
{0 CHEMBL361155,1 4.011,2 4.011,3 4.011,4 0.658,5 4.246,6 4.402,7 4.402,8 4.179,9 0.904,10 20.04,11 9.874,12 5.495,13 88.458,14 4.587,15 1.372,16 62.555,17 0.905,18 4.016,19 4.016,20 0.488,21 2.603,22 6.499,23 5.273,24 6.499,25 17.012,26 62.555,27 3.861,28 3.985,29 4.027,30 2.158,31 0.158,32 3.771,33 14.641,34 16.69,35 19.102,36 21.289,37 23.632,38 23.135,39 24.978,40 15.003,41 26.825,42 28.674,43 21.382,44 0.128,45 0.037,46 33.378,47 35.837,48 109.64,49 3.061,50 3.061,51 17.193,52 5.154,53 5.061,54 3.061,55 1.013,56 10.118,57 10.118,58 25.878,59 28.195,60 30.468,61 32.774,62 35.06,63 6.004}
{0 CHEMBL361307,1 3.986,2 3.986,3 3.986,4 0.822,5 4.25,6 4.378,7 4.378,8 4.18,9 1.821,10 19.791,11 19.258,12 9.835,13 81.097,14 5.596,15 1.067,16 62.555,17 1.325,18 4.003,19 4.003,20 0.51,21 2.81,22 6.485,23 5.253,24 6.485,25 16.933,26 62.555,27 3.86,28 3.996,29 4.37,30 2.165,31 0.063,32 3.776,33 14.544,34 16.566,35 18.963,36 21.133,37 23.465,38 22.987,39 24.815,40 14.89,41 26.648,42 28.485,43 21.111,44 0.248,45 -0.022,46 38.738,47 42.189,48 180.266,49 3.051,50 3.051,51 17.063,52 5.136,53 5.051,54 3.051,55 1.128,56 10.099,57 10.099,58 25.702,59 28.01,60 30.278,61 32.579,62 34.862,63 6.284}
{0 CHEMBL361359,1 3.786,2 3.786,3 3.786,4 0.707,5 4.205,6 4.214,7 4.214,8 3.872,9 0.894,10 18.995,11 9.15,12 4.618,13 48.146,14 4.331,15 1.004,16 31.278,17 0.754,18 3.833,19 3.833,20 0.493,21 2.6,22 6.06,23 5.048,24 6.06,25 14.909,26 31.278,27 3.79,28 3.985,29 3.889,30 2.141,31 -0.226,32 3.713,33 13.579,34 15.398,35 17.688,36 19.674,37 21.887,38 22.012,39 23.769,40 13.913,41 25.532,42 27.298,43 20.235,44 0.085,45 -0.069,46 34.011,47 38.116,48 160.76,49 2.859,50 2.859,51 15.961,52 4.93,53 4.859,54 2.859,55 1.046,56 8.73,57 8.73,58 23.957,59 26.138,60 28.251,61 30.42,62 32.557,63 4}
{0 CHEMBL361480,1 3.985,2 3.985,3 3.985,4 0.764,5 4.249,6 4.377,7 4.377,8 4.18,9 1.952,10 19.672,11 19.074,12 9.598,13 77.596,14 5.275,15 1.137,16 62.555,17 1.458,18 4,19 4,20 0.501,21 2.687,22 6.485,23 5.251,24 6.485,25 16.923,26 62.555,27 3.857,28 3.996,29 4.372,30 2.157,31 0.084,32 3.776,33 14.492,34 16.527,35 18.922,36 21.098,37 23.429,38 22.946,39 24.778,40 14.821,41 26.614,42 28.453,43 20.988,44 0.249,45 -0.029,46 38.414,47 42.245,48 192.037,49 3.048,50 3.048,51 16.996,52 5.133,53 5.048,54 3.048,55 1.177,56 10.094,57 10.094,58 25.668,59 27.976,60 30.245,61 32.546,62 34.83,63 6.347}
{0 CHEMBL361618,1 3.986,2 3.986,3 3.986,4 0.695,5 4.244,6 4.373,7 4.373,8 4.178,9 1.196,10 19.516,11 10.548,12 4.78,13 78.686,14 4.251,15 1.156,16 62.555,17 1.133,18 3.969,19 3.969,20 0.496,21 2.455,22 6.471,23 5.233,24 6.471,25 16.81,26 62.555,27 3.765,28 3.936,29 3.724,30 2.107,31 -0.076,32 3.636,33 14.152,34 16.188,35 18.595,36 20.782,37 23.128,38 22.605,39 24.438,40 14.52,41 26.278,42 28.122,43 20.867,45 0.094,46 28.865,47 31.498,48 121.411,49 3.027,50 3.027,51 16.7,52 5.104,53 5.027,54 3.027,55 0.764,56 10.031,57 10.031,58 25.381,59 27.702,60 29.984,61 32.296,62 34.591,63 6.658}
{0 CHEMBL361849,1 3.803,2 3.803,3 3.803,4 0.55,5 4.205,6 4.225,7 4.225,8 3.987,9 0.348,10 18.998,11 3.639,12 2.318,13 42.74,14 2.938,15 1.362,16 31.278,17 0.648,18 3.834,19 3.834,20 0.505,21 2.266,22 6.081,23 5.057,24 6.081,25 15.074,26 31.278,27 3.77,28 3.944,29 2.898,30 1.873,31 0.107,32 3.304,33 13.506,34 15.346,35 17.671,36 19.678,37 21.919,38 21.936,39 23.706,40 13.866,41 25.48,42 27.259,43 20.252,45 -0.148,46 21.8,47 23.399,48 54.82,49 2.87,50 2.87,51 15.939,52 4.929,53 4.87,54 2.87,55 0.355,56 8.822,57 8.822,58 24.009,59 26.212,60 28.344,61 30.532,62 32.685,63 4}
{0 CHEMBL361978,1 4.019,2 4.019,3 4.019,4 0.754,5 4.254,6 4.394,7 4.394,8 4.182,9 1.216,10 19.999,11 9.132,12 5.499,13 90.218,14 4.838,15 1.289,16 62.555,17 1.156,18 4.001,19 4.001,20 0.509,21 2.603,22 6.482,23 5.251,24 6.482,25 16.906,26 62.555,27 3.839,28 4.001,29 3.894,30 2.157,31 0.086,32 3.756,33 14.469,34 16.473,35 18.875,36 21.034,37 23.369,38 22.927,39 24.753,40 14.86,41 26.584,42 28.418,43 21.338,44 0.152,45 -0.137,46 32.156,47 34.489,48 121.411,49 3.05,50 3.05,51 17.035,52 5.133,53 5.05,54 3.05,55 0.895,56 10.081,57 10.081,58 25.601,59 27.911,60 30.178,61 32.48,62 34.765,63 6.046}
{0 CHEMBL362123,1 3.991,2 3.991,3 3.991,4 0.816,5 4.249,6 4.389,7 4.389,8 4.18,9 1.443,10 19.955,11 27.545,12 11.644,13 82.839,14 5.723,15 1.088,16 62.555,17 0.99,18 4.036,19 4.036,20 0.495,21 2.814,22 6.544,23 5.267,24 6.544,25 17.255,26 62.555,27 3.863,28 4,29 4.631,30 2.182,31 0.116,32 3.777,33 14.785,34 16.871,35 19.293,36 21.512,37 23.871,38 23.241,39 25.091,40 15.104,41 26.944,42 28.801,43 21.288,44 0.365,45 -0.035,46 42.625,47 46.87,48 215.58,49 3.08,50 3.08,51 17.307,52 5.169,53 5.08,54 3.08,55 1.177,56 10.325,57 10.325,58 26.146,59 28.481,60 30.78,61 33.106,62 35.416,63 6.244}
{0 CHEMBL362868,1 3.986,2 3.986,3 3.986,4 0.607,5 4.243,6 4.372,7 4.372,8 4.178,9 0.697,10 19.512,11 5.627,12 3.232,13 71.928,14 3.51,15 1.708,16 62.555,17 0.561,18 3.966,19 3.966,20 0.486,21 2.372,22 6.47,23 5.224,24 6.47,25 16.795,26 62.555,27 3.759,28 3.927,29 3.161,30 2.027,31 0.314,32 3.388,33 14.129,34 16.171,35 18.58,36 20.771,37 23.117,38 22.582,39 24.419,40 14.499,41 26.261,42 28.107,43 20.864,45 -0.159,46 24.426,47 25.877,48 62.555,49 3.025,50 3.025,51 16.681,52 5.1,53 5.025,54 3.025,55 0.507,56 10.025,57 10.025,58 25.371,59 27.693,60 29.975,61 32.286,62 34.581,63 5.742}
{0 CHEMBL362937,1 4.141,2 4.141,3 4.141,4 0.837,5 4.247,6 4.454,7 4.454,8 4.179,9 1.064,10 20.433,11 25.988,12 10.777,13 105.11,14 6.615,15 1.173,16 62.555,17 1.116,18 4.049,19 4.049,20 0.479,21 3.107,22 6.547,23 5.367,24 6.547,25 17.265,26 62.555,27 3.901,28 3.976,29 4.64,30 2.492,31 0.024,32 3.789,33 14.952,34 17.019,35 19.437,36 21.644,37 24,38 23.42,39 25.263,40 15.318,41 27.111,42 28.961,43 21.811,44 0.506,45 -0.024,46 50.491,47 54.913,48 239.122,49 3.093,50 3.093,51 17.529,52 5.184,53 5.093,54 3.093,55 1.452,56 10.344,57 10.344,58 26.268,59 28.601,60 30.897,61 33.223,62 35.532,63 5.807}
{0 CHEMBL363299,1 3.986,2 3.986,3 3.986,4 0.788,5 4.249,6 4.378,7 4.378,8 4.18,9 1.425,10 19.791,11 18.766,12 9.668,13 86.717,14 5.465,15 1.111,16 62.555,17 1.206,18 4.004,19 4.004,20 0.492,21 2.788,22 6.485,23 5.253,24 6.485,25 16.933,26 62.555,27 3.862,28 4,29 4.386,30 2.184,31 0.085,32 3.777,33 14.544,34 16.566,35 18.963,36 21.133,37 23.465,38 22.987,39 24.815,40 14.89,41 26.648,42 28.485,43 21.111,44 0.248,45 -0.059,46 38.927,47 42.585,48 180.266,49 3.051,50 3.051,51 17.063,52 5.136,53 5.051,54 3.051,55 1.132,56 10.099,57 10.099,58 25.702,59 28.01,60 30.278,61 32.579,62 34.862,63 6.469}
{0 CHEMBL363875,1 3.979,2 3.979,3 3.979,4 0.888,5 4.246,6 4.364,7 4.364,8 4.179,9 0.577,10 19.514,11 22.701,12 7.393,13 96.332,14 6.686,15 1.295,16 62.555,17 0.577,18 3.966,19 3.966,20 0.494,21 2.603,22 6.462,23 5.336,24 6.462,25 16.715,26 62.555,27 3.872,28 3.968,29 4.329,30 2.166,31 0.229,32 3.788,33 14.379,34 16.4,35 18.778,36 20.942,37 23.26,38 22.866,39 24.692,40 14.732,41 26.523,42 28.357,43 20.859,44 0.242,45 -0.157,46 40.625,47 44.87,48 215.58,49 3.015,50 3.015,51 16.884,52 5.101,53 5.015,54 3.015,55 1.094,56 9.986,57 9.986,58 25.489,59 27.786,60 30.047,61 32.338,62 34.615,63 6.097}
{0 CHEMBL363943,1 3.982,2 3.982,3 3.982,4 0.983,5 4.248,6 4.372,7 4.372,8 4.18,9 2.499,10 19.502,11 20.639,12 11.187,13 79.003,14 6.107,15 1.122,16 62.555,17 1.781,18 3.991,19 3.991,20 0.502,21 2.603,22 6.48,23 5.254,24 6.48,25 16.875,26 62.555,27 3.784,28 3.962,29 4.45,30 2.139,31 -0.013,32 3.719,33 14.343,34 16.368,35 18.76,36 20.932,37 23.265,38 22.827,39 24.655,40 14.708,41 26.487,42 28.324,43 20.853,44 0.337,45 0.067,46 40.182,47 45.075,48 239.122,49 3.041,50 3.041,51 16.879,52 5.124,53 5.041,54 3.041,55 1.177,56 10.068,57 10.068,58 25.505,59 27.817,60 30.09,61 32.396,62 34.686,63 6.824}
{0 CHEMBL364821,1 3.982,2 3.982,3 3.982,4 0.967,5 4.248,6 4.37,7 4.37,8 4.18,9 1.75,10 19.499,11 19.343,12 9.773,13 76.945,14 6.038,15 1.292,16 62.555,17 1.377,18 3.982,19 3.982,20 0.502,21 2.603,22 6.473,23 5.259,24 6.473,25 16.834,26 62.555,27 3.785,28 3.961,29 4.428,30 2.147,31 0.054,32 3.746,33 14.237,34 16.251,35 18.652,36 20.827,37 23.168,38 22.672,39 24.499,40 14.595,41 26.332,42 28.17,43 20.85,44 0.418,45 -0.144,46 40.182,47 45.075,48 239.122,49 3.031,50 3.031,51 16.765,52 5.114,53 5.031,54 3.031,55 1.243,56 10.044,57 10.044,58 25.414,59 27.733,60 30.012,61 32.322,62 34.616,63 6.301}
{0 CHEMBL365124,1 3.979,2 3.979,3 3.979,4 0.665,5 4.244,6 4.363,7 4.363,8 4.179,9 0.234,10 19.487,11 6.505,12 3.774,13 76.468,14 3.738,15 1.634,16 62.555,17 0.574,18 3.962,19 3.962,20 0.502,21 2.455,22 6.462,23 5.213,24 6.462,25 16.71,26 62.555,27 3.761,28 3.929,29 3.33,30 1.796,31 0.148,32 3.403,33 14.081,34 16.136,35 18.538,36 20.732,37 23.072,38 22.548,39 24.388,40 14.439,41 26.231,42 28.079,43 20.837,45 -0.496,46 25.764,47 27.999,48 121.411,49 3.014,50 3.014,51 16.619,52 5.094,53 5.014,54 3.014,55 0.559,56 9.985,57 9.985,58 25.326,59 27.643,60 29.922,61 32.23,62 34.521,63 5.123}
{0 CHEMBL365192,1 3.985,2 3.985,3 3.985,4 0.764,5 4.249,6 4.377,7 4.377,8 4.18,9 1.952,10 19.672,11 19.074,12 9.598,13 77.596,14 5.275,15 1.137,16 62.555,17 1.458,18 4,19 4,20 0.501,21 2.687,22 6.485,23 5.251,24 6.485,25 16.923,26 62.555,27 3.857,28 3.996,29 4.372,30 2.157,31 0.084,32 3.776,33 14.492,34 16.527,35 18.922,36 21.098,37 23.429,38 22.946,39 24.778,40 14.821,41 26.614,42 28.453,43 20.988,44 0.249,45 -0.029,46 38.414,47 42.245,48 192.037,49 3.048,50 3.048,51 16.996,52 5.133,53 5.048,54 3.048,55 1.177,56 10.094,57 10.094,58 25.668,59 27.976,60 30.245,61 32.546,62 34.83,63 6.357}
{0 CHEMBL365225,1 3.979,2 3.979,3 3.979,4 0.689,5 4.245,6 4.363,7 4.363,8 4.179,9 0.477,10 19.487,11 8.985,12 3.868,13 74.41,14 3.952,15 1.829,16 62.555,17 0.521,18 3.965,19 3.965,20 0.502,21 2.387,22 6.462,23 5.213,24 6.462,25 16.71,26 62.555,27 3.766,28 3.938,29 3.331,30 1.823,31 0.391,32 3.443,33 14.081,34 16.136,35 18.538,36 20.732,37 23.072,38 22.548,39 24.388,40 14.439,41 26.231,42 28.079,43 20.837,45 -0.363,46 25.764,47 27.999,48 109.64,49 3.014,50 3.014,51 16.619,52 5.094,53 5.014,54 3.014,55 0.555,56 9.985,57 9.985,58 25.326,59 27.643,60 29.922,61 32.23,62 34.521,63 4.983}
{0 CHEMBL365566,1 3.979,2 3.979,3 3.979,4 0.717,5 4.246,6 4.363,7 4.363,8 4.179,9 1.483,10 19.487,11 12.23,12 4.995,13 79.003,14 4.213,15 1.437,16 62.555,17 1.185,18 3.965,19 3.965,20 0.502,21 2.455,22 6.462,23 5.221,24 6.462,25 16.714,26 62.555,27 3.767,28 3.94,29 3.712,30 1.831,31 0.165,32 3.512,33 14.084,34 16.137,35 18.539,36 20.733,37 23.074,38 22.549,39 24.388,40 14.441,41 26.232,42 28.08,43 20.838,45 -0.056,46 28.647,47 31.415,48 144.953,49 3.014,50 3.014,51 16.622,52 5.096,53 5.014,54 3.014,55 0.796,56 9.986,57 9.986,58 25.327,59 27.644,60 29.924,61 32.231,62 34.522,63 5.192}
{0 CHEMBL366071,1 3.979,2 3.979,3 3.979,4 0.745,5 4.246,6 4.363,7 4.363,8 4.179,9 0.581,10 19.628,11 18.149,12 7.096,13 91.914,14 5.662,15 1.254,16 62.555,17 0.548,18 3.965,19 3.965,20 0.495,21 2.687,22 6.462,23 5.287,24 6.462,25 16.715,26 62.555,27 3.894,28 3.97,29 4.366,30 2.171,31 0.297,32 3.79,33 14.247,34 16.244,35 18.631,36 20.796,37 23.124,38 22.685,39 24.505,40 14.586,41 26.332,42 28.165,43 20.94,44 0.241,45 -0.08,46 40.742,47 44.454,48 192.037,49 3.015,50 3.015,51 16.737,52 5.1,53 5.015,54 3.015,55 1.177,56 9.986,57 9.986,58 25.363,59 27.672,60 29.944,61 32.246,62 34.533,63 5.219}
{0 CHEMBL367534,1 4.015,2 4.015,3 4.015,4 0.682,5 4.246,6 4.407,7 4.407,8 4.179,9 0.927,10 20.069,11 15.526,12 7.115,13 84.581,14 4.844,15 1.408,16 62.555,17 0.888,18 4.026,19 4.026,20 0.49,21 2.603,22 6.513,23 5.281,24 6.513,25 17.094,26 62.555,27 3.862,28 3.984,29 4.175,30 2.166,31 0.249,32 3.771,33 14.713,34 16.781,35 19.197,36 21.399,37 23.749,38 23.189,39 25.035,40 15.053,41 26.885,42 28.738,43 21.413,44 0.216,45 -0.215,46 37.076,47 40.122,48 144.953,49 3.068,50 3.068,51 17.249,52 5.164,53 5.068,54 3.068,55 1.117,56 10.174,57 10.174,58 26.008,59 28.332,60 30.616,61 32.93,62 35.226,63 5.479}
{0 CHEMBL367801,1 3.986,2 3.986,3 3.986,4 0.664,5 4.244,6 4.373,7 4.373,8 4.178,9 0.823,10 19.518,11 9.333,12 4.711,13 78.686,14 4.186,15 1.361,16 62.555,17 0.888,18 3.969,19 3.969,20 0.496,21 2.455,22 6.471,23 5.239,24 6.471,25 16.813,26 62.555,27 3.767,28 3.938,29 3.787,30 2.112,31 0.131,32 3.673,33 14.161,34 16.192,35 18.599,36 20.785,37 23.13,38 22.609,39 24.442,40 14.525,41 26.281,42 28.124,43 20.869,45 -0.122,46 29.865,47 32.498,48 121.411,49 3.027,50 3.027,51 16.704,52 5.105,53 5.027,54 3.027,55 0.788,56 10.032,57 10.032,58 25.383,59 27.704,60 29.986,61 32.298,62 34.592,63 5.58}
{0 CHEMBL369255,1 3.986,2 3.986,3 3.986,4 0.84,5 4.245,6 4.374,7 4.374,8 4.178,9 0.722,10 19.521,11 19.343,12 6.319,13 90.072,14 6.21,15 1.371,16 62.555,17 0.803,18 3.971,19 3.971,20 0.493,21 2.817,22 6.471,23 5.374,24 6.471,25 16.821,26 62.555,27 3.836,28 3.969,29 4.318,30 2.172,31 0.243,32 3.781,33 14.276,34 16.272,35 18.671,36 20.836,37 23.173,38 22.701,39 24.524,40 14.628,41 26.353,42 28.188,43 20.871,44 0.385,45 -0.238,46 40.618,47 45.242,48 203.809,49 3.029,50 3.029,51 16.791,52 5.109,53 5.029,54 3.029,55 1.177,56 10.033,57 10.033,58 25.414,59 27.73,60 30.005,61 32.313,62 34.605,63 5.839}
{0 CHEMBL371393,1 3.985,2 3.985,3 3.985,4 0.816,5 4.249,6 4.377,7 4.377,8 4.18,9 2.012,10 19.765,11 24.167,12 9.799,13 81.097,14 5.596,15 1.187,16 62.555,17 1.55,18 4.001,19 4.001,20 0.51,21 2.776,22 6.485,23 5.252,24 6.485,25 16.924,26 62.555,27 3.86,28 3.996,29 4.368,30 2.165,31 0.049,32 3.776,33 14.524,34 16.547,35 18.939,36 21.11,37 23.439,38 22.976,39 24.803,40 14.867,41 26.635,42 28.471,43 21.083,44 0.24,45 -0.024,46 38.738,47 42.189,48 180.266,49 3.049,50 3.049,51 17.038,52 5.134,53 5.049,54 3.049,55 1.177,56 10.095,57 10.095,58 25.676,59 27.983,60 30.251,61 32.552,62 34.836,63 6.244}
{0 CHEMBL420981,1 3.997,2 3.997,3 3.997,4 0.654,5 4.205,6 4.4,7 4.4,8 3.919,9 0.756,10 20.037,11 14.26,12 6.787,13 67.295,14 4.943,15 1.137,16 31.278,17 0.766,18 4.028,19 4.028,20 0.47,21 2.715,22 6.513,23 5.279,24 6.513,25 17.131,26 31.278,27 3.877,28 3.985,29 4.471,30 2.211,31 -0.007,32 3.797,33 14.746,34 16.8,35 19.223,36 21.42,37 23.774,38 23.205,39 25.049,40 15.059,41 26.898,42 28.749,43 21.363,44 0.16,45 -0.074,46 41.436,47 44.538,48 137.218,49 3.063,50 3.063,51 17.251,52 5.134,53 5.063,54 3.063,55 1.112,56 10.186,57 10.186,58 26.032,59 28.359,60 30.644,61 32.959,62 35.256,63 4.824}
{0 CHEMBL426237,1 3.986,2 3.986,3 3.986,4 0.673,5 4.244,6 4.373,7 4.373,8 4.178,9 0.693,10 19.517,11 8.757,12 4.483,13 80.744,14 4.199,15 1.476,16 62.555,17 0.819,18 3.969,19 3.969,20 0.488,21 2.455,22 6.471,23 5.247,24 6.471,25 16.813,26 62.555,27 3.764,28 3.934,29 3.786,30 2.105,31 0.171,32 3.586,33 14.161,34 16.192,35 18.599,36 20.785,37 23.13,38 22.609,39 24.442,40 14.525,41 26.281,42 28.124,43 20.868,45 -0.211,46 30.193,47 32.707,48 121.411,49 3.027,50 3.027,51 16.704,52 5.106,53 5.027,54 3.027,55 0.787,56 10.032,57 10.032,58 25.383,59 27.704,60 29.986,61 32.298,62 34.592,63 5.815}
{0 CHEMBL426802,1 3.99,2 3.99,3 3.99,4 0.831,5 4.25,6 4.387,7 4.387,8 4.18,9 1.647,10 19.925,11 20.509,12 9.949,13 81.097,14 5.597,15 1.175,16 62.555,17 1.195,18 4.022,19 4.022,20 0.51,21 2.814,22 6.522,23 5.263,24 6.522,25 17.123,26 62.555,27 3.86,28 3.996,29 4.369,30 2.165,31 0.085,32 3.776,33 14.717,34 16.786,35 19.203,36 21.408,37 23.759,38 23.19,39 25.037,40 15.056,41 26.887,42 28.741,43 21.256,44 0.248,45 -0.05,46 38.738,47 42.189,48 180.266,49 3.073,50 3.073,51 17.253,52 5.155,53 5.073,54 3.073,55 1.136,56 10.222,57 10.222,58 26.021,59 28.347,60 30.635,61 32.95,62 35.25,63 6.638}
{0 CHEMBL432379,1 4.297,2 4.297,3 4.297,4 0.638,5 4.205,6 4.566,7 4.566,8 3.996,9 1.035,10 20.742,11 12.048,12 6.473,13 62.86,14 4.879,15 1.166,16 31.278,17 0.967,18 4.152,19 4.152,20 0.462,21 3.004,22 6.833,23 5.443,24 6.833,25 18.429,26 31.278,27 3.902,28 4.036,29 4.471,30 2.329,31 0.09,32 3.798,33 15.145,34 17.306,35 19.784,36 22.084,37 24.509,38 23.614,39 25.493,40 15.466,41 27.377,42 29.265,43 22.152,44 0.137,45 -0.044,46 41.982,47 44.83,48 125.447,49 3.18,50 3.18,51 17.727,52 5.257,53 5.18,54 3.18,55 1.157,56 11.245,57 11.245,58 26.867,59 29.275,60 31.659,61 34.063,62 36.459,63 5.52}
{0 CHEMBL441389,1 3.985,2 3.985,3 3.985,4 0.784,5 4.249,6 4.377,7 4.377,8 4.18,9 1.898,10 19.765,11 19.018,12 9.646,13 86.717,14 5.465,15 1.146,16 62.555,17 1.587,18 4.002,19 4.002,20 0.492,21 2.687,22 6.485,23 5.252,24 6.485,25 16.924,26 62.555,27 3.862,28 4,29 4.396,30 2.192,31 0.086,32 3.777,33 14.524,34 16.547,35 18.939,36 21.11,37 23.439,38 22.976,39 24.803,40 14.867,41 26.635,42 28.471,43 21.083,44 0.237,45 -0.056,46 38.927,47 42.585,48 180.266,49 3.049,50 3.049,51 17.038,52 5.134,53 5.049,54 3.049,55 1.177,56 10.095,57 10.095,58 25.676,59 27.983,60 30.251,61 32.552,62 34.836,63 6.409}
{0 CHEMBL443562,1 4.014,2 4.014,3 4.014,4 0.78,5 4.249,6 4.408,7 4.408,8 4.181,9 0.472,10 19.597,11 13.559,12 4.401,13 71.876,14 4.188,15 1.822,16 62.555,17 0.999,18 4.033,19 4.033,20 0.513,21 2.455,22 6.612,23 5.257,24 6.612,25 17.386,26 62.555,27 3.773,28 3.953,29 3.493,30 1.997,31 0.497,32 3.52,33 14.342,34 16.449,35 18.886,36 21.13,37 23.511,38 22.843,39 24.702,40 14.726,41 26.567,42 28.435,43 20.959,45 -0.2,46 27.32,47 30.205,48 144.953,49 3.082,50 3.082,51 16.949,52 5.163,53 5.082,54 3.082,55 0.675,56 10.439,57 10.439,58 25.813,59 28.172,60 30.499,61 32.85,62 35.187,63 5.143}
{0 CHEMBL446935,1 3.958,2 3.958,3 3.958,4 0.679,5 4.205,6 4.364,7 4.364,8 3.878,9 1.134,10 19.528,11 15.91,12 5.174,13 49.887,14 4.254,15 1.241,16 31.278,17 1.121,18 3.999,19 3.999,20 0.481,21 2.603,22 6.47,23 5.232,24 6.47,25 16.846,26 31.278,27 3.783,28 3.981,29 4.361,30 2.19,31 0.035,32 3.747,33 14.301,34 16.308,35 18.707,36 20.868,37 23.204,38 22.796,39 24.622,40 14.635,41 26.452,42 28.287,43 20.839,44 0.026,45 0.02,46 35.556,47 39.408,48 137.218,49 3.023,50 3.023,51 16.794,52 5.097,53 5.023,54 3.023,55 0.936,56 10.029,57 10.029,58 25.439,59 27.752,60 30.022,61 32.327,62 34.614,63 4.963}
{0 CHEMBL86427,1 3.954,2 3.954,3 3.954,4 0.615,5 4.205,6 4.356,7 4.356,8 3.888,9 0.629,10 19.574,11 12.908,12 5.405,13 57.395,14 4.542,15 1.147,16 31.278,17 0.683,18 3.977,19 3.977,20 0.481,21 2.687,22 6.464,23 5.245,24 6.464,25 16.801,26 31.278,27 3.883,28 3.982,29 4.306,30 2.214,31 0.144,32 3.799,33 14.271,34 16.257,35 18.659,36 20.817,37 23.154,38 22.693,39 24.513,40 14.574,41 26.341,42 28.174,43 20.855,44 0.136,45 -0.126,46 37.782,47 41.119,48 137.218,49 3.014,50 3.014,51 16.726,52 5.081,53 5.014,54 3.014,55 1.032,56 10.012,57 10.012,58 25.391,59 27.705,60 29.977,61 32.284,62 34.572,63 6.699}
{0 CHEMBL88489,1 3.966,2 3.966,3 3.966,4 0.6,5 4.205,6 4.37,7 4.37,8 3.913,9 1.087,10 19.827,11 11.11,12 4.62,13 63.981,14 4.341,15 1.249,16 31.278,17 1.031,18 3.994,19 3.994,20 0.472,21 2.667,22 6.472,23 5.242,24 6.472,25 16.88,26 31.278,27 3.874,28 3.983,29 4.277,30 2.198,31 0.063,32 3.797,33 14.462,34 16.456,35 18.856,36 21.009,37 23.34,38 22.918,39 24.741,40 14.793,41 26.57,42 28.403,43 21.128,44 0.11,45 -0.051,46 35.411,47 38.044,48 101.904,49 3.03,50 3.03,51 16.953,52 5.098,53 5.03,54 3.03,55 0.992,56 10.042,57 10.042,58 25.566,59 27.873,60 30.134,61 32.433,62 34.712,63 4}
{0 CHEMBL88599,1 3.994,2 3.994,3 3.994,4 0.628,5 4.205,6 4.395,7 4.395,8 3.914,9 0.824,10 20.021,11 13.419,12 6.282,13 60.104,14 4.599,15 1.263,16 31.278,17 0.791,18 4.023,19 4.023,20 0.475,21 2.667,22 6.509,23 5.271,24 6.509,25 17.083,26 31.278,27 3.874,28 3.983,29 4.41,30 2.198,31 0.188,32 3.797,33 14.71,34 16.772,35 19.19,36 21.388,37 23.738,38 23.183,39 25.029,40 15.018,41 26.878,42 28.73,43 21.345,44 0.15,45 -0.149,46 39.109,47 42.329,48 137.218,49 3.058,50 3.058,51 17.209,52 5.128,53 5.058,54 3.058,55 1.089,56 10.161,57 10.161,58 25.995,59 28.319,60 30.601,61 32.914,62 35.208,63 6.26}
{0 CHEMBL88864,1 3.955,2 3.955,3 3.955,4 0.669,5 4.205,6 4.357,7 4.357,8 3.866,9 0.65,10 19.473,11 14.679,12 4.465,13 54.86,14 4.201,15 1.228,16 31.278,17 0.742,18 3.976,19 3.976,20 0.478,21 2.602,22 6.464,23 5.216,24 6.464,25 16.799,26 31.278,27 3.778,28 3.957,29 4.313,30 2.178,31 0.032,32 3.749,33 14.188,34 16.193,35 18.603,36 20.775,37 23.12,38 22.625,39 24.452,40 14.504,41 26.286,42 28.126,43 20.785,44 0.119,45 -0.078,46 34.782,47 38.119,48 137.218,49 3.013,50 3.013,51 16.665,52 5.079,53 5.013,54 3.013,55 0.987,56 10.011,57 10.011,58 25.365,59 27.684,60 29.961,61 32.271,62 34.563,63 6.31}
{0 CHEMBL88865,1 3.958,2 3.958,3 3.958,4 0.672,5 4.205,6 4.364,7 4.364,8 3.868,9 1.143,10 19.528,11 15.478,12 4.744,13 54.86,14 4.225,15 1.217,16 31.278,17 1.074,18 3.986,19 3.986,20 0.478,21 2.603,22 6.47,23 5.232,24 6.47,25 16.846,26 31.278,27 3.779,28 3.958,29 4.327,30 2.178,31 -0.061,32 3.744,33 14.301,34 16.308,35 18.707,36 20.868,37 23.204,38 22.796,39 24.622,40 14.635,41 26.452,42 28.287,43 20.839,44 0.006,45 0.038,46 34.782,47 38.119,48 137.218,49 3.023,50 3.023,51 16.794,52 5.089,53 5.023,54 3.023,55 0.936,56 10.029,57 10.029,58 25.439,59 27.752,60 30.022,61 32.327,62 34.614,63 6.409}
{0 CHEMBL89269,1 3.955,2 3.955,3 3.955,4 0.638,5 4.205,6 4.357,7 4.357,8 3.901,9 1.471,10 19.895,11 14.143,12 7.325,13 60.104,14 4.994,15 1.004,16 31.278,17 1.432,18 3.976,19 3.976,20 0.477,21 2.907,22 6.464,23 5.217,24 6.464,25 16.794,26 31.278,27 3.896,28 3.982,29 4.344,30 2.296,31 0.104,32 3.8,33 14.511,34 16.522,35 18.908,36 21.069,37 23.39,38 22.964,39 24.789,40 14.804,41 26.618,42 28.451,43 21.2,44 0.172,45 0.063,46 42.993,47 46.744,48 160.76,49 3.013,50 3.013,51 16.953,52 5.08,53 5.013,54 3.013,55 1.124,56 10.01,57 10.01,58 25.617,59 27.916,60 30.174,61 32.465,62 34.739,63 5.004}
{0 CHEMBL89386,1 3.96,2 3.96,3 3.96,4 0.784,5 4.205,6 4.431,7 4.431,8 3.87,9 1.651,10 19.576,11 18.889,12 5.563,13 51.675,14 4.721,15 1.15,16 31.278,17 1.417,18 4.293,19 4.293,20 0.478,21 2.565,22 7.061,23 5.311,24 7.061,25 18.42,26 31.278,27 3.785,28 3.962,29 4.461,30 2.189,31 -0.151,32 3.776,33 15.093,34 17.345,35 19.802,36 22.15,37 24.575,38 23.793,39 25.714,40 15.777,41 27.64,42 29.569,43 20.888,44 0.14,45 0.153,46 36.665,47 40.534,48 160.76,49 3.299,50 3.299,51 18.117,52 5.396,53 5.299,54 3.299,55 1.059,56 11.387,57 11.387,58 26.962,59 29.379,60 31.783,61 34.199,62 36.612,63 6.108}
{0 CHEMBL89523,1 3.953,2 3.953,3 3.953,4 0.737,5 4.205,6 4.355,7 4.355,8 3.869,9 0.834,10 19.432,11 15.127,12 4.856,13 53.351,14 5.041,15 1.379,16 31.278,17 0.694,18 3.985,19 3.985,20 0.474,21 2.603,22 6.464,23 5.263,24 6.464,25 16.794,26 31.278,27 3.777,28 3.973,29 4.339,30 2.173,31 0.188,32 3.762,33 14.174,34 16.184,35 18.593,36 20.768,37 23.113,38 22.616,39 24.443,40 14.487,41 26.278,42 28.118,43 20.749,44 0.23,45 -0.163,46 38.767,47 43.033,48 160.76,49 3.012,50 3.012,51 16.649,52 5.086,53 5.012,54 3.012,55 1.194,56 10.01,57 10.01,58 25.36,59 27.68,60 29.958,61 32.268,62 34.56,63 4.27}
{0 CHEMBL89609,1 3.962,2 3.962,3 3.962,4 0.581,5 4.205,6 4.367,7 4.367,8 3.909,9 0.961,10 19.704,11 12.649,12 5.06,13 49.887,14 4.179,15 1.268,16 31.278,17 0.96,18 4.004,19 4.004,20 0.483,21 2.687,22 6.472,23 5.238,24 6.472,25 16.871,26 31.278,27 3.867,28 4.003,29 4.292,30 2.201,31 0.123,32 3.801,33 14.406,34 16.414,35 18.812,36 20.972,37 23.303,38 22.874,39 24.701,40 14.718,41 26.533,42 28.368,43 20.995,44 0.151,45 -0.083,46 35.673,47 38.993,48 113.675,49 3.027,50 3.027,51 16.88,52 5.103,53 5.027,54 3.027,55 1.04,56 10.04,57 10.04,58 25.533,59 27.84,60 30.104,61 32.404,62 34.685,63 4}
{0 CHEMBL89612,1 3.953,2 3.953,3 3.953,4 0.771,5 4.205,6 4.355,7 4.355,8 3.874,9 0.772,10 19.443,11 17.505,12 6.711,13 54.956,14 5.3,15 1.038,16 31.278,17 0.76,18 3.986,19 3.986,20 0.483,21 2.603,22 6.464,23 5.245,24 6.464,25 16.793,26 31.278,27 3.786,28 3.982,29 4.448,30 2.213,31 0.091,32 3.797,33 14.174,34 16.183,35 18.592,36 20.768,37 23.112,38 22.615,39 24.443,40 14.483,41 26.277,42 28.117,43 20.757,44 0.322,45 0.043,46 41.323,47 46.238,48 184.302,49 3.012,50 3.012,51 16.646,52 5.085,53 5.012,54 3.012,55 1.264,56 10.01,57 10.01,58 25.36,59 27.68,60 29.958,61 32.268,62 34.56,63 6.509}
{0 CHEMBL89671,1 3.704,2 3.704,3 3.704,4 0.476,5 4.204,6 4.178,7 4.178,8 3.82,9 0.262,10 18.689,11 3.833,12 2.241,13 39.24,14 2.617,15 1.627,16 31.278,17 0.327,18 3.803,19 3.803,20 0.49,21 2.208,22 6.05,23 5.006,24 6.05,25 14.854,26 31.278,27 3.767,28 3.944,29 2.904,30 1.719,31 0.159,32 3.305,33 13.352,34 15.213,35 17.518,36 19.531,37 21.754,38 21.814,39 23.588,40 13.664,41 25.366,42 27.147,43 19.897,45 -0.203,46 21.476,47 23.455,48 66.591,49 2.833,50 2.833,51 15.722,52 4.896,53 4.833,54 2.833,55 0.355,56 8.691,57 8.691,58 23.839,59 26.027,60 28.148,61 30.321,62 32.461,63 5.155}
{0 CHEMBL89687,1 4.027,2 4.027,3 4.027,4 0.583,5 4.205,6 4.381,7 4.381,8 3.971,9 0.853,10 20.202,11 10.431,12 5.045,13 57.617,14 4.429,15 1.262,16 31.278,17 0.896,18 3.999,19 3.999,20 0.465,21 2.667,22 6.472,23 5.254,24 6.472,25 16.886,26 31.278,27 3.903,28 4.029,29 4.327,30 2.455,31 0.158,32 3.798,33 14.601,34 16.595,35 18.983,36 21.13,37 23.451,38 23.083,39 24.904,40 14.941,41 26.729,42 28.558,43 21.537,44 0.126,45 -0.122,46 37.771,47 40.206,48 101.904,49 3.034,50 3.034,51 17.1,52 5.103,53 5.034,54 3.034,55 1.001,56 10.044,57 10.044,58 25.669,59 27.968,60 30.222,61 32.513,62 34.787,63 4}
{0 CHEMBL90048,1 3.953,2 3.953,3 3.953,4 0.606,5 4.205,6 4.355,7 4.355,8 3.872,9 0.69,10 19.433,11 12.33,12 4.767,13 49.236,14 3.971,15 1.234,16 31.278,17 0.733,18 3.986,19 3.986,20 0.48,21 2.603,22 6.464,23 5.223,24 6.464,25 16.793,26 31.278,27 3.779,28 3.977,29 4.105,30 2.146,31 0.098,32 3.692,33 14.155,34 16.175,35 18.586,36 20.765,37 23.111,38 22.599,39 24.43,40 14.465,41 26.268,42 28.11,43 20.749,45 -0.034,46 32.673,47 35.993,48 113.675,49 3.012,50 3.012,51 16.634,52 5.084,53 5.012,54 3.012,55 0.913,56 10.01,57 10.01,58 25.359,59 27.679,60 29.958,61 32.268,62 34.56,63 6.42}
{0 CHEMBL90049,1 3.953,2 3.953,3 3.953,4 0.674,5 4.205,6 4.356,7 4.356,8 3.874,9 0.595,10 19.442,11 15.068,12 5.309,13 52.421,14 4.35,15 1.219,16 31.278,17 0.698,18 3.988,19 3.988,20 0.481,21 2.603,22 6.464,23 5.239,24 6.464,25 16.799,26 31.278,27 3.781,28 3.979,29 4.331,30 2.189,31 0.148,32 3.75,33 14.188,34 16.193,35 18.603,36 20.775,37 23.12,38 22.625,39 24.452,40 14.504,41 26.286,42 28.126,43 20.757,44 0.031,45 -0.082,46 35.556,47 39.408,48 137.218,49 3.013,50 3.013,51 16.665,52 5.086,53 5.013,54 3.013,55 1.072,56 10.011,57 10.011,58 25.365,59 27.684,60 29.961,61 32.271,62 34.563,63 5.331}
{0 CHEMBL90619,1 3.987,2 3.987,3 3.987,4 0.716,5 10.695,6 4.389,7 4.389,8 4.205,9 0.923,10 19.991,11 22.134,12 5.077,13 56.52,14 4.812,15 1.285,16 88.06,17 0.911,18 4.007,19 4.007,20 0.528,21 2.667,22 6.493,23 5.263,24 6.493,25 16.998,26 88.06,27 3.868,28 3.978,29 4.237,30 2.186,31 0.108,32 3.797,33 14.638,34 16.68,35 19.094,36 21.277,37 23.62,38 23.129,39 24.971,40 14.967,41 26.817,42 28.666,43 21.312,44 0.125,45 -0.171,46 34.967,47 37.425,48 158.686,49 3.05,50 3.05,51 17.15,52 5.113,53 5.05,54 3.05,55 0.965,56 10.1,57 10.1,58 25.864,59 28.179,60 30.451,61 32.755,62 35.04,63 6.051}
{0 CHEMBL90827,1 3.954,2 3.954,3 3.954,4 0.621,5 4.205,6 4.356,7 4.356,8 3.896,9 0.601,10 19.574,11 13.89,12 5.802,13 52.421,14 4.571,15 1.151,16 31.278,17 0.639,18 3.988,19 3.988,20 0.483,21 2.687,22 6.464,23 5.245,24 6.464,25 16.801,26 31.278,27 3.884,28 4,29 4.359,30 2.25,31 0.165,32 3.805,33 14.271,34 16.257,35 18.659,36 20.817,37 23.154,38 22.693,39 24.513,40 14.574,41 26.341,42 28.174,43 20.855,44 0.208,45 -0.108,46 38.556,47 42.408,48 137.218,49 3.014,50 3.014,51 16.726,52 5.087,53 5.014,54 3.014,55 1.14,56 10.012,57 10.012,58 25.391,59 27.705,60 29.977,61 32.284,62 34.572,63 6.086}
{0 CHEMBL91372,1 3.947,2 3.947,3 3.947,4 0.514,5 4.205,6 4.345,7 4.345,8 3.862,9 0.6,10 19.405,11 6.256,12 3.172,13 41.997,14 3.087,15 1.701,16 31.278,17 0.605,18 3.972,19 3.972,20 0.476,21 2.492,22 6.454,23 5.19,24 6.454,25 16.687,26 31.278,27 3.775,28 3.968,29 3.34,30 1.895,31 0.232,32 3.395,33 14.076,34 16.119,35 18.524,36 20.712,37 23.052,38 22.538,39 24.375,40 14.375,41 26.218,42 28.064,43 20.721,45 -0.067,46 25.905,47 28.162,48 54.82,49 2.998,50 2.998,51 16.545,52 5.069,53 4.998,54 2.998,55 0.617,56 9.962,57 9.962,58 25.301,59 27.617,60 29.893,61 32.199,62 34.487,63 6.495}
{0 CHEMBL91437,1 3.964,2 3.964,3 3.964,4 0.597,5 4.205,6 4.369,7 4.369,8 3.912,9 0.871,10 19.797,11 11.126,12 4.638,13 63.981,14 4.341,15 1.257,16 31.278,17 0.879,18 3.992,19 3.992,20 0.472,21 2.687,22 6.472,23 5.24,24 6.472,25 16.872,26 31.278,27 3.874,28 3.983,29 4.266,30 2.201,31 0.072,32 3.797,33 14.441,34 16.436,35 18.831,36 20.985,37 23.315,38 22.906,39 24.728,40 14.769,41 26.556,42 28.388,43 21.094,44 0.099,45 -0.134,46 35.411,47 38.044,48 101.904,49 3.029,50 3.029,51 16.926,52 5.096,53 5.029,54 3.029,55 0.974,56 10.04,57 10.04,58 25.542,59 27.848,60 30.111,61 32.41,62 34.69,63 4.208}
{0 CHEMBL92374,1 3.953,2 3.953,3 3.953,4 0.633,5 4.205,6 4.355,7 4.355,8 3.87,9 0.99,10 19.431,11 12.351,12 4.541,13 49.236,14 4.036,15 1.211,16 31.278,17 0.93,18 3.986,19 3.986,20 0.479,21 2.56,22 6.464,23 5.216,24 6.464,25 16.79,26 31.278,27 3.778,28 3.976,29 4.034,30 2.136,31 0.002,32 3.656,33 14.147,34 16.171,35 18.581,36 20.763,37 23.108,38 22.595,39 24.427,40 14.46,41 26.265,42 28.107,43 20.748,45 0.058,46 31.673,47 34.993,48 113.675,49 3.012,50 3.012,51 16.629,52 5.084,53 5.012,54 3.012,55 0.913,56 10.009,57 10.009,58 25.357,59 27.677,60 29.956,61 32.266,62 34.558,63 6.456}
