"molecule_id","nAB","Mp","AMW","C.","pXC50"
{1 11,2 0.665,3 7.709,4 43.3,5 5.398}
{0 CHEMBL386313,1 11,2 0.694,3 7.92,4 42.4,5 5.398}
{0 CHEMBL549285,1 16,2 0.719,3 9.087,4 46.2,5 4.824}
{0 CHEMBL550107,1 22,2 0.694,3 8.334,4 45,5 4.678}
{0 CHEMBL554576,1 10,2 0.721,3 9.466,4 40.9,5 4.921}
{0 CHEMBL556099,1 12,2 0.758,3 10.198,4 45,5 5.523}
{0 CHEMBL558246,1 29,2 0.719,3 8.949,4 43.8,5 4.328}
{0 CHEMBL559790,1 17,2 0.686,3 7.74,4 48.1,5 4.187}
{0 CHEMBL559791,1 17,2 0.704,3 9.419,4 43.2,5 4.824}
{0 CHEMBL559989,1 16,2 0.717,3 9.437,4 40,5 4.252}
{0 CHEMBL560919,1 12,2 0.69,3 8.066,4 48.6,5 4.377}
{0 CHEMBL561121,1 12,2 0.758,3 10.198,4 45,5 5.699}
{0 CHEMBL561122,1 12,2 0.729,3 9.964,4 42.9,5 6.155}
{0 CHEMBL561523,1 12,2 0.721,3 10.267,4 44.2,5 5.398}
{0 CHEMBL561728,1 16,2 0.732,3 10.233,4 44.4,5 4}
{0 CHEMBL561925,1 16,2 0.702,3 8.222,4 42.1,5 4}
{0 CHEMBL563047,1 16,2 0.68,3 8.814,4 37.5,5 4.824}
