"molecule_id","AMW","C.","pXC50"
{1 7.595,2 32,3 5.602}
{0 CHEMBL1784704,1 7.907,2 30.4,3 4.824}
{0 CHEMBL1784769,1 7.869,2 34.2,3 4.752}
{0 CHEMBL1784770,1 7.849,2 31.9,3 4.456}
{0 CHEMBL1784772,1 7.601,2 34.2,3 4.277}
{0 CHEMBL1784774,1 7.83,2 31.5,3 5.535}
{0 CHEMBL1784775,1 7.965,2 31.4,3 4.521}
{0 CHEMBL1784776,1 7.483,2 32.1,3 5.149}
{0 CHEMBL1784777,1 7.483,2 32.1,3 4.735}
{0 CHEMBL1784779,1 7.94,2 31.1,3 4.827}
{0 CHEMBL1784780,1 7.931,2 30.8,3 4.007}
{0 CHEMBL1784783,1 7.787,2 30.9,3 4.967}
{0 CHEMBL1784784,1 7.952,2 31.9,3 6.569}
{0 CHEMBL1784785,1 7.711,2 32.4,3 5.796}
{0 CHEMBL1784786,1 7.458,2 29.3,3 6.357}
{0 CHEMBL1784787,1 7.331,2 29.4,3 6.387}
{0 CHEMBL2017812,1 7.766,2 36.4,3 5.907}
{0 CHEMBL2017813,1 7.766,2 36.4,3 4.711}
{0 CHEMBL2017814,1 7.593,2 36.6,3 6.268}
{0 CHEMBL2017815,1 7.678,2 37,3 6.886}
{0 CHEMBL2017816,1 7.595,2 35.6,3 7}
{0 CHEMBL2017817,1 7.497,2 35.6,3 6.301}
{0 CHEMBL2017818,1 7.406,2 35.5,3 4.919}
{0 CHEMBL2017819,1 7.742,2 37.8,3 4.805}
{0 CHEMBL2017820,1 7.587,2 34.7,3 5.394}
{0 CHEMBL2017821,1 7.789,2 38.5,3 7.097}
{0 CHEMBL2017822,1 7.645,2 36.4,3 7.398}
{0 CHEMBL250901,1 8.42,2 43.2,3 4.523}
{0 CHEMBL400100,1 7.941,2 44.2,3 4.409}
{0 CHEMBL400710,1 7.878,2 47.2,3 4.42}
