{
  "data_set_description": {
    "collection_date": "November 2013",
    "creator": "Dr Jeremy Besnard, Dr Ivan Olier, Dr Noureddin Sadawi, Dr Larisa Soldatova, Dr Crina Grosan, Prof Ross King, Dr Richard Bickerton, Prof Andrew Hopkins and Dr Willem van Hoorn",
    "default_target_attribute": "pXC50",
    "description": "This dataset contains QSAR data (from ChEMBL version 17) showing activity values (unit is pseudo-pCI50) of several compounds on drug target ChEMBL_ID: CHEMBL5257 (TID: 30030), and it has 80 rows and 43 features (not including molecule IDs and class feature: molecule_id and pXC50). The features represent Basic Molecular Descriptors which were generated from SMILES strings.  Missing value imputation was applied to this dataset (By choosing the Median).",
    "description_version": "1",
    "file_id": "3343139",
    "format": "ARFF",
    "id": "27869",
    "licence": "Public",
    "md5_checksum": "2a140bc1956aa4622b92c195cb733364",
    "minio_url": "https://data.openml.org/datasets/0002/27869/dataset_27869.pq",
    "name": "QSAR-DATASET-FOR-DRUG-TARGET-CHEMBL5257",
    "original_data_url": "https://www.ebi.ac.uk/chembl/target/inspect/CHEMBL5257",
    "parquet_url": "https://data.openml.org/datasets/0002/27869/dataset_27869.pq",
    "processing_date": "2018-10-04 00:40:23",
    "row_id_attribute": "molecule_id",
    "status": "deactivated",
    "tag": [
      "MetaQSAR",
      "study_13"
    ],
    "upload_date": "2016-07-14T22:35:51",
    "url": "https://api.openml.org/data/v1/download/3343139/QSAR-DATASET-FOR-DRUG-TARGET-CHEMBL5257.arff",
    "version": "9",
    "visibility": "public"
  }
}