{
  "data_qualities": {
    "quality": [
      {
        "name": "AutoCorrelation",
        "value": "-0.09503225806451653"
      },
      {
        "name": "ClassEntropy",
        "value": []
      },
      {
        "name": "Dimensionality",
        "value": "0.125"
      },
      {
        "name": "EquivalentNumberOfAtts",
        "value": []
      },
      {
        "name": "MajorityClassPercentage",
        "value": []
      },
      {
        "name": "MajorityClassSize",
        "value": []
      },
      {
        "name": "MaxAttributeEntropy",
        "value": []
      },
      {
        "name": "MaxKurtosisOfNumericAtts",
        "value": "3.9662825969725106"
      },
      {
        "name": "MaxMeansOfNumericAtts",
        "value": "43.33125"
      },
      {
        "name": "MaxMutualInformation",
        "value": []
      },
      {
        "name": "MaxNominalAttDistinctValues",
        "value": []
      },
      {
        "name": "MaxSkewnessOfNumericAtts",
        "value": "1.8450842751027123"
      },
      {
        "name": "MaxStdDevOfNumericAtts",
        "value": "3.127034821391273"
      },
      {
        "name": "MeanAttributeEntropy",
        "value": []
      },
      {
        "name": "MeanKurtosisOfNumericAtts",
        "value": "0.8183870381804517"
      },
      {
        "name": "MeanMeansOfNumericAtts",
        "value": "18.9431875"
      },
      {
        "name": "MeanMutualInformation",
        "value": []
      },
      {
        "name": "MeanNoiseToSignalRatio",
        "value": []
      },
      {
        "name": "MeanNominalAttDistinctValues",
        "value": []
      },
      {
        "name": "MeanSkewnessOfNumericAtts",
        "value": "0.5742103396993935"
      },
      {
        "name": "MeanStdDevOfNumericAtts",
        "value": "1.6348725470752552"
      },
      {
        "name": "MinAttributeEntropy",
        "value": []
      },
      {
        "name": "MinKurtosisOfNumericAtts",
        "value": "-0.9106138985199563"
      },
      {
        "name": "MinMeansOfNumericAtts",
        "value": "6.01584375"
      },
      {
        "name": "MinMutualInformation",
        "value": []
      },
      {
        "name": "MinNominalAttDistinctValues",
        "value": []
      },
      {
        "name": "MinSkewnessOfNumericAtts",
        "value": "-0.41149222526925955"
      },
      {
        "name": "MinStdDevOfNumericAtts",
        "value": "0.8461311567811496"
      },
      {
        "name": "MinorityClassPercentage",
        "value": []
      },
      {
        "name": "MinorityClassSize",
        "value": []
      },
      {
        "name": "NumberOfBinaryFeatures",
        "value": "0.0"
      },
      {
        "name": "NumberOfClasses",
        "value": "0.0"
      },
      {
        "name": "NumberOfFeatures",
        "value": "4.0"
      },
      {
        "name": "NumberOfInstances",
        "value": "32.0"
      },
      {
        "name": "NumberOfInstancesWithMissingValues",
        "value": "0.0"
      },
      {
        "name": "NumberOfMissingValues",
        "value": "0.0"
      },
      {
        "name": "NumberOfNumericFeatures",
        "value": "3.0"
      },
      {
        "name": "NumberOfSymbolicFeatures",
        "value": "1.0"
      },
      {
        "name": "PercentageOfBinaryFeatures",
        "value": "0.0"
      },
      {
        "name": "PercentageOfInstancesWithMissingValues",
        "value": "0.0"
      },
      {
        "name": "PercentageOfMissingValues",
        "value": "0.0"
      },
      {
        "name": "PercentageOfNumericFeatures",
        "value": "75.0"
      },
      {
        "name": "PercentageOfSymbolicFeatures",
        "value": "25.0"
      },
      {
        "name": "Quartile1AttributeEntropy",
        "value": []
      },
      {
        "name": "Quartile1KurtosisOfNumericAtts",
        "value": "-0.9106138985199563"
      },
      {
        "name": "Quartile1MeansOfNumericAtts",
        "value": "6.01584375"
      },
      {
        "name": "Quartile1MutualInformation",
        "value": []
      },
      {
        "name": "Quartile1SkewnessOfNumericAtts",
        "value": "-0.41149222526925955"
      },
      {
        "name": "Quartile1StdDevOfNumericAtts",
        "value": "0.8461311567811496"
      },
      {
        "name": "Quartile2AttributeEntropy",
        "value": []
      },
      {
        "name": "Quartile2KurtosisOfNumericAtts",
        "value": "-0.6005075839111993"
      },
      {
        "name": "Quartile2MeansOfNumericAtts",
        "value": "7.48246875"
      },
      {
        "name": "Quartile2MutualInformation",
        "value": []
      },
      {
        "name": "Quartile2SkewnessOfNumericAtts",
        "value": "0.2890389692647276"
      },
      {
        "name": "Quartile2StdDevOfNumericAtts",
        "value": "0.9314516630533431"
      },
      {
        "name": "Quartile3AttributeEntropy",
        "value": []
      },
      {
        "name": "Quartile3KurtosisOfNumericAtts",
        "value": "3.9662825969725106"
      },
      {
        "name": "Quartile3MeansOfNumericAtts",
        "value": "43.33125"
      },
      {
        "name": "Quartile3MutualInformation",
        "value": []
      },
      {
        "name": "Quartile3SkewnessOfNumericAtts",
        "value": "1.8450842751027123"
      },
      {
        "name": "Quartile3StdDevOfNumericAtts",
        "value": "3.127034821391273"
      },
      {
        "name": "StdvNominalAttDistinctValues",
        "value": []
      }
    ]
  }
}