{
  "data_qualities": {
    "quality": [
      {
        "name": "AutoCorrelation",
        "value": "-0.13957407407407418"
      },
      {
        "name": "ClassEntropy",
        "value": []
      },
      {
        "name": "Dimensionality",
        "value": "11.495412844036696"
      },
      {
        "name": "EquivalentNumberOfAtts",
        "value": []
      },
      {
        "name": "MajorityClassPercentage",
        "value": []
      },
      {
        "name": "MajorityClassSize",
        "value": []
      },
      {
        "name": "MaxAttributeEntropy",
        "value": []
      },
      {
        "name": "MaxKurtosisOfNumericAtts",
        "value": "109.00000000000007"
      },
      {
        "name": "MaxMeansOfNumericAtts",
        "value": "207887.40366972482"
      },
      {
        "name": "MaxMutualInformation",
        "value": []
      },
      {
        "name": "MaxNominalAttDistinctValues",
        "value": []
      },
      {
        "name": "MaxSkewnessOfNumericAtts",
        "value": "10.440306508910584"
      },
      {
        "name": "MaxStdDevOfNumericAtts",
        "value": "189179.01818393933"
      },
      {
        "name": "MeanAttributeEntropy",
        "value": []
      },
      {
        "name": "MeanKurtosisOfNumericAtts",
        "value": "3.1516942722062575"
      },
      {
        "name": "MeanMeansOfNumericAtts",
        "value": "628.787293621948"
      },
      {
        "name": "MeanMutualInformation",
        "value": []
      },
      {
        "name": "MeanNoiseToSignalRatio",
        "value": []
      },
      {
        "name": "MeanNominalAttDistinctValues",
        "value": []
      },
      {
        "name": "MeanSkewnessOfNumericAtts",
        "value": "0.47665130405329464"
      },
      {
        "name": "MeanStdDevOfNumericAtts",
        "value": "555.6092219573816"
      },
      {
        "name": "MinAttributeEntropy",
        "value": []
      },
      {
        "name": "MinKurtosisOfNumericAtts",
        "value": "-1.9561144123077927"
      },
      {
        "name": "MinMeansOfNumericAtts",
        "value": "-5.344532110091743"
      },
      {
        "name": "MinMutualInformation",
        "value": []
      },
      {
        "name": "MinNominalAttDistinctValues",
        "value": []
      },
      {
        "name": "MinSkewnessOfNumericAtts",
        "value": "-4.792325410889175"
      },
      {
        "name": "MinStdDevOfNumericAtts",
        "value": "2.133817478192833E-4"
      },
      {
        "name": "MinorityClassPercentage",
        "value": []
      },
      {
        "name": "MinorityClassSize",
        "value": []
      },
      {
        "name": "NumberOfBinaryFeatures",
        "value": "0.0"
      },
      {
        "name": "NumberOfClasses",
        "value": "0.0"
      },
      {
        "name": "NumberOfFeatures",
        "value": "1253.0"
      },
      {
        "name": "NumberOfInstances",
        "value": "109.0"
      },
      {
        "name": "NumberOfInstancesWithMissingValues",
        "value": "0.0"
      },
      {
        "name": "NumberOfMissingValues",
        "value": "0.0"
      },
      {
        "name": "NumberOfNumericFeatures",
        "value": "1252.0"
      },
      {
        "name": "NumberOfSymbolicFeatures",
        "value": "1.0"
      },
      {
        "name": "PercentageOfBinaryFeatures",
        "value": "0.0"
      },
      {
        "name": "PercentageOfInstancesWithMissingValues",
        "value": "0.0"
      },
      {
        "name": "PercentageOfMissingValues",
        "value": "0.0"
      },
      {
        "name": "PercentageOfNumericFeatures",
        "value": "99.92019154030328"
      },
      {
        "name": "PercentageOfSymbolicFeatures",
        "value": "0.07980845969672785"
      },
      {
        "name": "Quartile1AttributeEntropy",
        "value": []
      },
      {
        "name": "Quartile1KurtosisOfNumericAtts",
        "value": "-0.9375306144890123"
      },
      {
        "name": "Quartile1MeansOfNumericAtts",
        "value": "0.8692981651376147"
      },
      {
        "name": "Quartile1MutualInformation",
        "value": []
      },
      {
        "name": "Quartile1SkewnessOfNumericAtts",
        "value": "-0.5022097912637156"
      },
      {
        "name": "Quartile1StdDevOfNumericAtts",
        "value": "0.22912322357199064"
      },
      {
        "name": "Quartile2AttributeEntropy",
        "value": []
      },
      {
        "name": "Quartile2KurtosisOfNumericAtts",
        "value": "-0.512395601474364"
      },
      {
        "name": "Quartile2MeansOfNumericAtts",
        "value": "3.424105504587156"
      },
      {
        "name": "Quartile2MutualInformation",
        "value": []
      },
      {
        "name": "Quartile2SkewnessOfNumericAtts",
        "value": "0.011052440802617282"
      },
      {
        "name": "Quartile2StdDevOfNumericAtts",
        "value": "0.5316738337233251"
      },
      {
        "name": "Quartile3AttributeEntropy",
        "value": []
      },
      {
        "name": "Quartile3KurtosisOfNumericAtts",
        "value": "0.7876333172376988"
      },
      {
        "name": "Quartile3MeansOfNumericAtts",
        "value": "10.023284403669724"
      },
      {
        "name": "Quartile3MutualInformation",
        "value": []
      },
      {
        "name": "Quartile3SkewnessOfNumericAtts",
        "value": "0.7329146870203511"
      },
      {
        "name": "Quartile3StdDevOfNumericAtts",
        "value": "2.7774448627654893"
      },
      {
        "name": "StdvNominalAttDistinctValues",
        "value": []
      }
    ]
  }
}