{
  "data_set_description": {
    "collection_date": "November 2013",
    "creator": "Dr Jeremy Besnard, Dr Ivan Olier, Dr Noureddin Sadawi, Dr Larisa Soldatova, Dr Crina Grosan, Prof Ross King, Dr Richard Bickerton, Prof Andrew Hopkins and Dr Willem van Hoorn",
    "default_target_attribute": "pXC50",
    "description": "This dataset contains QSAR data (from ChEMBL version 17) showing activity values (unit is pseudo-pCI50) of several compounds on drug target ChEMBL_ID: CHEMBL3640 (TID: 18035), and it has 55 rows and 1170 features (not including molecule IDs and class feature: molecule_id and pXC50). The features represent Molecular Descriptors which were generated from SMILES strings. Missing value imputation was applied to this dataset (By choosing the Median).",
    "description_version": "1",
    "file_id": "3340654",
    "format": "ARFF",
    "id": "27790",
    "licence": "Public",
    "md5_checksum": "15d1174f8a53088af346f8ef43f755d0",
    "minio_url": "https://data.openml.org/datasets/0002/27790/dataset_27790.pq",
    "name": "QSAR-DATASET-FOR-DRUG-TARGET-CHEMBL3640",
    "original_data_url": "https://www.ebi.ac.uk/chembl/target/inspect/CHEMBL3640",
    "parquet_url": "https://data.openml.org/datasets/0002/27790/dataset_27790.pq",
    "processing_date": "2018-10-04 00:30:27",
    "row_id_attribute": "molecule_id",
    "status": "deactivated",
    "tag": [
      "MetaQSAR",
      "study_13"
    ],
    "upload_date": "2016-07-14T22:24:35",
    "url": "https://api.openml.org/data/v1/download/3340654/QSAR-DATASET-FOR-DRUG-TARGET-CHEMBL3640.arff",
    "version": "10",
    "visibility": "public"
  }
}