{
  "data_set_description": {
    "collection_date": "November 2013",
    "creator": "Dr Jeremy Besnard, Dr Ivan Olier, Dr Noureddin Sadawi, Dr Larisa Soldatova, Dr Crina Grosan, Prof Ross King, Dr Richard Bickerton, Prof Andrew Hopkins and Dr Willem van Hoorn",
    "default_target_attribute": "pXC50",
    "description": "This dataset contains QSAR data (from ChEMBL version 17) showing activity values (unit is pseudo-pCI50) of several compounds on drug target ChEMBL_ID: CHEMBL3263 (TID: 11299), and it has 68 rows and 1228 features (not including molecule IDs and class feature: molecule_id and pXC50). The features represent Molecular Descriptors which were generated from SMILES strings. Missing value imputation was applied to this dataset (By choosing the Median).",
    "description_version": "1",
    "file_id": "3340022",
    "format": "ARFF",
    "id": "27772",
    "licence": "Public",
    "md5_checksum": "1b73faded91aa6c5dec1511a2a6622ab",
    "minio_url": "https://data.openml.org/datasets/0002/27772/dataset_27772.pq",
    "name": "QSAR-DATASET-FOR-DRUG-TARGET-CHEMBL3263",
    "original_data_url": "https://www.ebi.ac.uk/chembl/target/inspect/CHEMBL3263",
    "parquet_url": "https://data.openml.org/datasets/0002/27772/dataset_27772.pq",
    "processing_date": "2018-10-04 00:28:04",
    "row_id_attribute": "molecule_id",
    "status": "deactivated",
    "tag": [
      "MetaQSAR",
      "study_13"
    ],
    "upload_date": "2016-07-14T22:22:00",
    "url": "https://api.openml.org/data/v1/download/3340022/QSAR-DATASET-FOR-DRUG-TARGET-CHEMBL3263.arff",
    "version": "7",
    "visibility": "public"
  }
}