"molecule_id","AMW","C.","H.","Me","Mi","Mp","Mv","MW","N.","nAB","nAT","nB","nBM","nBO","nBR","nBT","nC","nCL","nCsp","nCsp2","nCsp3","nDB","nF","nH","nHet","nHM","nI","nN","nO","nP","nS","nSK","nTB","nX","O.","RBF","RBN","SCBO","Se","Si","Sp","Sv","X.","pXC50"
{1 7.064,2 33.3,3 50,4 1.016,5 1.143,6 0.609,7 0.587,8 635.8,9 5.6,10 6,11 90,13 10,14 48,16 93,17 30,20 11,21 19,22 4,24 45,25 15,28 5,29 10,32 45,35 11.1,36 0.161,37 15,38 55,39 91.454,40 102.89,41 54.801,42 52.791,44 4.337}
{0 CHEMBL1095316,1 6.694,2 30.4,3 53.3,4 1.013,5 1.149,6 0.59,7 0.564,8 615.82,9 5.4,11 92,13 4,14 45,16 94,17 28,20 5,21 23,22 4,24 49,25 15,28 5,29 10,32 43,35 10.9,36 0.191,37 18,38 49,39 93.221,40 105.72,41 54.324,42 51.845,44 4.745}
{0 CHEMBL1095317,1 7.009,2 31.1,3 51.1,4 1.021,5 1.147,6 0.594,7 0.575,8 630.78,9 4.4,11 90,13 5,14 46,16 92,17 28,20 6,21 22,22 5,24 46,25 16,28 4,29 12,32 44,35 13.3,36 0.196,37 18,38 51,39 91.89,40 103.225,41 53.466,42 51.726,44 4.201}
{0 CHEMBL1095319,1 6.946,2 30.5,3 51.6,4 1.02,5 1.149,6 0.592,7 0.571,8 659.83,9 5.3,11 95,13 5,14 48,16 97,17 29,20 6,21 23,22 5,24 49,25 17,28 5,29 12,32 46,35 12.6,36 0.196,37 19,38 53,39 96.876,40 109.139,41 56.233,42 54.274,44 4.444}
{0 CHEMBL1095320,1 7.31,2 33.3,3 48.4,4 1.023,5 1.143,6 0.61,7 0.594,8 679.81,9 5.4,10 6,11 93,13 11,14 51,16 96,17 31,20 12,21 19,22 5,24 45,25 17,28 5,29 12,32 48,35 12.9,36 0.167,37 16,38 59,39 95.109,40 106.308,41 56.71,42 55.221,44 4.125}
{0 CHEMBL1780207,1 6.778,2 30.8,3 52.7,4 1.016,5 1.148,6 0.591,7 0.566,8 616.8,9 4.4,11 91,13 4,14 45,16 93,17 28,20 5,21 23,22 4,24 48,25 15,28 4,29 11,32 43,35 12.1,36 0.204,37 19,38 49,39 92.447,40 104.431,41 53.773,42 51.538,44 5.301}
{0 CHEMBL1780216,1 7.329,2 29.6,3 48.8,4 1.028,5 1.154,6 0.595,7 0.583,8 916.09,9 8.8,11 125,13 9,14 67,16 128,17 37,20 10,21 27,22 9,24 61,25 27,28 11,29 16,32 64,35 12.8,36 0.172,37 22,38 76,39 128.447,40 144.212,41 74.37,42 72.842,44 8.119}
{0 CHEMBL1780217,1 7.329,2 29.6,3 48.8,4 1.028,5 1.154,6 0.595,7 0.583,8 916.09,9 8.8,11 125,13 9,14 67,16 128,17 37,20 10,21 27,22 9,24 61,25 27,28 11,29 16,32 64,35 12.8,36 0.172,37 22,38 76,39 128.447,40 144.212,41 74.37,42 72.842,44 7.31}
{0 CHEMBL1780218,1 6.775,2 30.4,3 52.5,4 1.014,5 1.15,6 0.593,7 0.567,8 1070.42,9 7,11 158,13 9,14 78,16 161,17 48,20 10,21 38,22 9,24 83,25 27,28 11,29 16,32 75,35 10.1,36 0.211,37 34,38 87,39 160.166,40 181.779,41 93.745,42 89.637,44 6.607}
{0 CHEMBL1780219,1 6.775,2 30.4,3 52.5,4 1.014,5 1.15,6 0.593,7 0.567,8 1070.42,9 7,11 158,13 9,14 78,16 161,17 48,20 10,21 38,22 9,24 83,25 27,28 11,29 16,32 75,35 10.1,36 0.211,37 34,38 87,39 160.166,40 181.779,41 93.745,42 89.637,44 6.156}
