"molecule_id","FCFP4_1024b904","FCFP4_1024b537","FCFP4_1024b793","FCFP4_1024b971","FCFP4_1024b298","FCFP4_1024b937","FCFP4_1024b107","FCFP4_1024b54","FCFP4_1024b138","FCFP4_1024b152","FCFP4_1024b584","FCFP4_1024b672","FCFP4_1024b745","FCFP4_1024b79","FCFP4_1024b911","FCFP4_1024b259","FCFP4_1024b12","FCFP4_1024b562","FCFP4_1024b815","FCFP4_1024b827","FCFP4_1024b264","FCFP4_1024b363","FCFP4_1024b986","FCFP4_1024b376","FCFP4_1024b412","FCFP4_1024b669","FCFP4_1024b880","FCFP4_1024b1","FCFP4_1024b10","FCFP4_1024b100","FCFP4_1024b1000","FCFP4_1024b1001","FCFP4_1024b1002","FCFP4_1024b1003","FCFP4_1024b1004","FCFP4_1024b1005","FCFP4_1024b1006","FCFP4_1024b1007","FCFP4_1024b1008","FCFP4_1024b1009","FCFP4_1024b101","FCFP4_1024b1010","FCFP4_1024b1011","FCFP4_1024b1012","FCFP4_1024b1013","FCFP4_1024b1014","FCFP4_1024b1015","FCFP4_1024b1016","FCFP4_1024b1017","FCFP4_1024b1018","FCFP4_1024b1019","FCFP4_1024b102","FCFP4_1024b1020","FCFP4_1024b1021","FCFP4_1024b1022","FCFP4_1024b1023","FCFP4_1024b1024","FCFP4_1024b103","FCFP4_1024b104","FCFP4_1024b105","FCFP4_1024b106","FCFP4_1024b108","FCFP4_1024b109","FCFP4_1024b11","FCFP4_1024b110","FCFP4_1024b111","FCFP4_1024b112","FCFP4_1024b113","FCFP4_1024b114","FCFP4_1024b115","FCFP4_1024b116","FCFP4_1024b117","FCFP4_1024b118","FCFP4_1024b119","FCFP4_1024b120","FCFP4_1024b121","FCFP4_1024b122","FCFP4_1024b123","FCFP4_1024b124","FCFP4_1024b125","FCFP4_1024b126","FCFP4_1024b127","FCFP4_1024b128","FCFP4_1024b129","FCFP4_1024b13","FCFP4_1024b130","FCFP4_1024b131","FCFP4_1024b132","FCFP4_1024b133","FCFP4_1024b134","FCFP4_1024b135","FCFP4_1024b136","FCFP4_1024b137","FCFP4_1024b139","FCFP4_1024b14","FCFP4_1024b140","FCFP4_1024b141","FCFP4_1024b142","FCFP4_1024b143","FCFP4_1024b144","FCFP4_1024b145","FCFP4_1024b146","FCFP4_1024b147","FCFP4_1024b148","FCFP4_1024b149","FCFP4_1024b15","FCFP4_1024b150","FCFP4_1024b151","FCFP4_1024b153","FCFP4_1024b154","FCFP4_1024b155","FCFP4_1024b156","FCFP4_1024b157","FCFP4_1024b158","FCFP4_1024b159","FCFP4_1024b16","FCFP4_1024b160","FCFP4_1024b161","FCFP4_1024b162","FCFP4_1024b163","FCFP4_1024b164","FCFP4_1024b165","FCFP4_1024b166","FCFP4_1024b167","FCFP4_1024b168","FCFP4_1024b169","FCFP4_1024b17","FCFP4_1024b170","FCFP4_1024b171","FCFP4_1024b172","FCFP4_1024b173","FCFP4_1024b174","FCFP4_1024b175","FCFP4_1024b176","FCFP4_1024b177","FCFP4_1024b178","FCFP4_1024b179","FCFP4_1024b18","FCFP4_1024b180","FCFP4_1024b181","FCFP4_1024b182","FCFP4_1024b183","FCFP4_1024b184","FCFP4_1024b185","FCFP4_1024b186","FCFP4_1024b187","FCFP4_1024b188","FCFP4_1024b189","FCFP4_1024b19","FCFP4_1024b190","FCFP4_1024b191","FCFP4_1024b192","FCFP4_1024b193","FCFP4_1024b194","FCFP4_1024b195","FCFP4_1024b196","FCFP4_1024b197","FCFP4_1024b198","FCFP4_1024b199","FCFP4_1024b2","FCFP4_1024b20","FCFP4_1024b200","FCFP4_1024b201","FCFP4_1024b202","FCFP4_1024b203","FCFP4_1024b204","FCFP4_1024b205","FCFP4_1024b206","FCFP4_1024b207","FCFP4_1024b208","FCFP4_1024b209","FCFP4_1024b21","FCFP4_1024b210","FCFP4_1024b211","FCFP4_1024b212","FCFP4_1024b213","FCFP4_1024b214","FCFP4_1024b215","FCFP4_1024b216","FCFP4_1024b217","FCFP4_1024b218","FCFP4_1024b219","FCFP4_1024b22","FCFP4_1024b220","FCFP4_1024b221","FCFP4_1024b222","FCFP4_1024b223","FCFP4_1024b224","FCFP4_1024b225","FCFP4_1024b226","FCFP4_1024b227","FCFP4_1024b228","FCFP4_1024b229","FCFP4_1024b23","FCFP4_1024b230","FCFP4_1024b231","FCFP4_1024b232","FCFP4_1024b233","FCFP4_1024b234","FCFP4_1024b235","FCFP4_1024b236","FCFP4_1024b237","FCFP4_1024b238","FCFP4_1024b239","FCFP4_1024b24","pXC50"
{23 1,28 1,62 1,136 1,160 1,178 1,206 5.538}
{0 CHEMBL12358,1 1,2 1,3 1,4 1,7 1,8 1,9 1,10 1,11 1,12 1,13 1,14 1,15 1,16 1,17 1,18 1,19 1,20 1,21 1,22 1,23 1,24 1,25 1,26 1,27 1,28 1,68 1,127 1,128 1,138 1,160 1,206 5.319}
{0 CHEMBL12448,1 1,2 1,3 1,4 1,7 1,8 1,9 1,10 1,11 1,12 1,13 1,14 1,15 1,16 1,17 1,18 1,19 1,20 1,23 1,24 1,25 1,26 1,28 1,127 1,128 1,138 1,160 1,206 5.824}
{0 CHEMBL12510,1 1,2 1,3 1,4 1,7 1,8 1,9 1,10 1,11 1,12 1,13 1,14 1,15 1,16 1,17 1,18 1,19 1,20 1,21 1,22 1,23 1,24 1,25 1,26 1,27 1,28 1,127 1,128 1,138 1,160 1,206 5.469}
{0 CHEMBL126035,28 1,38 1,127 1,128 1,138 1,160 1,201 1,206 4.706}
{0 CHEMBL12696,1 1,2 1,3 1,4 1,7 1,8 1,9 1,10 1,11 1,12 1,13 1,14 1,15 1,16 1,17 1,18 1,19 1,20 1,21 1,22 1,23 1,24 1,25 1,26 1,27 1,28 1,94 1,127 1,128 1,138 1,160 1,206 6.959}
{0 CHEMBL12730,1 1,2 1,3 1,4 1,127 1,128 1,136 1,138 1,160 1,206 5.31}
{0 CHEMBL12761,1 1,2 1,3 1,4 1,7 1,8 1,9 1,10 1,11 1,12 1,13 1,14 1,15 1,16 1,21 1,22 1,23 1,24 1,25 1,26 1,27 1,28 1,127 1,128 1,136 1,138 1,160 1,206 5.585}
{0 CHEMBL12989,1 1,2 1,3 1,4 1,7 1,8 1,9 1,10 1,11 1,12 1,13 1,14 1,15 1,16 1,17 1,18 1,19 1,20 1,21 1,22 1,23 1,24 1,25 1,26 1,27 1,28 1,127 1,128 1,138 1,160 1,171 1,206 5.777}
{0 CHEMBL130213,28 1,38 1,127 1,128 1,138 1,160 1,206 4.487}
{0 CHEMBL13076,1 1,2 1,3 1,4 1,7 1,8 1,9 1,10 1,11 1,12 1,13 1,14 1,15 1,16 1,17 1,18 1,19 1,20 1,21 1,22 1,23 1,24 1,25 1,26 1,27 1,28 1,127 1,128 1,136 1,138 1,160 1,206 7.155}
{0 CHEMBL13260,1 1,4 1,75 1,89 1,127 1,128 1,136 1,138 1,160 1,206 5.319}
{0 CHEMBL13378,5 1,6 1,28 1,127 1,138 1,160 1,206 4.167}
{0 CHEMBL222519,28 1,127 1,128 1,136 1,138 1,160 1,206 5.341}
{0 CHEMBL268284,1 1,2 1,3 1,4 1,7 1,8 1,9 1,10 1,11 1,12 1,13 1,14 1,15 1,16 1,23 1,24 1,25 1,26 1,28 1,127 1,128 1,136 1,138 1,160 1,206 6.387}
{0 CHEMBL268709,1 1,2 1,3 1,4 1,7 1,8 1,21 1,22 1,27 1,28 1,127 1,128 1,136 1,138 1,160 1,206 5.554}
{0 CHEMBL273675,1 1,2 1,3 1,4 1,7 1,8 1,9 1,10 1,11 1,12 1,13 1,14 1,15 1,16 1,17 1,18 1,19 1,20 1,21 1,22 1,23 1,24 1,25 1,26 1,27 1,28 1,127 1,128 1,138 1,160 1,206 6.959}
{0 CHEMBL275334,1 1,2 1,3 1,4 1,7 1,8 1,9 1,10 1,11 1,12 1,13 1,14 1,15 1,16 1,17 1,18 1,19 1,20 1,21 1,22 1,23 1,24 1,25 1,26 1,27 1,28 1,127 1,128 1,138 1,160 1,206 5.481}
{0 CHEMBL293613,1 1,2 1,3 1,4 1,7 1,8 1,9 1,10 1,11 1,12 1,13 1,14 1,15 1,16 1,23 1,24 1,25 1,26 1,27 1,28 1,42 1,127 1,128 1,136 1,138 1,160 1,206 5.229}
{0 CHEMBL305534,1 1,2 1,3 1,4 1,7 1,8 1,9 1,10 1,11 1,12 1,13 1,14 1,15 1,23 1,24 1,25 1,26 1,28 1,127 1,128 1,136 1,138 1,160 1,186 1,206 5.284}
{0 CHEMBL308941,5 1,6 1,28 1,118 1,127 1,138 1,160 1,161 1,206 4.498}
{0 CHEMBL309831,1 1,2 1,3 1,4 1,7 1,8 1,9 1,10 1,11 1,12 1,13 1,14 1,15 1,16 1,17 1,18 1,19 1,20 1,21 1,22 1,23 1,24 1,25 1,26 1,27 1,28 1,42 1,127 1,128 1,138 1,160 1,206 5.444}
{0 CHEMBL310503,1 1,2 1,3 1,4 1,7 1,8 1,9 1,10 1,11 1,12 1,13 1,14 1,15 1,16 1,17 1,18 1,19 1,20 1,21 1,22 1,23 1,24 1,25 1,26 1,27 1,28 1,42 1,127 1,128 1,138 1,160 1,206 5.174}
{0 CHEMBL310897,4 1,5 1,6 1,28 1,89 1,127 1,138 1,160 1,200 1,206 5.31}
{0 CHEMBL314248,1 1,2 1,3 1,4 1,7 1,8 1,9 1,10 1,11 1,12 1,13 1,14 1,15 1,16 1,17 1,18 1,19 1,20 1,23 1,24 1,25 1,26 1,27 1,28 1,42 1,127 1,128 1,138 1,160 1,206 5.244}
{0 CHEMBL317790,5 1,6 1,28 1,127 1,138 1,160 1,165 1,200 1,206 4}
{0 CHEMBL318467,5 1,6 1,28 1,31 1,127 1,138 1,160 1,161 1,200 1,206 4.237}
{0 CHEMBL328310,5 1,6 1,28 1,44 1,104 1,127 1,138 1,160 1,200 1,206 4.796}
{0 CHEMBL423201,5 1,6 1,28 1,118 1,127 1,138 1,160 1,161 1,206 4}
{0 CHEMBL426317,16 1,23 1,24 1,25 1,26 1,28 1,29 1,34 1,39 1,83 1,127 1,128 1,140 1,144 1,160 1,206 5}
{0 CHEMBL441460,5 1,6 1,28 1,104 1,127 1,138 1,154 1,160 1,200 1,206 4}
{0 CHEMBL50267,28 1,38 1,61 1,127 1,128 1,138 1,160 1,206 4}
{0 CHEMBL72123,5 1,6 1,28 1,73 1,118 1,127 1,138 1,160 1,161 1,206 4}
{0 CHEMBL79454,1 1,2 1,3 1,4 1,27 1,28 1,42 1,127 1,128 1,136 1,138 1,160 1,206 5.301}
{0 CHEMBL82375,1 1,2 1,3 1,4 1,7 1,8 1,9 1,10 1,11 1,12 1,13 1,14 1,15 1,16 1,17 1,18 1,19 1,20 1,21 1,22 1,23 1,24 1,25 1,26 1,27 1,28 1,127 1,128 1,138 1,160 1,206 5.921}
{0 CHEMBL84142,1 1,2 1,3 1,4 1,7 1,8 1,9 1,10 1,11 1,12 1,13 1,14 1,15 1,16 1,17 1,18 1,19 1,20 1,21 1,22 1,23 1,24 1,25 1,26 1,27 1,28 1,127 1,128 1,138 1,160 1,206 6.155}
{0 CHEMBL86313,21 1,22 1,28 1,38 1,59 1,127 1,128 1,138 1,160 1,182 1,206 5.569}
{0 CHEMBL94859,5 1,6 1,28 1,127 1,138 1,145 1,160 1,165 1,200 1,206 4.387}
{0 CHEMBL94860,5 1,6 1,28 1,127 1,132 1,138 1,160 1,161 1,193 1,200 1,206 4}
{0 CHEMBL97742,4 1,5 1,6 1,28 1,127 1,131 1,138 1,159 1,160 1,161 1,206 4}
{0 CHEMBL98723,4 1,5 1,6 1,28 1,89 1,127 1,135 1,138 1,160 1,200 1,206 4.131}
{0 CHEMBL99012,1 1,2 1,3 1,4 1,7 1,8 1,9 1,10 1,11 1,12 1,13 1,14 1,15 1,23 1,24 1,25 1,26 1,28 1,122 1,127 1,128 1,136 1,138 1,160 1,186 1,206 5.071}
