"molecule_id","nH","Se","Si","MW","pXC50"
{1 30,2 55.891,3 63.275,4 362.51,5 5.444}
{0 CHEMBL107878,1 18,2 35.36,3 39.807,4 259.76,5 4.783}
{0 CHEMBL108042,1 29,2 53.781,3 61.149,4 347.5,5 4.845}
{0 CHEMBL108427,1 17,2 33.153,3 37.448,4 223.3,5 5.004}
{0 CHEMBL108485,1 19,2 40.363,3 45.073,4 289.36,5 4.67}
{0 CHEMBL108537,1 32,2 62.851,3 70.61,4 444.64,5 4.987}
{0 CHEMBL108542,1 28,2 49.352,3 56.441,4 304.47,5 4.812}
{0 CHEMBL108560,1 32,2 61.101,3 68.9,4 404.55,5 5.569}
{0 CHEMBL109356,1 30,2 55.967,3 63.195,4 382.57,5 5.076}
{0 CHEMBL109492,1 21,2 42.92,3 48.279,4 299.4,5 5.553}
{0 CHEMBL110573,1 15,2 29.942,3 33.824,4 205.28,5 4.469}
{0 CHEMBL110950,1 31,2 58.992,3 66.773,4 389.54,5 5.585}
{0 CHEMBL111221,1 32,2 61.2,3 69.133,4 426,5 5.076}
{0 CHEMBL111424,1 15,2 36.8,3 40.336,4 328.21,5 4.499}
{0 CHEMBL111446,1 23,2 47.131,3 52.903,4 329.43,5 4.59}
{0 CHEMBL111742,1 32,2 61.178,3 68.82,4 424.61,5 5.585}
{0 CHEMBL152397,1 34,2 74.952,3 83.687,4 550.67,5 5.77}
{0 CHEMBL155256,1 38,2 72.36,3 82.68,4 478.64,5 6.222}
{0 CHEMBL320089,1 29,2 55.781,3 63.149,4 371.52,5 4.611}
{0 CHEMBL320265,1 17,2 33.153,3 37.448,4 223.3,5 4.143}
{0 CHEMBL320506,1 22,2 45.127,3 50.638,4 335.86,5 5.155}
{0 CHEMBL323217,1 18,2 35.36,3 39.807,4 259.76,5 4.493}
{0 CHEMBL323490,1 17,2 36.153,3 40.448,4 259.33,5 5.347}
{0 CHEMBL325765,1 24,2 49.338,3 55.262,4 365.89,5 4.475}
{0 CHEMBL349996,1 46,2 98.221,3 110.55,4 706.89,5 7.538}
{0 CHEMBL408877,1 141,2 274.682,3 314.717,4 1869.59,5 7.602}
{0 CHEMBL427409,1 26,2 49.091,3 55.817,4 322.42,5 4.553}
{0 CHEMBL90511,1 32,2 61.178,3 68.82,4 424.61,5 5.585}
{0 CHEMBL91094,1 30,2 55.967,3 63.195,4 382.57,5 5.076}
{0 CHEMBL91210,1 31,2 58.992,3 66.773,4 389.54,5 5.585}
{0 CHEMBL91609,1 10,2 28.491,3 31.309,4 259.71,5 5.398}
{0 CHEMBL92554,1 29,2 53.781,3 61.149,4 347.5,5 4.845}
