{
  "data_set_description": {
    "collection_date": "November 2013",
    "creator": "Dr Jeremy Besnard, Dr Ivan Olier, Dr Noureddin Sadawi, Dr Larisa Soldatova, Dr Crina Grosan, Prof Ross King, Dr Richard Bickerton, Prof Andrew Hopkins and Dr Willem van Hoorn",
    "default_target_attribute": "pXC50",
    "description": "This dataset contains QSAR data (from ChEMBL version 17) showing activity values (unit is pseudo-pCI50) of several compounds on drug target ChEMBL_ID: CHEMBL1741213 (TID: 104009), and it has 993 rows and 1379 features (not including molecule IDs and class feature: molecule_id and pXC50). The features represent Molecular Descriptors which were generated from SMILES strings. Missing value imputation was applied to this dataset (By choosing the Median).",
    "description_version": "1",
    "file_id": "3338569",
    "format": "ARFF",
    "id": "27721",
    "licence": "Public",
    "md5_checksum": "bd9872dbfe5031f0543a2b3fd7ea5531",
    "minio_url": "https://data.openml.org/datasets/0002/27721/dataset_27721.pq",
    "name": "QSAR-DATASET-FOR-DRUG-TARGET-CHEMBL1741213",
    "original_data_url": "https://www.ebi.ac.uk/chembl/target/inspect/CHEMBL1741213",
    "parquet_url": "https://data.openml.org/datasets/0002/27721/dataset_27721.pq",
    "processing_date": "2018-10-04 00:24:16",
    "row_id_attribute": "molecule_id",
    "status": "deactivated",
    "tag": [
      "MetaQSAR",
      "study_13"
    ],
    "upload_date": "2016-07-14T22:14:49",
    "url": "https://api.openml.org/data/v1/download/3338569/QSAR-DATASET-FOR-DRUG-TARGET-CHEMBL1741213.arff",
    "version": "8",
    "visibility": "public"
  }
}