"molecule_id","AMW","C.","H.","Me","Mi","Mp","Mv","MW","N.","nAB","nAT","nB","nBM","nBO","nBR","nBT","nC","nCL","nCsp","nCsp2","nCsp3","nDB","nF","nH","nHet","nHM","nI","nN","nO","nP","nS","nSK","nTB","nX","O.","RBF","RBN","SCBO","Se","Si","Sp","Sv","X.","pXC50"
{1 11.57,2 25.8,3 25.8,4 1.102,5 1.152,6 0.676,7 0.7,8 717.31,9 12.9,10 10,11 62,13 21,14 50,16 66,17 16,20 10,21 6,22 11,24 16,25 30,26 3,28 8,29 19,30 3,32 46,35 30.6,36 0.152,37 10,38 66,39 68.317,40 71.42,41 41.914,42 43.421,44 4.818}
{0 CHEMBL129841,1 9.665,2 25,3 38.6,4 1.059,5 1.153,6 0.655,7 0.638,8 425.27,9 11.4,10 10,11 44,13 12,14 29,16 46,17 11,20 5,21 6,22 2,24 17,25 16,26 2,28 5,29 9,30 2,32 27,35 20.5,36 0.152,37 7,38 36,39 46.589,40 50.73,41 28.812,42 28.075,44 4.888}
{0 CHEMBL130094,1 8.277,2 28.6,3 46.4,4 1.028,5 1.146,6 0.641,7 0.607,8 463.51,9 8.9,10 10,11 56,13 11,14 32,16 58,17 16,20 5,21 11,22 1,24 26,25 14,26 2,28 5,29 7,30 1,31 1,32 30,35 12.5,36 0.172,37 10,38 38,39 57.571,40 64.168,41 35.915,42 34.016,44 6.456}
{0 CHEMBL130916,1 10.933,2 23.8,3 32.1,4 1.085,5 1.15,6 0.673,7 0.67,8 918.4,9 9.5,10 20,11 84,13 25,14 62,16 89,17 20,20 10,21 10,22 5,24 27,25 37,26 5,28 8,29 24,30 5,32 57,35 28.6,36 0.18,37 16,38 77,39 91.146,40 96.613,41 56.499,42 56.266,44 5.553}
{0 CHEMBL131890,1 11.134,2 21.3,3 34,4 1.077,5 1.149,6 0.692,7 0.667,8 523.29,9 10.6,10 10,11 47,13 13,14 33,16 49,17 10,20 5,21 5,22 3,24 16,25 21,26 4,28 5,29 12,30 3,31 1,32 31,35 25.5,36 0.163,37 8,38 41,39 50.622,40 54.002,41 32.505,42 31.33,44 6.161}
{0 CHEMBL132722,1 10.311,2 22.4,3 36.7,4 1.07,5 1.153,6 0.666,7 0.646,8 505.25,9 10.2,10 10,11 49,13 13,14 33,16 51,17 11,20 5,21 6,22 3,24 18,25 20,26 3,28 5,29 12,30 3,32 31,35 24.5,36 0.157,37 8,38 41,39 52.429,40 56.497,41 32.619,42 31.67,44 6.131}
{0 CHEMBL133463,1 10.311,2 22.4,3 36.7,4 1.07,5 1.153,6 0.666,7 0.646,8 505.25,9 10.2,10 10,11 49,13 13,14 33,16 51,17 11,20 5,21 6,22 3,24 18,25 20,26 3,28 5,29 12,30 3,32 31,35 24.5,36 0.157,37 8,38 41,39 52.429,40 56.497,41 32.619,42 31.67,44 5.036}
{0 CHEMBL133930,1 11.962,2 42.1,3 26.3,4 1.053,5 1.095,6 0.799,7 0.768,8 454.56,9 5.3,10 12,11 38,13 21,14 29,16 39,17 16,19 2,20 14,22 9,24 10,25 12,26 4,28 2,29 6,31 4,32 28,35 15.8,36 0.154,37 6,38 44,39 40.007,40 41.594,41 30.375,42 29.187,44 4.48}
{0 CHEMBL14249,1 10.792,2 21.3,3 34,4 1.082,5 1.155,6 0.666,7 0.657,8 507.22,9 10.6,10 10,11 47,13 13,14 33,16 49,17 10,20 5,21 5,22 3,24 16,25 21,26 3,28 5,29 13,30 3,32 31,35 27.7,36 0.163,37 8,38 41,39 50.873,40 54.291,41 31.312,42 30.858,44 6.469}
{0 CHEMBL14830,1 10.172,2 23.8,3 35.7,4 1.072,5 1.155,6 0.655,7 0.649,8 427.24,9 11.9,10 10,11 42,13 12,14 29,16 44,17 10,20 5,21 5,22 2,24 15,25 17,26 2,28 5,29 10,30 2,32 27,35 23.8,36 0.136,37 6,38 36,39 45.033,40 48.524,41 27.506,42 27.263,44 4}
{0 CHEMBL190141,1 7.302,2 37.5,3 48.6,4 1.002,5 1.132,6 0.652,7 0.612,8 525.74,9 6.9,10 15,11 72,13 17,14 41,16 76,17 27,20 12,21 15,22 2,24 35,25 10,26 1,28 5,29 4,31 1,32 37,35 5.6,36 0.145,37 11,38 50.5,39 72.149,40 81.477,41 46.915,42 44.055,44 4}
{0 CHEMBL2010928,1 7.155,2 41.9,3 46.8,4 0.996,5 1.127,6 0.662,7 0.627,8 443.6,9 8.1,10 18,11 62,13 19,14 37,16 66,17 26,20 17,21 9,22 1,24 29,25 7,28 5,29 2,32 33,35 3.2,36 0.091,37 6,38 47,39 61.767,40 69.893,41 41.074,42 38.858,44 5.866}
{0 CHEMBL2010929,1 7.026,2 41.3,3 47.6,4 0.993,5 1.13,6 0.661,7 0.622,8 442.62,9 9.5,10 18,11 63,13 19,14 37,16 67,17 26,20 17,21 9,22 1,24 30,25 7,28 6,29 1,32 33,35 1.6,36 0.09,37 6,38 47,39 62.541,40 71.182,41 41.625,42 39.165,44 6.209}
{0 CHEMBL2010930,1 7.127,2 41.2,3 47.1,4 0.996,5 1.13,6 0.659,7 0.624,8 484.66,9 8.8,10 18,11 68,13 20,14 40,16 72,17 28,20 18,21 10,22 2,24 32,25 8,28 6,29 2,32 36,35 2.9,36 0.097,37 7,38 51,39 67.752,40 76.806,41 44.841,42 42.406,44 6.485}
{0 CHEMBL2010931,1 7.075,2 41,3 47.5,4 0.996,5 1.129,6 0.657,7 0.621,8 431.59,9 8.2,10 18,11 61,13 19,14 35,16 64,17 25,20 17,21 8,22 1,24 29,25 7,28 5,29 2,32 32,35 3.3,36 0.141,37 9,38 45,39 60.767,40 68.893,41 40.074,42 37.858,44 6.593}
{0 CHEMBL2010932,1 6.919,2 40.9,3 48.5,4 0.991,5 1.13,6 0.657,7 0.617,8 456.65,9 9.1,10 18,11 66,13 19,14 38,16 70,17 27,20 17,21 10,22 1,24 32,25 7,28 6,29 1,32 34,35 1.5,36 0.086,37 6,38 48,39 65.425,40 74.597,41 43.387,42 40.692,44 5.711}
{0 CHEMBL2010933,1 7.127,2 41.2,3 47.1,4 0.996,5 1.13,6 0.659,7 0.624,8 484.66,9 8.8,10 18,11 68,13 20,14 40,16 72,17 28,20 18,21 10,22 2,24 32,25 8,28 6,29 2,32 36,35 2.9,36 0.083,37 6,38 51,39 67.752,40 76.806,41 44.841,42 42.406,44 6.572}
{0 CHEMBL2011102,1 7.547,2 39.1,3 46.4,4 1.002,5 1.13,6 0.666,7 0.628,8 520.72,9 8.7,10 18,11 69,13 21,14 41,16 73,17 27,20 17,21 10,22 3,24 32,25 10,26 1,28 6,29 3,31 1,32 37,35 4.3,36 0.096,37 7,38 53,39 69.156,40 77.936,41 45.944,42 43.308,44 6.4}
{0 CHEMBL2011103,1 6.944,2 39.5,3 48.7,4 0.995,5 1.133,6 0.65,7 0.612,8 527.74,9 9.2,10 18,11 76,13 20,14 43,16 80,17 30,20 18,21 12,22 2,24 37,25 9,28 7,29 2,32 39,35 2.6,36 0.1,37 8,38 54,39 75.621,40 86.135,41 49.37,42 46.481,44 6.357}
{0 CHEMBL2011104,1 6.944,2 39.5,3 48.7,4 0.995,5 1.133,6 0.65,7 0.612,8 527.74,9 9.2,10 18,11 76,13 20,14 43,16 80,17 30,20 18,21 12,22 2,24 37,25 9,28 7,29 2,32 39,35 2.6,36 0.1,37 8,38 54,39 75.621,40 86.135,41 49.37,42 46.481,44 5.245}
{0 CHEMBL2011105,1 7.044,2 37.9,3 48.3,4 1,5 1.138,6 0.643,7 0.61,8 408.56,9 10.3,10 12,11 58,13 14,14 33,16 61,17 22,20 12,21 10,22 2,24 28,25 8,28 6,29 2,32 30,35 3.4,36 0.082,37 5,38 41,39 57.985,40 65.976,41 37.319,42 35.353,44 4.523}
{0 CHEMBL2011106,1 6.928,2 37.7,3 49.2,4 0.998,5 1.138,6 0.641,7 0.605,8 422.59,9 9.8,10 12,11 61,13 14,14 34,16 64,17 23,20 12,21 11,22 2,24 30,25 8,28 6,29 2,32 31,35 3.3,36 0.094,37 6,38 42,39 60.869,40 69.391,41 39.08,42 36.88,44 4.855}
{0 CHEMBL2011107,1 7.492,2 37.7,3 47.5,4 1.003,5 1.137,6 0.655,7 0.618,8 457.03,9 9.8,10 12,11 61,13 14,14 35,16 64,17 23,18 1,20 12,21 11,22 2,24 29,25 9,26 1,28 6,29 2,32 32,34 1,35 3.3,36 0.094,37 6,38 43,39 61.192,40 69.335,41 39.938,42 37.707,43 1.6,44 5.779}
{0 CHEMBL2011108,1 6.822,2 37.5,3 50,4 0.996,5 1.138,6 0.638,7 0.6,8 436.62,9 9.4,10 12,11 64,13 14,14 35,16 67,17 24,20 12,21 12,22 2,24 32,25 8,28 6,29 2,32 32,35 3.1,36 0.09,37 6,38 43,39 63.752,40 72.806,41 40.841,42 38.406,44 5.882}
{0 CHEMBL2011109,1 7.36,2 37.5,3 48.4,4 1.001,5 1.137,6 0.652,7 0.613,8 471.06,9 9.4,10 12,11 64,13 14,14 36,16 67,17 24,18 1,20 12,21 12,22 2,24 31,25 9,26 1,28 6,29 2,32 33,34 1,35 3.1,36 0.09,37 6,38 44,39 64.076,40 72.75,41 41.699,42 39.234,43 1.6,44 6.356}
{0 CHEMBL2011110,1 7.24,2 37.3,3 49.3,4 0.999,5 1.137,6 0.649,7 0.608,8 485.09,9 9,10 12,11 67,13 14,14 37,16 70,17 25,18 1,20 12,21 13,22 2,24 33,25 9,26 1,28 6,29 2,32 34,34 1,35 3,36 0.086,37 6,38 45,39 66.96,40 76.165,41 43.461,42 40.761,43 1.5,44 5.687}
{0 CHEMBL2011111,1 7.31,2 38.2,3 48.5,4 0.999,5 1.135,6 0.654,7 0.614,8 497.1,9 8.8,10 12,11 68,13 14,14 39,16 72,17 26,18 1,20 12,21 14,22 2,24 33,25 9,26 1,28 6,29 2,32 35,34 1,35 2.9,36 0.083,37 6,38 47,39 67.96,40 77.165,41 44.461,42 41.761,43 1.5,44 6.582}
{0 CHEMBL2011112,1 7.24,2 37.3,3 49.3,4 0.999,5 1.137,6 0.649,7 0.608,8 485.09,9 9,10 12,11 67,13 14,14 37,16 70,17 25,18 1,20 12,21 13,22 2,24 33,25 9,26 1,28 6,29 2,32 34,34 1,35 3,36 0.086,37 6,38 45,39 66.96,40 76.165,41 43.461,42 40.761,43 1.5,44 7.215}
{0 CHEMBL2011113,1 7.638,2 37.9,3 46.6,4 1.005,5 1.137,6 0.658,7 0.624,8 443,9 10.3,10 12,11 58,13 14,14 34,16 61,17 22,18 1,20 12,21 10,22 2,24 27,25 9,26 1,28 6,29 2,32 31,34 1,35 3.4,36 0.082,37 5,38 42,39 58.309,40 65.92,41 38.176,42 36.18,43 1.7,44 5.375}
{0 CHEMBL2011114,1 7.812,2 37.7,3 44.3,4 1.023,5 1.154,6 0.638,7 0.623,8 476.56,9 9.8,10 12,11 61,13 14,14 37,16 64,17 23,20 12,21 11,22 2,23 3,24 27,25 11,28 6,29 2,32 34,34 3,35 3.3,36 0.078,37 5,38 45,39 62.407,40 70.41,41 38.892,42 38.029,43 4.9,44 5.896}
{0 CHEMBL2011115,1 7.945,2 37.1,3 43.5,4 1.028,5 1.155,6 0.635,7 0.625,8 492.56,9 9.7,10 12,11 62,13 14,14 38,16 65,17 23,20 12,21 11,22 2,23 3,24 27,25 12,28 6,29 3,32 35,34 3,35 4.8,36 0.092,37 6,38 46,39 63.734,40 71.62,41 39.347,42 38.744,43 4.8,44 6.489}
{0 CHEMBL2011116,1 7.918,2 36.4,3 43.9,4 1.029,5 1.155,6 0.63,7 0.621,8 522.59,9 9.1,10 12,11 66,13 14,14 40,16 69,17 24,20 12,21 12,22 2,23 3,24 29,25 13,28 6,29 4,32 37,34 3,35 6.1,36 0.101,37 7,38 48,39 67.945,40 76.244,41 41.563,42 40.986,43 4.5,44 7.174}
{0 CHEMBL2011117,1 6.822,2 37.5,3 50,4 0.996,5 1.138,6 0.638,7 0.6,8 436.62,9 9.4,10 12,11 64,13 14,14 35,16 67,17 24,20 12,21 12,22 2,24 32,25 8,28 6,29 2,32 32,35 3.1,36 0.075,37 5,38 43,39 63.752,40 72.806,41 40.841,42 38.406,44 6.213}
{0 CHEMBL2011118,1 7.794,2 36.9,3 44.6,4 1.025,5 1.154,6 0.632,7 0.62,8 506.59,9 9.2,10 12,11 65,13 14,14 39,16 68,17 24,20 12,21 12,22 2,23 3,24 29,25 12,28 6,29 3,32 36,34 3,35 4.6,36 0.088,37 6,38 47,39 66.618,40 75.035,41 41.108,42 40.271,43 4.6,44 7.194}
{0 CHEMBL2011119,1 6.963,2 36.9,3 49.2,4 1.001,5 1.139,6 0.635,7 0.602,8 452.62,9 9.2,10 12,11 65,13 14,14 36,16 68,17 24,20 12,21 12,22 2,24 32,25 9,28 6,29 3,32 33,35 4.6,36 0.088,37 6,38 44,39 65.08,40 74.016,41 41.296,42 39.121,44 5.598}
{0 CHEMBL2011120,1 6.862,2 36.8,3 50,4 0.999,5 1.139,6 0.633,7 0.598,8 466.65,9 8.8,10 12,11 68,13 14,14 37,16 71,17 25,20 12,21 13,22 2,24 34,25 9,28 6,29 3,32 34,35 4.4,36 0.099,37 7,38 45,39 67.963,40 77.431,41 43.057,42 40.648,44 7.161}
{0 CHEMBL2011121,1 6.77,2 36.6,3 50.7,4 0.998,5 1.139,6 0.631,7 0.594,8 480.68,9 8.5,10 12,11 71,13 14,14 38,16 74,17 26,20 12,21 14,22 2,24 36,25 9,28 6,29 3,32 35,35 4.2,36 0.108,37 8,38 46,39 70.847,40 80.846,41 44.819,42 42.175,44 6.674}
{0 CHEMBL2011122,1 7.656,2 36.8,3 45.6,4 1.022,5 1.154,6 0.63,7 0.615,8 520.62,9 8.8,10 12,11 68,13 14,14 40,16 71,17 25,20 12,21 13,22 2,23 3,24 31,25 12,28 6,29 3,32 37,34 3,35 4.4,36 0.099,37 7,38 48,39 69.501,40 78.45,41 42.87,42 41.798,43 4.4,44 6.939}
{0 CHEMBL2011123,1 7.127,2 36.8,3 48.5,4 1.007,5 1.144,6 0.632,7 0.603,8 484.64,9 8.8,10 12,11 68,13 14,14 38,16 71,17 25,20 12,21 13,22 2,23 1,24 33,25 10,28 6,29 3,32 35,34 1,35 4.4,36 0.099,37 7,38 46,39 68.476,40 77.771,41 42.995,42 41.031,43 1.5,44 7.42}
{0 CHEMBL2011124,1 7.248,2 35.8,3 47.8,4 1.01,5 1.147,6 0.63,7 0.605,8 485.63,9 10.4,10 12,11 67,13 14,14 38,16 70,17 24,20 11,21 13,22 2,23 1,24 32,25 11,28 7,29 3,32 35,34 1,35 4.5,36 0.1,37 7,38 46,39 67.694,40 76.854,41 42.239,42 40.526,43 1.5,44 6.283}
{0 CHEMBL2011125,1 7.295,2 39.7,3 46,4 1.001,5 1.135,6 0.656,7 0.625,8 459.61,9 11.1,10 17,11 63,13 19,14 38,16 67,17 25,20 15,21 10,22 2,24 29,25 9,28 7,29 2,32 34,35 3.2,36 0.075,37 5,38 48.5,39 63.087,40 71.474,41 41.324,42 39.374,44 7.62}
{0 CHEMBL2011126,1 7.295,2 39.7,3 46,4 1.001,5 1.135,6 0.656,7 0.625,8 459.61,9 11.1,10 17,11 63,13 19,14 38,16 67,17 25,20 15,21 10,22 2,24 29,25 9,28 7,29 2,32 34,35 3.2,36 0.075,37 5,38 48.5,39 63.087,40 71.474,41 41.324,42 39.374,44 7.62}
{0 CHEMBL2011127,1 7.176,2 39.4,3 47,4 1,5 1.135,6 0.653,7 0.62,8 473.64,9 10.6,10 17,11 66,13 19,14 39,16 70,17 26,20 15,21 11,22 2,24 31,25 9,28 7,29 2,32 35,35 3,36 0.071,37 5,38 49.5,39 65.97,40 74.889,41 43.086,42 40.901,44 7.658}
{0 CHEMBL216504,1 11.207,2 38,3 28.3,4 1.07,5 1.114,6 0.726,7 0.728,8 1031.07,9 4.3,10 34,11 92,13 49,14 71,16 97,17 35,20 35,22 15,24 26,25 31,26 6,28 4,29 21,31 6,32 66,35 22.8,36 0.124,37 12,38 103,39 98.459,40 102.478,41 66.829,42 67.014,44 4.545}
{0 CHEMBL2180136,1 7.695,2 45.7,3 42.9,4 1.008,5 1.115,6 0.677,7 0.653,8 269.32,9 2.9,10 12,11 35,13 13,14 22,16 37,17 16,20 13,21 3,22 1,24 15,25 4,28 1,29 3,32 20,35 8.6,36 0.054,37 2,38 29,39 35.269,40 39.033,41 23.699,42 22.853,44 5}
{0 CHEMBL2180137,1 8.137,2 51.3,3 38.5,4 1.007,5 1.103,6 0.71,7 0.689,8 317.36,9 2.6,10 18,11 39,13 19,14 27,16 42,17 20,20 19,21 1,22 1,24 15,25 4,28 1,29 3,32 24,35 7.7,36 0.071,37 3,38 37,39 39.269,40 43.033,41 27.699,42 26.853,44 5}
{0 CHEMBL2180138,1 7.89,2 50,3 40.5,4 1.004,5 1.106,6 0.701,7 0.676,8 331.39,9 2.4,10 18,11 42,13 19,14 28,16 45,17 21,20 19,21 2,22 1,24 17,25 4,28 1,29 3,32 25,35 7.1,36 0.067,37 3,38 38,39 42.153,40 46.448,41 29.46,42 28.38,44 5}
{0 CHEMBL2180149,1 7.418,2 53.1,3 42.9,4 0.985,5 1.099,6 0.716,7 0.674,8 363.48,9 2,10 24,11 49,13 24,14 32,16 53,17 26,20 24,21 2,24 21,25 2,28 1,29 1,32 28,35 2,36 0.057,37 3,38 44,39 48.265,40 53.86,41 35.074,42 33.004,44 6.368}
{0 CHEMBL2180160,1 8.652,2 48.7,3 38.5,4 1.009,5 1.101,6 0.727,7 0.693,8 337.42,9 2.6,10 18,11 39,13 20,14 27,16 42,17 19,20 18,21 1,22 2,24 15,25 5,26 1,28 1,29 3,31 1,32 24,35 7.7,36 0.048,37 2,38 38,39 39.345,40 42.953,41 28.347,42 27.041,44 5}
{0 CHEMBL2180171,1 7.684,2 48.8,3 41.9,4 0.998,5 1.11,6 0.698,7 0.667,8 330.41,9 4.7,10 18,11 43,13 19,14 28,16 46,17 21,20 19,21 2,22 1,24 18,25 4,28 2,29 2,32 25,35 4.7,36 0.065,37 3,38 38,39 42.927,40 47.737,41 30.012,42 28.687,44 5}
{0 CHEMBL2180174,1 6.898,2 42.2,3 48.9,4 0.993,5 1.124,6 0.656,7 0.616,8 310.43,9 4.4,10 12,11 45,13 13,14 25,16 47,17 19,20 13,21 6,22 1,24 22,25 4,28 2,29 2,32 23,35 4.4,36 0.085,37 4,38 32,39 44.694,40 50.567,41 29.534,42 27.74,44 5}
{0 CHEMBL2324342,1 7.176,2 39.4,3 47,4 1,5 1.135,6 0.653,7 0.62,8 473.64,9 10.6,10 17,11 66,13 19,14 39,16 70,17 26,20 15,21 11,22 2,24 31,25 9,28 7,29 2,32 35,35 3,36 0.071,37 5,38 49.5,39 65.97,40 74.889,41 43.086,42 40.901,44 7.678}
{0 CHEMBL238310,1 7.077,2 35.6,3 49.2,4 1.01,5 1.139,6 0.624,7 0.597,8 835.08,9 6.8,10 16,11 118,13 23,14 63,16 121,17 42,20 21,21 21,22 7,24 58,25 18,28 8,29 10,32 60,35 8.5,36 0.157,37 19,38 78,39 119.177,40 134.46,41 73.626,42 70.489,44 7.845}
{0 CHEMBL250699,1 8.727,2 46.3,3 39,4 1.02,5 1.112,6 0.702,7 0.681,8 357.81,9 2.4,10 17,11 41,13 18,14 27,16 43,17 19,18 1,20 17,21 2,22 1,24 16,25 6,26 1,28 1,29 4,32 25,34 1,35 9.8,36 0.116,37 5,38 36.5,39 41.804,40 45.602,41 28.773,42 27.923,43 2.4,44 5}
{0 CHEMBL265502,1 10.297,2 40.5,3 31.7,4 1.053,5 1.114,6 0.717,7 0.711,8 1297.39,9 4.8,10 46,11 126,13 63,14 93,16 133,17 51,20 49,21 2,22 17,24 40,25 35,26 6,28 6,29 23,31 6,32 86,35 18.3,36 0.12,37 16,38 133,39 132.618,40 140.384,41 90.318,42 89.647,44 4.827}
{0 CHEMBL335206,1 10.555,2 23.8,3 35.7,4 1.066,5 1.148,6 0.683,7 0.66,8 443.31,9 11.9,10 10,11 42,13 12,14 29,16 44,17 10,20 5,21 5,22 2,24 15,25 17,26 3,28 5,29 9,30 2,31 1,32 27,35 21.4,36 0.136,37 6,38 36,39 44.782,40 48.235,41 28.699,42 27.736,44 5.056}
{0 CHEMBL336208,1 10.849,2 21.6,3 35.3,4 1.075,5 1.15,6 0.681,7 0.658,8 553.32,9 9.8,10 10,11 51,13 13,14 35,16 53,17 11,20 5,21 6,22 3,24 18,25 22,26 4,28 5,29 13,30 3,31 1,32 33,35 25.5,36 0.17,37 9,38 43,39 54.833,40 58.626,41 34.721,42 33.572,44 6.456}
{0 CHEMBL337062,1 9.977,2 27.3,3 37.9,4 1.054,5 1.142,6 0.682,7 0.654,8 658.47,9 9.1,10 16,11 66,13 19,14 44,16 69,17 18,20 11,21 7,22 3,24 25,25 23,26 4,28 6,29 13,30 3,31 1,32 41,35 19.7,36 0.174,37 12,38 55,39 69.586,40 75.37,41 45.011,42 43.174,44 7.77}
{0 CHEMBL339385,1 10.327,2 24.7,3 34.6,4 1.072,5 1.153,6 0.664,7 0.658,8 836.46,9 12.3,10 20,11 81,13 24,14 58,16 86,17 20,20 10,21 10,22 4,24 28,25 33,26 4,28 10,29 19,30 4,32 53,35 23.5,36 0.163,37 14,38 72,39 86.855,40 93.424,41 53.795,42 53.285,44 6.301}
{0 CHEMBL339386,1 9.963,2 33.3,3 34.8,4 1.054,5 1.133,6 0.693,7 0.677,8 687.43,9 7.2,10 22,11 69,13 26,14 49,16 73,17 23,20 18,21 5,22 4,24 24,25 22,26 3,28 5,29 14,30 3,32 45,35 20.3,36 0.164,37 12,38 64,39 72.735,40 78.161,41 47.812,42 46.68,44 7.097}
{0 CHEMBL395493,1 6.907,2 35.4,3 50.4,4 1.007,5 1.139,6 0.621,7 0.591,8 877.17,9 6.3,10 16,11 127,13 23,14 66,16 130,17 45,20 21,21 24,22 7,24 64,25 18,28 8,29 10,32 63,35 7.9,36 0.162,37 21,38 81,39 127.828,40 144.706,41 78.91,42 75.07,44 10.318}
{0 CHEMBL395723,1 7.017,2 35.5,3 49.6,4 1.009,5 1.139,6 0.623,7 0.595,8 849.11,9 6.6,10 16,11 121,13 23,14 64,16 124,17 43,20 21,21 22,22 7,24 60,25 18,28 8,29 10,32 61,35 8.3,36 0.161,37 20,38 79,39 122.061,40 137.876,41 75.387,42 72.016,44 7.489}
{0 CHEMBL397926,1 6.929,2 36.3,3 50,4 1.005,5 1.138,6 0.627,7 0.595,8 859.15,9 6.5,10 16,11 124,13 23,14 66,16 128,17 45,20 21,21 24,22 7,24 62,25 17,28 8,29 9,32 62,35 7.3,36 0.07,37 9,38 81,39 124.617,40 141.081,41 77.694,42 73.828,44 7.084}
{0 CHEMBL596234,1 8.197,2 47.8,3 39.1,4 1.017,5 1.11,6 0.689,7 0.675,8 565.61,9 1.4,10 24,11 69,13 28,14 46,16 73,17 33,20 28,21 5,22 4,24 27,25 9,28 1,29 8,32 42,35 11.6,36 0.123,37 9,38 62,39 70.207,40 76.571,41 47.54,42 46.588,44 7.5}
{0 CHEMBL599760,1 7.467,2 38.6,3 47.4,4 0.999,5 1.13,6 0.666,7 0.623,8 425.61,9 8.8,10 15,11 57,13 17,14 33,16 60,17 22,20 13,21 9,22 2,24 27,25 8,26 1,28 5,29 2,31 1,32 30,35 3.5,36 0.083,37 5,38 42.5,39 56.96,40 64.398,41 37.961,42 35.518,44 6.4}
{0 CHEMBL69234,1 11.118,2 30.4,3 30.4,4 1.08,5 1.132,6 0.696,7 0.698,8 511.42,9 6.5,10 12,11 46,13 19,14 33,16 47,17 14,20 12,21 2,22 7,24 14,25 18,26 3,28 3,29 12,30 1,31 2,32 32,35 26.1,36 0.17,37 8,38 46,39 49.662,40 52.063,41 32.017,42 32.101,44 5.77}
{0 CHEMBL69727,1 11.118,2 30.4,3 30.4,4 1.08,5 1.132,6 0.696,7 0.698,8 511.42,9 6.5,10 12,11 46,13 19,14 33,16 47,17 14,20 12,21 2,22 7,24 14,25 18,26 3,28 3,29 12,30 1,31 2,32 32,35 26.1,36 0.17,37 8,38 46,39 49.662,40 52.063,41 32.017,42 32.101,44 6.967}
{0 CHEMBL74121,1 9.246,2 32,3 40,4 1.045,5 1.134,6 0.671,7 0.646,8 231.16,9 4,10 6,11 25,13 7,14 16,16 26,17 8,20 5,21 3,22 1,24 10,25 7,26 1,28 1,29 5,30 1,32 15,35 20,38 20,39 26.131,40 28.345,41 16.767,42 16.153,44 4.234}
