"molecule_id","MATS6i","GATS6i","SRW09","MATS6s","MATS1e","SaasN","CATS2D_03_DA","CATS2D_05_DL","nPyrrolidines","CATS2D_07_AL","X5A","SpMAD_AEA.dm.","CATS2D_09_AL","JGI2","CATS2D_02_AA","SpMax2_Bh.v.","GGI5","nCrs","D.Dtr05","MATS6p","Eig01_EA.dm.","SM04_EA.dm.","SM06_EA.dm.","SM08_EA.dm.","SM10_EA.dm.","SM12_EA.dm.","SM14_EA.dm.","SpDiam_EA.dm.","SpMax_EA.dm.","CATS2D_03_AA","Psi_e_A","Psi_i_A","GATS2e","C.040","CATS2D_05_AL","CATS2D_06_DA","Eig03_EA.bo.","nR05","SM13_AEA.ri.","SRW05","SpMAD_EA.dm.","SpMax2_Bh.p.","GATS4s","GATS4p","SRW07","ATSC3s","MAXDP","ATS7s","GATS5s","N.074","nCsp","nRCN","nTB","NtN","NtsC","StN","SpDiam_AEA.dm.","X0A","P_VSA_s_5","SpDiam_EA.ed.","MATS3i","H.053","CATS2D_01_AA","CATS2D_08_AL","pXC50"
{1 -0.109,2 1.122,3 7.154,4 0.015,5 -0.001,9 2,10 8,11 0.081,12 1.541,13 4,14 0.076,15 4,16 3.766,17 0.553,18 5,19 126.807,20 -0.14,21 2.228,22 4.051,23 5.416,24 6.867,25 8.361,26 9.884,27 11.427,28 3.977,29 2.228,30 2,31 7.765,32 2.265,33 0.681,34 1,35 7,37 2.962,38 2,39 2.962,40 3.045,41 0.514,42 3.757,43 2.086,44 0.882,45 5.209,46 31.432,47 5.513,48 5.586,49 1.986,57 5.949,58 0.698,60 18.183,61 -0.057,64 4,65 4}
{0 CHEMBL1243374,1 0.152,2 0.805,3 6.581,4 -0.066,5 -0.032,7 2,8 5,9 1,10 8,11 0.082,12 1.658,13 4,14 0.092,15 1,16 3.737,17 0.406,18 3,19 67.242,20 0.102,21 2.445,22 4.556,23 6.212,24 7.935,25 9.685,26 11.449,27 13.222,28 4.885,29 2.445,30 1,31 7.964,32 2.464,33 0.606,34 3,35 5,36 1,37 3.199,38 1,39 3.199,40 2.398,41 0.489,42 3.727,43 1.525,44 1.116,45 4.595,46 52.618,47 5.382,48 5.416,49 1.355,50 1,51 1,52 1,53 1,54 1,55 1,56 9.028,57 6.168,58 0.706,59 34.612,60 17.777,61 0.143,64 7,65 6.174}
{0 CHEMBL1422,1 0.05,2 0.843,3 6.862,4 -0.218,5 -0.052,6 0.903,8 1,10 4,11 0.073,12 1.573,13 3,14 0.099,15 3,16 3.813,17 0.806,19 72.014,20 0.061,21 3.825,22 5.501,23 8.077,24 10.739,25 13.418,26 16.1,27 18.783,28 5.335,29 3.825,30 2,31 8.884,32 3.384,33 0.539,34 1,35 4,37 3.195,38 1,39 3.195,40 2.398,41 0.439,42 3.774,43 0.802,44 1.126,45 4.727,46 238.646,47 5.679,48 5.968,49 0.966,57 6.473,58 0.737,60 20.209,61 0.105,63 1,64 3,65 4}
{0 CHEMBL142703,1 0.274,2 0.615,3 6.581,4 -0.113,5 -0.054,7 2,8 2,9 1,10 6,11 0.065,12 1.714,13 2,14 0.063,15 1,16 3.732,17 0.462,18 9,19 61.551,20 0.261,21 2.445,22 4.53,23 6.206,24 7.934,25 9.685,26 11.449,27 13.221,28 4.885,29 2.445,30 1,31 7.735,32 2.235,33 0.661,34 2,35 6,36 1,37 2.979,38 1,39 2.979,40 2.398,41 0.432,42 3.723,43 0.882,44 0.946,45 4.595,46 57.099,47 5.437,48 5.429,49 1.398,50 1,51 1,52 1,53 1,54 1,55 1,56 9.12,57 6.168,58 0.699,59 34.612,60 21.207,61 -0.053,62 2,64 3,65 4.284}
{0 CHEMBL189620,1 -0.026,2 0.992,3 7.286,4 0.03,5 0.011,9 2,10 9,11 0.081,12 1.616,13 5,14 0.08,15 2,16 3.79,17 0.559,18 6,19 147.996,20 -0.056,21 2.446,22 4.712,23 6.325,24 8.01,25 9.735,26 11.482,27 13.243,28 4.885,29 2.446,30 3,31 7.807,32 2.307,33 0.637,34 3,35 6,37 3.068,38 2,39 3.068,40 3.045,41 0.554,42 3.781,43 1.722,44 1.034,45 5.283,46 48.816,47 5.808,48 5.832,49 1.682,50 1,51 1,52 1,53 1,54 1,55 1,56 9.203,57 6.176,58 0.706,59 16.602,60 18.601,61 0.092,64 5,65 5}
{0 CHEMBL2021934,1 0.106,2 0.853,3 6.804,4 -0.17,5 -0.033,7 2,8 3,9 1,10 6,11 0.091,12 1.682,13 2,14 0.087,15 1,16 3.765,17 0.399,18 2,19 62.804,20 0.033,21 2.445,22 4.556,23 6.212,24 7.935,25 9.685,26 11.449,27 13.222,28 4.885,29 2.445,30 1,31 8.058,32 2.558,33 0.604,34 3,35 5,36 1,37 2.601,38 1,39 2.601,40 2.398,41 0.582,42 3.761,43 1.453,44 0.909,45 4.727,46 52.069,47 5.056,48 5.291,49 1.278,50 1,51 1,52 1,53 1,54 1,55 1,56 9.027,57 6.17,58 0.727,59 34.612,60 16.803,61 -0.034,64 4,65 4}
{0 CHEMBL2022505,1 0.199,2 0.748,3 6.581,4 -0.088,5 -0.027,7 2,8 4,9 1,10 5,11 0.095,12 1.605,13 5,14 0.079,15 1,16 3.737,17 0.393,18 3,19 69.053,20 0.157,21 2.445,22 4.7,23 6.313,24 8,25 9.726,26 11.475,27 13.237,28 4.885,29 2.445,30 1,31 7.992,32 2.492,33 0.603,34 3,35 4,36 1,37 2.813,38 1,39 2.813,40 2.398,41 0.644,42 3.727,43 1.499,44 1.085,45 4.595,46 60.035,47 4.953,48 5.367,49 1.087,50 1,51 1,52 1,53 1,54 1,55 1,56 8.942,57 6.168,58 0.718,59 34.612,60 16.523,61 0.118,64 5,65 5.027}
{0 CHEMBL2022506,1 0.318,2 0.653,3 7.125,4 -0.168,5 -0.046,7 2,8 3,9 1,10 6,11 0.093,12 1.61,14 0.077,15 1,16 3.734,17 0.296,18 3,19 122.267,20 0.134,21 2.445,22 4.735,23 6.345,24 8.027,25 9.747,26 11.491,27 13.249,28 4.885,29 2.445,30 1,31 8.061,32 2.561,33 0.624,34 3,35 3,36 1,37 2.752,38 2,39 2.752,40 3.045,41 0.735,42 3.727,43 1.508,44 0.987,45 5.209,46 60.52,47 4.884,48 5.125,49 1.315,50 1,51 1,52 1,53 1,54 1,55 1,56 8.904,57 5.918,58 0.719,59 34.612,60 16.524,61 0.108,64 3,65 5.167}
{0 CHEMBL2022507,1 0.259,2 0.713,3 6.581,4 -0.187,5 -0.041,7 2,8 4,9 1,10 7,11 0.092,12 1.629,13 1,14 0.084,15 1,16 3.735,17 0.309,18 3,19 68.7,20 0.127,21 2.445,22 4.735,23 6.345,24 8.027,25 9.747,26 11.491,27 13.249,28 4.885,29 2.445,30 1,31 8.101,32 2.601,33 0.605,34 3,35 4,36 1,37 2.905,38 1,39 2.905,40 2.398,41 0.669,42 3.726,43 1.384,44 1.101,45 4.595,46 68.958,47 4.959,48 5.378,49 1.323,50 1,51 1,52 1,53 1,54 1,55 1,56 8.938,57 6.168,58 0.726,59 34.612,60 16.524,61 0.134,64 5,65 5.409}
{0 CHEMBL2022508,1 0.098,2 0.904,3 6.581,4 -0.145,5 -0.033,7 2,8 6,9 1,10 12,11 0.081,12 1.626,13 2,14 0.092,15 1,16 3.762,17 0.552,18 3,19 94.893,20 0.062,21 2.445,22 4.794,23 6.411,24 8.094,25 9.811,26 11.548,27 13.299,28 4.885,29 2.445,30 1,31 7.996,32 2.496,33 0.601,34 3,35 6,36 1,37 3.258,38 1,39 3.258,40 2.398,41 0.539,42 3.774,43 1.348,44 1.068,45 4.595,46 72.867,47 5.972,48 5.992,49 1.325,50 1,51 1,52 1,53 1,54 1,55 1,56 9.14,57 6.168,58 0.718,59 34.612,60 17.731,61 0.118,64 9,65 5.721}
{0 CHEMBL2022509,1 0.045,2 0.81,3 6.581,4 -0.078,5 -0.059,7 2,8 2,9 1,10 6,11 0.086,12 1.607,13 2,14 0.089,15 1,16 3.732,17 0.601,18 3,19 81.665,20 0.155,21 4.032,22 5.924,23 8.482,24 11.195,25 13.957,26 16.737,27 19.522,28 6.472,29 4.032,30 1,31 8.74,32 3.24,33 0.293,34 3,35 2,36 2,37 3.218,38 1,39 3.218,40 2.398,41 0.843,42 3.723,43 1.013,44 1.149,45 4.595,46 132.327,47 4.976,48 5.484,49 1.221,50 1,51 1,52 1,53 1,54 1,55 1,56 8.924,57 6.437,58 0.739,59 34.612,60 16.809,61 0.004,64 1,65 5.328}
{0 CHEMBL2022510,1 0.036,2 0.956,3 7.125,4 0.045,5 -0.029,7 2,8 2,9 1,10 6,11 0.08,12 1.609,13 2,14 0.085,15 1,16 3.732,17 0.747,18 8,19 169.523,20 -0.008,21 2.445,22 4.579,23 6.215,24 7.936,25 9.685,26 11.449,27 13.222,28 4.885,29 2.445,30 2,31 7.907,32 2.407,33 0.903,34 3,35 4,36 2,37 3.207,38 2,39 3.207,40 3.045,41 0.54,42 3.723,43 1.537,44 0.936,45 5.209,46 67.733,47 5.461,48 5.874,49 1.173,50 1,51 1,52 1,53 1,54 1,55 1,56 9.081,57 6.168,58 0.712,59 34.612,60 16.539,61 0.037,64 3,65 5.432}
{0 CHEMBL2022511,1 0.192,2 0.748,3 6.581,4 -0.108,5 -0.055,7 2,8 3,9 1,10 10,11 0.085,12 1.677,14 0.104,15 1,16 3.733,17 0.344,18 3,19 65.481,20 0.076,21 2.445,22 4.556,23 6.212,24 7.935,25 9.685,26 11.449,27 13.222,28 4.885,29 2.445,30 1,31 8.209,32 2.709,33 0.625,34 3,35 3,36 1,37 2.682,38 1,39 2.682,40 2.398,41 0.556,42 3.724,43 1.463,44 1.11,45 4.595,46 75.848,47 5.041,48 5.472,49 1.431,50 1,51 1,52 1,53 1,54 1,55 1,56 8.947,57 6.168,58 0.734,59 34.612,60 17.23,61 0.113,64 3,65 4.836}
{0 CHEMBL2022512,1 0.126,2 0.79,3 7.14,4 0.041,5 -0.035,7 2,8 3,9 1,10 8,11 0.083,12 1.627,13 2,14 0.095,15 1,16 3.739,17 0.573,18 3,19 157.41,20 0.136,21 2.445,22 4.556,23 6.212,24 7.935,25 9.685,26 11.449,27 13.222,28 4.885,29 2.445,30 1,31 7.938,32 2.438,33 0.628,34 3,35 3,36 1,37 3.249,38 2,39 3.249,40 3.045,41 0.47,42 3.739,43 1.636,44 1.026,45 5.209,46 51.589,47 5.169,48 5.465,49 1.284,50 1,51 1,52 1,53 1,54 1,55 1,56 9.015,57 6.168,58 0.706,59 34.612,60 16.536,61 0.104,64 4,65 5.092}
{0 CHEMBL2022513,1 0.053,2 0.913,3 6.581,4 0.018,5 -0.026,7 2,8 4,9 1,10 8,11 0.084,12 1.637,13 6,14 0.086,15 1,16 3.739,17 0.705,18 3,19 79.457,20 0.03,21 2.445,22 4.556,23 6.212,24 7.935,25 9.685,26 11.449,27 13.222,28 4.885,29 2.445,30 1,31 7.927,32 2.427,33 0.615,34 3,35 4,36 1,37 3.249,38 1,39 3.249,40 2.398,41 0.453,42 3.73,43 1.565,44 1.042,45 4.595,46 52.213,47 5.352,48 5.637,49 1.193,50 1,51 1,52 1,53 1,54 1,55 1,56 9.048,57 6.168,58 0.706,59 34.612,60 16.541,61 0.101,64 6,65 5.854}
{0 CHEMBL2022514,1 0.095,2 0.866,3 6.581,4 0.023,5 -0.032,7 2,8 4,9 1,10 7,11 0.082,12 1.658,13 6,14 0.092,15 1,16 3.738,17 0.538,18 3,19 69.037,20 0.099,21 2.445,22 4.556,23 6.212,24 7.935,25 9.685,26 11.449,27 13.222,28 4.885,29 2.445,30 1,31 7.964,32 2.464,33 0.606,34 3,35 4,36 1,37 3.244,38 1,39 3.244,40 2.398,41 0.489,42 3.728,43 1.564,44 1.093,45 4.595,46 52.049,47 5.212,48 5.455,49 1.248,50 1,51 1,52 1,53 1,54 1,55 1,56 9.01,57 6.168,58 0.706,59 34.612,60 16.54,61 0.107,64 5,65 5.125}
{0 CHEMBL2022515,1 0.006,2 1.024,3 6.581,4 -0.018,5 0.047,7 2,8 3,9 1,10 6,11 0.085,12 1.666,13 2,14 0.104,15 2,16 3.732,17 0.747,18 3,19 70.934,20 -0.058,21 2.445,22 4.539,23 6.206,24 7.933,25 9.684,26 11.449,27 13.221,28 4.885,29 2.445,30 1,31 8.261,32 2.761,33 0.778,34 2,35 2,36 1,37 3.246,38 1,39 3.246,40 2.398,41 0.516,42 3.723,43 1.628,44 1.142,45 4.595,46 73.202,47 5.168,48 5.702,49 1.065,50 1,51 1,52 1,53 1,54 1,55 1,56 8.953,57 6.685,58 0.735,59 33.007,60 19.681,61 0.057,64 2,65 5.292}
{0 CHEMBL2022516,1 0.064,2 0.785,3 6.581,4 -0.04,5 -0.025,7 3,8 2,9 1,10 6,11 0.079,12 1.594,13 4,14 0.081,15 1,16 3.75,17 0.629,18 3,19 125.981,20 -0.072,21 2.445,22 4.755,23 6.342,24 8.019,25 9.74,26 11.485,27 13.245,28 4.885,29 2.445,30 3,31 8.048,32 2.548,33 0.728,34 3,35 2,36 2,37 3.257,38 1,39 3.257,40 2.398,41 0.512,42 3.751,43 0.874,44 1.048,45 4.595,46 103.101,47 5.513,48 6.212,49 0.696,50 1,51 1,52 1,53 1,54 1,55 1,56 9.134,57 6.168,58 0.708,59 34.612,60 17.916,61 0.082,64 4,65 5.569}
{0 CHEMBL2022517,1 0.187,2 0.713,3 6.581,4 -0.121,5 -0.051,7 2,8 2,9 1,10 3,11 0.095,12 1.605,13 3,14 0.089,15 1,16 3.741,17 0.559,18 3,19 92.215,20 0.117,21 2.445,22 4.848,23 6.41,24 8.062,25 9.766,26 11.5,27 13.253,28 4.885,29 2.445,30 1,31 8.295,32 2.795,33 0.593,34 4,35 4,36 1,37 2.92,38 1,39 2.92,40 2.398,41 0.708,42 3.731,43 1.345,44 1.036,45 4.595,46 114.793,47 4.995,48 5.727,49 0.749,50 1,51 1,52 1,53 1,54 1,55 1,56 8.96,57 6.168,58 0.728,59 52.623,60 16.523,61 0.011,64 3,65 4.921}
{0 CHEMBL2022518,1 0.095,2 0.762,3 6.581,4 -0.084,5 -0.04,7 2,8 2,9 1,10 4,11 0.084,12 1.6,13 5,14 0.09,15 1,16 3.75,17 0.886,18 3,19 120.483,20 0.015,21 2.445,22 4.864,23 6.415,24 8.064,25 9.767,26 11.5,27 13.253,28 4.885,29 2.445,30 1,31 8.283,32 2.783,33 0.583,34 4,35 6,36 1,37 3.257,38 1,39 3.257,40 2.398,41 0.58,42 3.751,43 1.152,44 0.982,45 4.595,46 140.444,47 5.517,48 6.232,49 0.637,50 1,51 1,52 1,53 1,54 1,55 1,56 9.059,57 6.168,58 0.721,59 52.623,60 16.998,61 0.009,64 5,65 4.699}
{0 CHEMBL2022519,1 0.043,2 0.842,3 6.581,4 -0.031,5 -0.029,7 2,8 2,9 1,10 5,11 0.088,12 1.604,13 3,14 0.086,15 2,16 3.744,17 0.691,18 3,19 111.903,20 0.004,21 2.445,22 4.862,23 6.42,24 8.07,25 9.772,26 11.505,27 13.257,28 4.885,29 2.445,30 2,31 8.086,32 2.586,33 0.698,34 4,35 4,36 1,37 3.123,38 1,39 3.123,40 2.398,41 0.647,42 3.733,43 1.234,44 1.093,45 4.595,46 101.778,47 5.409,48 5.993,49 0.763,50 1,51 1,52 1,53 1,54 1,55 1,56 9.042,57 6.168,58 0.717,59 34.612,60 16.523,61 0.065,64 3,65 4.987}
{0 CHEMBL2022520,1 -0.009,2 0.84,3 6.581,4 -0.004,5 -0.025,7 2,8 2,9 1,10 8,11 0.08,12 1.603,13 5,14 0.091,15 2,16 3.75,17 0.886,18 3,19 141.177,20 -0.059,21 2.445,22 4.879,23 6.426,24 8.072,25 9.773,26 11.505,27 13.257,28 4.885,29 2.445,30 2,31 8.114,32 2.614,33 0.664,34 4,35 5,36 1,37 3.257,38 1,39 3.257,40 2.398,41 0.554,42 3.751,43 1.093,44 1.038,45 4.595,46 126.917,47 5.756,48 6.407,49 0.601,50 1,51 1,52 1,53 1,54 1,55 1,56 9.111,57 6.168,58 0.712,59 34.612,60 17.93,61 0.062,64 5,65 4.701}
{0 CHEMBL2022521,1 0.202,2 0.664,3 7.273,4 -0.026,5 -0.003,6 1.227,7 3,8 2,9 1,10 4,11 0.081,12 1.634,13 4,14 0.089,15 2,16 3.739,17 0.667,18 3,19 175.546,20 0.113,21 2.445,22 4.72,23 6.331,24 8.015,25 9.737,26 11.483,27 13.244,28 4.885,29 2.445,30 2,31 8.383,32 2.883,33 0.666,34 3,35 2,36 1,37 3.257,38 2,39 3.257,40 3.045,41 0.501,42 3.729,43 1.148,44 1.084,45 5.283,46 153.472,47 5.289,48 5.717,49 0.947,50 1,51 1,52 1,53 1,54 1,55 1,56 8.992,57 6.168,58 0.718,59 34.612,60 16.525,61 0.082,63 2,64 3,65 5.886}
{0 CHEMBL2022522,1 0.124,2 0.998,3 7.273,4 -0.037,5 0.016,6 1.406,7 3,8 2,9 1,10 5,11 0.08,12 1.641,13 5,14 0.083,15 6,16 3.72,17 1.011,18 3,19 220.374,20 -0.146,21 2.445,22 4.981,23 6.555,24 8.206,25 9.899,26 11.618,27 13.356,28 4.885,29 2.445,30 5,31 8.008,32 2.508,33 0.712,34 3,36 2,37 3.257,38 2,39 3.257,40 3.045,41 0.65,42 3.7,43 1.267,44 1.066,45 5.283,46 88.151,47 5.215,48 6.013,49 1.729,50 1,51 1,52 1,53 1,54 1,55 1,56 9.074,57 5.99,58 0.728,59 34.612,60 16.856,61 0.135,63 2,64 2,65 5.569}
{0 CHEMBL2022523,1 0.099,2 0.83,3 6.293,4 0.033,5 -0.031,7 2,8 3,9 1,10 6,11 0.092,12 1.53,14 0.087,15 1,16 3.686,17 0.344,18 2,19 52.604,20 0.117,21 1.986,22 3.192,23 4.329,24 5.595,25 6.917,26 8.264,27 9.623,28 3.464,29 1.986,31 7.912,32 2.412,33 0.644,34 2,35 3,37 2.541,38 1,39 2.541,40 2.398,41 0.411,42 3.682,43 1.843,44 0.96,45 4.443,46 37.838,47 4.692,48 5.047,49 1.376,57 5.737,58 0.711,59 18.011,60 14.715,61 0.01,64 2,65 4}
{0 CHEMBL2022524,1 0.228,2 0.786,3 6.605,4 -0.009,5 -0.038,7 3,8 3,9 1,10 9,11 0.083,12 1.602,13 2,14 0.089,15 1,16 3.756,17 0.764,18 3,19 78.806,20 0.103,21 2.013,22 3.788,23 4.964,24 6.237,25 7.555,26 8.897,27 10.251,28 3.507,29 2.013,30 1,31 7.969,32 2.469,33 0.566,34 3,35 6,36 1,37 3.108,38 1,39 3.108,40 2.398,41 0.468,42 3.745,43 1.357,44 0.854,45 4.595,46 61.015,47 5.393,48 5.802,49 1.952,57 5.901,58 0.739,59 36.022,60 17.855,61 0.03,64 3,65 4.602}
{0 CHEMBL2022525,1 0.137,2 0.778,3 6.823,4 0.024,5 0.052,7 2,8 2,9 1,10 5,11 0.086,12 1.637,13 4,14 0.081,15 1,16 3.75,17 0.591,18 3,19 70.213,20 0.108,21 2.445,22 4.556,23 6.212,24 7.935,25 9.685,26 11.449,27 13.222,28 4.885,29 2.445,30 2,31 8.28,32 2.78,33 0.624,34 3,35 3,36 2,37 2.771,38 1,39 2.771,40 2.398,41 0.532,42 3.736,43 1.507,44 1.053,45 4.727,46 75.67,47 5.126,48 5.664,49 1.344,50 1,51 1,52 1,53 1,54 1,55 1,56 9.061,57 6.171,58 0.725,59 34.612,60 16.863,61 0.047,62 2,64 4,65 4.757}
{0 CHEMBL2022526,1 0.118,2 0.802,3 6.823,4 -0.026,5 0.062,7 2,8 4,9 1,10 7,11 0.079,12 1.641,13 6,14 0.082,15 1,16 3.756,17 0.653,18 3,19 77.951,20 0.078,21 2.445,22 4.556,23 6.212,24 7.935,25 9.685,26 11.449,27 13.222,28 4.885,29 2.445,30 2,31 8.135,32 2.635,33 0.603,34 3,35 5,36 2,37 3.213,38 1,39 3.213,40 2.398,41 0.437,42 3.74,43 1.383,44 1.112,45 4.727,46 71.508,47 5.482,48 5.797,49 1.292,50 1,51 1,52 1,53 1,54 1,55 1,56 9.179,57 6.171,58 0.712,59 34.612,60 17.778,61 0.122,62 2,64 8,65 5.387}
{0 CHEMBL2022527,1 0.118,2 0.802,3 6.823,4 -0.026,5 0.062,7 2,8 4,9 1,10 7,11 0.079,12 1.641,13 6,14 0.082,15 1,16 3.756,17 0.653,18 3,19 77.951,20 0.078,21 2.445,22 4.556,23 6.212,24 7.935,25 9.685,26 11.449,27 13.222,28 4.885,29 2.445,30 2,31 8.135,32 2.635,33 0.603,34 3,35 5,36 2,37 3.213,38 1,39 3.213,40 2.398,41 0.437,42 3.74,43 1.383,44 1.112,45 4.727,46 71.508,47 5.482,48 5.797,49 1.292,50 1,51 1,52 1,53 1,54 1,55 1,56 9.179,57 6.171,58 0.712,59 34.612,60 17.778,61 0.122,62 2,64 8,65 4}
{0 CHEMBL2022528,1 0.182,2 0.71,3 6.804,4 -0.078,5 -0.034,7 2,8 4,9 1,10 7,11 0.082,12 1.673,13 4,14 0.086,15 1,16 3.743,17 0.462,18 3,19 70.542,20 0.105,21 2.445,22 4.556,23 6.212,24 7.935,25 9.685,26 11.449,27 13.222,28 4.885,29 2.445,30 1,31 8.188,32 2.688,33 0.72,34 3,35 5,36 1,37 3.208,38 1,39 3.208,40 2.398,41 0.47,42 3.726,43 1.276,44 1.112,45 4.727,46 90.575,47 5.377,48 5.49,49 0.922,50 1,51 1,52 1,53 1,54 1,55 1,56 8.979,57 6.172,58 0.713,59 34.612,60 17.778,61 0.186,62 2,64 7,65 6.9}
{0 CHEMBL2022529,1 0.237,2 0.656,3 7.018,4 -0.078,5 -0.045,7 2,8 2,9 1,10 5,11 0.087,12 1.671,13 2,14 0.093,15 1,16 3.742,17 0.455,18 3,19 66.104,20 0.149,21 2.445,22 4.66,23 6.259,24 7.954,25 9.693,26 11.452,27 13.223,28 4.885,29 2.445,30 1,31 8.599,32 3.099,33 0.614,34 3,35 3,36 1,37 2.938,38 1,39 2.938,40 2.398,41 0.693,42 3.721,43 1.282,44 1.06,45 4.844,46 157.92,47 5.223,48 5.389,49 0.724,50 1,51 1,52 1,53 1,54 1,55 1,56 8.808,57 6.219,58 0.736,59 34.612,60 18.577,61 0.144,64 3,65 6.071}
{0 CHEMBL2022530,1 0.197,2 0.659,3 7.018,4 -0.096,5 -0.035,7 2,8 4,9 1,10 7,11 0.08,12 1.666,13 4,14 0.091,15 1,16 3.748,17 0.518,18 3,19 73.842,20 0.108,21 2.445,22 4.66,23 6.259,24 7.954,25 9.693,26 11.452,27 13.223,28 4.885,29 2.445,30 1,31 8.397,32 2.897,33 0.594,34 3,35 5,36 1,37 3.226,38 1,39 3.226,40 2.398,41 0.565,42 3.725,43 1.158,44 1.109,45 4.844,46 146.235,47 5.398,48 5.562,49 0.7,50 1,51 1,52 1,53 1,54 1,55 1,56 8.927,57 6.219,58 0.721,59 34.612,60 18.743,61 0.203,64 7,65 6.959}
{0 CHEMBL2022531,1 0.075,2 0.901,3 6.804,4 -0.178,5 -0.032,7 2,8 5,10 8,11 0.082,12 1.67,13 4,14 0.086,15 1,16 3.777,17 0.462,18 2,19 70.542,20 0.014,21 2.446,22 4.571,23 6.216,24 7.937,25 9.687,26 11.451,27 13.223,28 4.885,29 2.446,30 1,31 7.993,32 2.493,33 0.616,34 3,35 7,36 1,37 3.219,38 1,39 3.219,40 2.398,41 0.531,42 3.77,43 1.405,44 1,45 4.727,46 53.48,47 5.429,48 5.473,49 1.088,50 1,51 1,52 1,53 1,54 1,55 1,56 9.105,57 6.176,58 0.713,59 34.612,60 17.778,61 0.005,64 8,65 5.174}
{0 CHEMBL2022532,1 0.026,2 0.954,3 6.823,4 -0.126,5 -0.021,7 2,8 5,9 1,10 8,11 0.08,12 1.642,13 5,14 0.084,15 1,16 3.787,17 0.573,18 2,19 74.142,20 -0.018,21 2.445,22 4.556,23 6.212,24 7.935,25 9.685,26 11.449,27 13.222,28 4.885,29 2.445,30 1,31 7.9,32 2.4,33 0.592,34 3,35 7,36 1,37 3.21,38 1,39 3.21,40 2.398,41 0.453,42 3.783,43 1.342,44 1.068,45 4.727,46 51.877,47 5.503,48 5.658,49 1.15,50 1,51 1,52 1,53 1,54 1,55 1,56 9.241,57 6.17,58 0.712,59 34.612,60 17.778,61 0.072,64 8,65 4.377}
{0 CHEMBL2022533,1 0.064,2 0.767,3 6.862,4 0.372,5 -0.032,7 2,8 5,9 1,10 8,11 0.076,12 1.649,13 4,14 0.095,15 1,16 3.779,17 0.906,18 2,19 81.342,20 0.017,21 3.02,22 5.241,23 7.156,24 9.187,25 11.281,26 13.415,27 15.574,28 5.46,29 3.02,30 1,31 8.528,32 3.028,33 0.412,34 3,35 5,36 1,37 3.233,38 1,39 3.233,40 2.398,41 0.63,42 3.765,43 1.44,44 0.968,45 4.727,46 153.817,47 5.426,48 5.806,49 0.997,50 1,51 1,52 1,53 1,54 1,55 1,56 9.044,57 6.336,58 0.726,59 34.612,60 19.041,61 -0.028,64 7,65 4}
{0 CHEMBL2022534,1 0.127,2 0.826,4 -0.11,5 -0.033,7 2,8 3,10 6,11 0.092,12 1.637,13 2,14 0.091,15 1,16 3.731,17 0.479,18 4,20 0.068,21 2.445,22 4.556,23 6.212,24 7.935,25 9.685,26 11.449,27 13.222,28 4.885,29 2.445,30 1,31 8.042,32 2.542,33 0.609,34 3,35 5,36 1,37 2.577,39 2.577,41 0.582,42 3.726,43 1.501,44 1.061,46 54.417,47 5.063,48 5.282,49 1.401,50 1,51 1,52 1,53 1,54 1,55 1,56 9.035,57 6.166,58 0.719,59 34.612,60 16.514,61 0.065,64 4,65 4}
{0 CHEMBL2022535,1 0.116,2 0.859,4 -0.148,5 -0.026,7 2,8 5,10 8,11 0.082,12 1.641,13 4,14 0.089,15 1,16 3.736,17 0.542,18 4,20 0.051,21 2.445,22 4.556,23 6.212,24 7.935,25 9.685,26 11.449,27 13.222,28 4.885,29 2.445,30 1,31 7.924,32 2.424,33 0.6,34 3,35 7,36 1,37 3.195,39 3.195,41 0.47,42 3.731,43 1.401,44 1.102,46 52.911,47 5.45,48 5.473,49 1.384,50 1,51 1,52 1,53 1,54 1,55 1,56 9.153,57 6.166,58 0.706,59 34.612,60 17.777,61 0.129,64 8,65 4.301}
{0 CHEMBL2024671,1 -0.026,2 0.992,3 7.286,4 0.03,5 0.011,9 2,10 9,11 0.081,12 1.616,13 5,14 0.08,15 2,16 3.79,17 0.559,18 6,19 147.996,20 -0.056,21 2.446,22 4.712,23 6.325,24 8.01,25 9.735,26 11.482,27 13.243,28 4.885,29 2.446,30 3,31 7.807,32 2.307,33 0.637,34 3,35 6,37 3.068,38 2,39 3.068,40 3.045,41 0.554,42 3.781,43 1.722,44 1.034,45 5.283,46 48.816,47 5.808,48 5.832,49 1.682,50 1,51 1,52 1,53 1,54 1,55 1,56 9.203,57 6.176,58 0.706,59 16.602,60 18.601,61 0.092,64 5,65 4}
{0 CHEMBL2024672,1 0.183,2 0.748,3 6.581,4 -0.006,5 -0.041,7 2,8 3,9 1,10 6,11 0.092,12 1.652,13 2,14 0.094,15 1,16 3.731,17 0.344,18 3,19 59.504,20 0.141,21 2.445,22 4.556,23 6.212,24 7.935,25 9.685,26 11.449,27 13.222,28 4.885,29 2.445,30 1,31 8.096,32 2.596,33 0.617,34 3,35 3,36 1,37 2.579,38 1,39 2.579,40 2.398,41 0.611,42 3.723,43 1.678,44 1.062,45 4.595,46 53.525,47 4.91,48 5.214,49 1.403,50 1,51 1,52 1,53 1,54 1,55 1,56 8.91,57 6.168,58 0.719,59 34.612,60 16.534,61 0.076,64 3,65 5.456}
{0 CHEMBL2024673,1 0.043,2 0.898,3 6.581,4 -0.002,5 -0.046,7 2,8 3,9 1,10 4,11 0.089,12 1.643,13 2,14 0.092,15 1,16 3.731,17 0.518,18 3,19 66.851,20 0.017,21 2.445,22 4.567,23 6.214,24 7.935,25 9.685,26 11.449,27 13.222,28 4.885,29 2.445,30 1,31 8.095,32 2.595,33 0.864,34 3,35 3,36 1,37 2.959,38 1,39 2.959,40 2.398,41 0.634,42 3.723,43 1.631,44 1.149,45 4.595,46 55.174,47 5.009,48 5.423,49 1.171,50 1,51 1,52 1,53 1,54 1,55 1,56 8.953,57 6.168,58 0.726,59 34.612,60 16.537,61 0.079,64 3,65 5.62}
{0 CHEMBL2024674,1 0.187,2 0.76,3 6.581,4 -0.059,5 -0.028,7 2,8 2,9 1,10 6,11 0.094,12 1.669,13 1,14 0.091,15 1,16 3.606,17 0.247,18 3,19 55.194,20 0.09,21 2.445,22 4.7,23 6.313,24 8,25 9.726,26 11.475,27 13.237,28 4.885,29 2.445,30 1,31 8.118,32 2.618,33 0.577,34 3,35 2,36 1,37 2.462,38 1,39 2.462,40 2.398,41 0.834,42 3.612,43 1.325,44 0.931,45 4.595,46 59.052,47 4.765,48 5.173,49 1.734,50 1,51 1,52 1,53 1,54 1,55 1,56 8.85,57 5.909,58 0.755,59 34.612,60 16.524,61 0.058,64 1,65 4.854}
{0 CHEMBL2178955,1 -0.081,2 1.045,3 7.298,4 0.091,5 0.115,9 2,10 11,11 0.077,12 1.52,13 6,14 0.066,15 2,16 3.785,17 0.855,18 5,19 157.39,20 -0.077,21 2.009,22 3.7,23 4.907,24 6.19,25 7.509,26 8.849,27 10.2,28 3.492,29 2.009,30 3,31 7.853,32 2.353,33 0.631,34 2,35 7,37 2.982,38 2,39 2.982,40 3.045,41 0.362,42 3.773,43 1.635,44 0.978,45 5.283,46 51.112,47 5.805,48 6.057,49 1.584,57 5.942,58 0.706,60 18.343,61 0.033,62 2,64 5,65 4}
{0 CHEMBL2178957,1 -0.097,2 1.127,3 7.703,4 0.137,5 0.055,6 1.716,7 1,9 2,10 16,11 0.074,12 1.562,13 10,14 0.067,15 4,16 3.823,17 1.108,18 5,19 355.844,20 -0.086,21 2.187,22 4.284,23 5.597,24 6.987,25 8.42,26 9.881,27 11.362,28 3.89,29 2.187,30 3,31 7.777,32 2.277,33 0.643,34 2,35 7,37 3.416,38 3,39 3.416,40 3.434,41 0.404,42 3.812,43 1.509,44 0.899,45 5.687,46 70.781,47 6.357,48 6.325,49 1.859,57 5.943,58 0.714,59 18.011,60 18.427,61 -0.019,62 2,63 2,64 17,65 4}
{0 CHEMBL2178958,1 -0.035,2 0.996,3 7.413,4 0.063,5 0.101,9 2,10 11,11 0.078,12 1.606,13 7,14 0.072,15 2,16 3.797,17 0.886,18 6,19 169.869,20 -0.045,21 2.446,22 4.712,23 6.325,24 8.01,25 9.735,26 11.482,27 13.243,28 4.885,29 2.446,30 4,31 7.982,32 2.482,33 0.609,34 3,35 7,37 3.091,38 2,39 3.091,40 3.045,41 0.499,42 3.786,43 1.516,44 1.035,45 5.352,46 71.22,47 6.023,48 6.188,49 1.507,50 1,51 1,52 1,53 1,54 1,55 1,56 9.273,57 6.176,58 0.712,59 16.602,60 18.722,61 0.071,62 2,64 6,65 4}
{0 CHEMBL2178959,1 -0.063,2 1.088,3 7.781,4 0.105,5 0.046,6 1.662,7 1,9 2,10 16,11 0.075,12 1.622,13 11,14 0.072,15 4,16 3.826,17 1.139,18 6,19 374.436,20 -0.065,21 2.446,22 4.966,23 6.54,24 8.191,25 9.884,26 11.604,27 13.342,28 4.885,29 2.446,30 4,31 7.874,32 2.374,33 0.629,34 3,35 7,37 3.442,38 3,39 3.442,40 3.434,41 0.5,42 3.817,43 1.416,44 0.935,45 5.733,46 86.994,47 6.575,48 6.424,49 1.748,50 1,51 1,52 1,53 1,54 1,55 1,56 9.527,57 6.176,58 0.718,59 34.612,60 18.778,61 0.011,62 2,63 2,64 18,65 4}
{0 CHEMBL2178960,1 -0.097,2 1.127,3 7.703,4 0.137,5 0.055,6 1.716,7 1,9 2,10 16,11 0.074,12 1.562,13 10,14 0.067,15 4,16 3.823,17 1.108,18 5,19 355.844,20 -0.086,21 2.187,22 4.284,23 5.597,24 6.987,25 8.42,26 9.881,27 11.362,28 3.89,29 2.187,30 3,31 7.777,32 2.277,33 0.643,34 2,35 7,37 3.416,38 3,39 3.416,40 3.434,41 0.404,42 3.812,43 1.509,44 0.899,45 5.687,46 70.781,47 6.357,48 6.325,49 1.859,57 5.943,58 0.714,59 18.011,60 18.427,61 -0.019,62 2,63 2,64 17,65 4}
{0 CHEMBL2178964,1 -0.049,2 0.841,3 7.711,4 0.1,5 0.043,6 1.597,9 2,10 14,11 0.071,12 1.55,13 13,14 0.075,15 3,16 3.854,17 1.362,18 5,19 325.632,20 -0.054,21 2.009,22 3.7,23 4.907,24 6.19,25 7.509,26 8.849,27 10.2,28 3.492,29 2.009,30 3,31 7.94,32 2.44,33 0.629,34 2,35 11,37 3.446,38 3,39 3.446,40 3.434,41 0.253,42 3.859,43 1.192,44 0.985,45 5.687,46 83.971,47 6.34,48 6.333,49 1.059,57 5.943,58 0.696,60 18.431,61 -0.036,62 2,63 2,64 14,65 5.301}
{0 CHEMBL2178965,1 0.012,2 0.837,3 7.711,4 0.118,5 0.043,6 1.637,9 2,10 15,11 0.072,12 1.564,13 16,14 0.079,15 3,16 3.854,17 1.313,18 5,19 327.535,20 -0.051,21 2.009,22 3.7,23 4.907,24 6.19,25 7.509,26 8.849,27 10.2,28 3.492,29 2.009,30 3,31 7.94,32 2.44,33 0.629,34 2,35 9,37 3.446,38 3,39 3.446,40 3.434,41 0.253,42 3.859,43 1.232,44 0.984,45 5.687,46 117.327,47 6.34,48 6.301,49 0.999,57 5.943,58 0.696,60 18.43,61 0.027,62 2,63 2,64 13,65 5.301}
{0 CHEMBL2178966,1 -0.05,2 1.062,3 7.711,4 0.118,5 0.095,6 1.792,9 2,10 14,11 0.073,12 1.546,13 14,14 0.074,15 3,16 3.855,17 1.251,18 5,19 313.66,20 -0.029,21 2.009,22 3.7,23 4.907,24 6.19,25 7.509,26 8.849,27 10.2,28 3.492,29 2.009,30 3,31 7.679,32 2.179,33 0.698,34 2,35 14,37 3.445,38 3,39 3.445,40 3.434,41 0.26,42 3.863,43 1.782,44 0.984,45 5.687,46 50.27,47 6.375,48 6.226,49 1.59,57 5.943,58 0.691,60 18.431,61 0.027,62 2,63 2,64 15,65 5.301}
{0 CHEMBL2178967,1 -0.055,2 1.062,3 7.711,4 0.141,5 0.107,6 1.832,9 2,10 17,11 0.073,12 1.544,13 16,14 0.074,15 3,16 3.855,17 1.282,18 5,19 317.866,20 -0.019,21 2.009,22 3.7,23 4.907,24 6.19,25 7.509,26 8.849,27 10.2,28 3.492,29 2.009,30 3,31 7.64,32 2.14,33 0.715,34 2,35 11,37 3.445,38 3,39 3.445,40 3.434,41 0.26,42 3.865,43 1.856,44 0.941,45 5.687,46 47.786,47 6.376,48 6.226,49 1.647,57 5.943,58 0.691,59 45.954,60 18.429,61 0.026,62 2,63 2,64 14,65 4}
{0 CHEMBL2178968,1 -0.099,2 1.114,3 7.711,4 0.108,5 0.065,6 1.735,9 2,10 12,11 0.073,12 1.55,13 16,14 0.07,15 5,16 3.829,17 1.226,18 5,19 292.743,20 -0.101,21 2.228,22 4.051,23 5.416,24 6.867,25 8.361,26 9.884,27 11.427,28 3.977,29 2.228,30 4,31 7.742,32 2.242,33 0.763,34 1,35 10,37 3.434,38 3,39 3.434,40 3.434,41 0.333,42 3.829,43 1.95,44 0.907,45 5.687,46 46.598,47 6.261,48 6.183,49 1.663,57 5.958,58 0.686,60 18.431,61 -0.038,62 2,63 2,64 10,65 4}
{0 CHEMBL2178969,1 -0.074,2 1.066,3 7.711,4 0.12,5 0.109,6 1.797,9 2,10 14,11 0.073,12 1.541,13 15,14 0.068,15 3,16 3.841,17 1.171,18 5,19 305.894,20 -0.057,21 2.009,22 3.7,23 4.907,24 6.19,25 7.509,26 8.849,27 10.2,28 3.492,29 2.009,30 4,31 7.662,32 2.162,33 0.755,34 2,35 10,37 3.442,38 3,39 3.442,40 3.434,41 0.267,42 3.838,43 1.85,44 0.977,45 5.687,46 49.912,47 6.338,48 6.212,49 1.637,57 5.943,58 0.686,60 18.429,61 0.039,62 2,63 2,64 10,65 4}
{0 CHEMBL2178971,1 -0.134,2 1.133,3 7.703,4 0.129,5 0.073,6 1.768,7 1,9 2,10 13,11 0.073,12 1.529,13 10,14 0.069,15 3,16 3.822,17 0.941,18 5,19 272.524,20 -0.112,21 2.009,22 3.704,23 4.907,24 6.19,25 7.509,26 8.849,27 10.2,28 3.492,29 2.009,30 3,31 7.711,32 2.211,33 0.742,34 2,35 7,37 3.416,38 3,39 3.416,40 3.434,41 0.339,42 3.81,43 1.778,44 0.975,45 5.687,46 49.271,47 6.163,48 6.178,49 1.553,57 5.943,58 0.697,60 18.427,61 0.035,62 2,63 2,64 9,65 4}
{0 CHEMBL2178973,1 -0.089,2 1.135,3 7.703,4 0.117,5 0.088,6 1.872,9 2,10 13,11 0.075,12 1.528,13 12,14 0.059,15 3,16 3.825,17 0.997,18 5,19 319.364,20 -0.087,21 2.009,22 3.75,23 4.918,24 6.192,25 7.51,26 8.849,27 10.2,28 3.492,29 2.009,30 5,31 7.61,32 2.11,33 1.015,34 2,35 7,37 3.417,38 3,39 3.417,40 3.434,41 0.36,42 3.815,43 1.675,44 0.999,45 5.687,46 47.853,47 6.371,48 6.265,49 1.571,57 5.943,58 0.687,60 18.427,61 0.062,62 2,63 2,64 9,65 4}
{0 CHEMBL2178974,1 -0.164,2 1.259,3 7.703,4 0.064,5 0.071,6 1.841,9 2,10 16,11 0.074,12 1.561,13 12,14 0.068,15 6,16 3.826,17 1.483,18 5,19 407.12,20 -0.192,21 2.208,22 4.31,23 5.623,24 7.025,25 8.474,26 9.952,27 11.453,28 3.912,29 2.208,30 5,31 7.685,32 2.185,33 0.755,34 2,35 7,37 3.417,38 3,39 3.417,40 3.434,41 0.398,42 3.816,43 1.573,44 0.946,45 5.687,46 64.201,47 6.497,48 6.499,49 1.977,57 5.943,58 0.707,60 18.427,61 0.014,62 2,63 2,64 9,65 4}
{0 CHEMBL2178975,1 -0.086,2 1.12,3 7.703,4 0.115,5 0.096,6 1.888,7 1,9 2,10 13,11 0.075,12 1.525,13 11,14 0.059,15 3,16 3.826,17 0.997,18 5,19 319.364,20 -0.08,21 2.009,22 3.725,23 4.912,24 6.191,25 7.51,26 8.849,27 10.2,28 3.492,29 2.009,30 4,31 7.581,32 2.081,33 0.903,34 2,35 7,36 1,37 3.417,38 3,39 3.417,40 3.434,41 0.336,42 3.815,43 1.709,44 0.981,45 5.687,46 44.004,47 6.377,48 6.263,49 1.613,57 5.943,58 0.687,59 18.011,60 18.427,61 0.075,62 2,63 2,64 9,65 4}
{0 CHEMBL2178977,1 -0.088,2 1.088,3 7.298,4 0.082,5 0.067,9 2,10 11,11 0.077,12 1.535,13 6,14 0.068,15 4,16 3.776,17 0.91,18 5,19 148.68,20 -0.109,21 2.228,22 4.051,23 5.416,24 6.867,25 8.361,26 9.884,27 11.427,28 3.977,29 2.228,30 3,31 7.967,32 2.467,33 0.666,34 1,35 7,37 2.978,38 2,39 2.978,40 3.045,41 0.457,42 3.764,43 1.754,44 0.881,45 5.283,46 51.111,47 5.728,48 6.033,49 1.701,57 5.956,58 0.706,60 18.344,61 -0.063,62 2,64 6,65 4}
{0 CHEMBL2178978,1 -0.081,2 1.045,3 7.298,4 0.091,5 0.115,9 2,10 11,11 0.077,12 1.52,13 6,14 0.066,15 2,16 3.785,17 0.855,18 5,19 157.39,20 -0.077,21 2.009,22 3.7,23 4.907,24 6.19,25 7.509,26 8.849,27 10.2,28 3.492,29 2.009,30 3,31 7.853,32 2.353,33 0.631,34 2,35 7,37 2.982,38 2,39 2.982,40 3.045,41 0.362,42 3.773,43 1.635,44 0.978,45 5.283,46 51.112,47 5.805,48 6.057,49 1.584,57 5.942,58 0.706,60 18.343,61 0.033,62 2,64 5,65 4}
{0 CHEMBL2178979,1 -0.09,2 1.079,3 7.618,4 0.143,5 0.067,6 1.717,9 2,10 11,11 0.073,12 1.542,13 11,14 0.07,15 5,16 3.807,17 0.997,18 5,19 238.125,20 -0.092,21 2.228,22 4.051,23 5.416,24 6.867,25 8.361,26 9.884,27 11.427,28 3.977,29 2.228,30 3,31 7.784,32 2.284,33 0.744,34 1,35 7,37 3.376,38 3,39 3.376,40 3.434,41 0.411,42 3.795,43 1.953,44 0.929,45 5.638,46 40.815,47 5.983,48 6.04,49 1.652,57 5.958,58 0.69,60 18.425,61 -0.006,62 2,63 2,64 9,65 4}
{0 CHEMBL2179405,1 -0.157,2 1.271,3 7.719,4 0.159,5 0.087,6 1.836,9 2,10 11,11 0.071,12 1.588,13 11,14 0.082,15 5,16 3.845,17 1.219,18 5,19 281.196,20 -0.153,21 2.228,22 4.051,23 5.416,24 6.867,25 8.361,26 9.884,27 11.427,28 3.977,29 2.228,30 3,31 7.694,32 2.194,33 0.806,34 1,35 7,37 3.421,38 3,39 3.421,40 3.434,41 0.363,42 3.855,43 1.72,44 0.461,45 5.687,46 41.338,47 6.216,48 6.198,49 1.657,57 5.958,58 0.71,59 34.612,60 19.064,61 -0.211,62 2,63 2,64 9,65 4}
{0 CHEMBL2179406,1 -0.097,2 1.103,3 8.196,4 0.15,5 0.124,6 1.898,9 2,10 15,11 0.071,12 1.557,13 16,14 0.069,15 3,16 3.849,17 0.973,18 7,19 280.67,20 -0.09,21 2.009,22 3.7,23 4.907,24 6.19,25 7.509,26 8.849,27 10.2,28 3.492,29 2.009,30 3,31 7.602,32 2.102,33 0.714,34 2,35 7,37 3.423,38 3,39 3.423,40 4.263,41 0.29,42 3.855,43 1.914,44 0.994,45 6.279,46 40.642,47 6.245,48 6.163,49 1.665,57 5.943,58 0.684,60 18.43,61 0.03,62 2,63 2,64 12,65 4}
{0 CHEMBL2179407,1 -0.039,2 1.088,3 7.711,4 0.124,5 0.132,6 1.936,9 2,10 15,11 0.073,12 1.538,13 17,14 0.068,15 3,16 3.839,17 1.171,18 10,19 305.894,20 -0.059,21 2.009,22 3.7,23 4.907,24 6.19,25 7.509,26 8.849,27 10.2,28 3.492,29 2.009,30 3,31 7.549,32 2.049,33 0.698,34 2,35 12,37 3.422,38 3,39 3.422,40 3.434,41 0.267,42 3.841,43 1.744,44 0.968,45 5.687,46 38.996,47 6.374,48 6.227,49 1.658,57 5.943,58 0.686,60 18.429,61 -0.002,62 2,63 2,64 14,65 5.301}
{0 CHEMBL2179408,1 -0.118,2 1.175,3 7.703,4 0.133,5 0.027,6 1.654,7 1,9 2,10 14,11 0.074,12 1.575,13 11,14 0.069,15 6,16 3.814,17 1.164,18 5,19 342.693,20 -0.119,21 2.228,22 4.495,23 5.885,24 7.349,25 8.852,26 10.38,27 11.924,28 3.977,29 2.228,30 3,31 7.854,32 2.354,33 0.663,34 1,35 7,37 3.405,38 3,39 3.405,40 3.434,41 0.471,42 3.805,43 1.571,44 0.833,45 5.687,46 68.611,47 6.28,48 6.298,49 1.932,57 5.958,58 0.714,59 18.011,60 18.429,61 -0.092,62 2,63 2,64 17,65 4}
{0 CHEMBL289651,1 -0.076,2 1.046,3 7.154,4 0.04,5 0.02,9 2,10 8,11 0.082,12 1.524,13 4,14 0.074,15 2,16 3.775,17 0.497,18 5,19 135.517,20 -0.09,21 2.009,22 3.7,23 4.907,24 6.19,25 7.509,26 8.849,27 10.2,28 3.492,29 2.009,30 2,31 7.645,32 2.145,33 0.675,34 2,35 6,37 2.968,38 2,39 2.968,40 3.045,41 0.406,42 3.766,43 1.969,44 0.979,45 5.209,46 31.857,47 5.59,48 5.645,49 1.859,57 5.935,58 0.699,60 18.181,61 0.053,64 4,65 4}
{0 CHEMBL554269,1 0.071,2 0.973,3 8.751,4 0.023,5 -0.071,6 2.171,7 11,8 17,9 1,10 42,11 0.071,12 1.587,13 29,14 0.085,15 2,16 4.073,17 7.044,18 4,19 2577.33,20 0.05,21 2.808,22 5.965,23 7.432,24 9.074,25 10.853,26 12.732,27 14.678,28 5.18,29 2.808,30 1,31 8.036,32 2.536,33 0.601,34 15,35 27,36 18,37 4.4,38 6,39 4.4,40 4.111,41 0.463,42 4.06,43 1.08,44 1.015,45 6.592,46 479.564,47 7.361,48 8.169,49 0.89,57 6.094,58 0.724,59 198.282,60 20.204,61 0.08,63 1,64 36,65 5.991}
{0 CHEMBL67279,1 -0.013,2 1.051,3 6.605,4 0.069,5 -0.363,7 4,8 2,9 1,11 0.079,12 1.594,14 0.116,15 1,16 3.762,17 0.444,18 2,19 45.714,20 -0.11,21 1.984,22 3.076,23 4.28,24 5.57,25 6.898,26 8.246,27 9.604,28 3.451,29 1.984,31 8.2,32 2.7,33 0.529,34 1,37 2.101,38 1,39 2.101,40 2.398,41 0.354,42 3.571,43 1.438,44 1.033,45 4.595,46 62.146,47 4.88,48 5.134,49 1.659,57 5.717,58 0.772,59 34.612,60 18.155,61 0.024,62 2,65 7.18}
