{
  "data_features": {
    "feature": [
      {
        "data_type": "nominal",
        "index": "0",
        "is_ignore": "false",
        "is_row_identifier": "true",
        "is_target": "false",
        "name": "molecule_id",
        "nominal_value": [
          "CHEMBL10",
          "CHEMBL101253",
          "CHEMBL103667",
          "CHEMBL104466",
          "CHEMBL105442",
          "CHEMBL1075628",
          "CHEMBL1076193",
          "CHEMBL1076194",
          "CHEMBL1076195",
          "CHEMBL1076196",
          "CHEMBL1076197",
          "CHEMBL1076198",
          "CHEMBL1076199",
          "CHEMBL1076200",
          "CHEMBL1076201",
          "CHEMBL1076202",
          "CHEMBL1076203",
          "CHEMBL1076432",
          "CHEMBL1076433",
          "CHEMBL1076436",
          "CHEMBL1076437",
          "CHEMBL1076465",
          "CHEMBL1076466",
          "CHEMBL1076468",
          "CHEMBL1076469",
          "CHEMBL1076470",
          "CHEMBL1076471",
          "CHEMBL1076472",
          "CHEMBL1076473",
          "CHEMBL1076474",
          "CHEMBL1076475",
          "CHEMBL1076476",
          "CHEMBL1076477",
          "CHEMBL1076478",
          "CHEMBL1076480",
          "CHEMBL1076533",
          "CHEMBL1077291",
          "CHEMBL1079422",
          "CHEMBL1079424",
          "CHEMBL1079945",
          "CHEMBL1079946",
          "CHEMBL1080294",
          "CHEMBL1080299",
          "CHEMBL1080930",
          "CHEMBL1081090",
          "CHEMBL1081198",
          "CHEMBL1081436",
          "CHEMBL1082440",
          "CHEMBL1082829",
          "CHEMBL1083527",
          "CHEMBL1084337",
          "CHEMBL1084546",
          "CHEMBL1085511",
          "CHEMBL1086731",
          "CHEMBL1086860",
          "CHEMBL1087002",
          "CHEMBL1087127",
          "CHEMBL1087128",
          "CHEMBL1087513",
          "CHEMBL1087524",
          "CHEMBL1087636",
          "CHEMBL1087638",
          "CHEMBL1087649",
          "CHEMBL1088027",
          "CHEMBL1088028",
          "CHEMBL1088153",
          "CHEMBL1088429",
          "CHEMBL1090356",
          "CHEMBL1090360",
          "CHEMBL1094408",
          "CHEMBL1095873",
          "CHEMBL115220",
          "CHEMBL116070",
          "CHEMBL116306",
          "CHEMBL1164177",
          "CHEMBL1164262",
          "CHEMBL1164264",
          "CHEMBL1164353",
          "CHEMBL1164453",
          "CHEMBL1164457",
          "CHEMBL1165507",
          "CHEMBL116893",
          "CHEMBL116907",
          "CHEMBL117206",
          "CHEMBL1173055",
          "CHEMBL1173655",
          "CHEMBL117440",
          "CHEMBL117697",
          "CHEMBL1190711",
          "CHEMBL119385",
          "CHEMBL120077",
          "CHEMBL1230020",
          "CHEMBL1230122",
          "CHEMBL1230607",
          "CHEMBL1236107",
          "CHEMBL1236126",
          "CHEMBL1240676",
          "CHEMBL1240677",
          "CHEMBL1240703",
          "CHEMBL1240829",
          "CHEMBL1241473",
          "CHEMBL1241669",
          "CHEMBL1241670",
          "CHEMBL1241674",
          "CHEMBL1241764",
          "CHEMBL1242373",
          "CHEMBL124660",
          "CHEMBL1254007",
          "CHEMBL1258913",
          "CHEMBL1270230",
          "CHEMBL127898",
          "CHEMBL1287853",
          "CHEMBL1289926",
          "CHEMBL1336",
          "CHEMBL1375418",
          "CHEMBL1375640",
          "CHEMBL1381197",
          "CHEMBL1419458",
          "CHEMBL1421",
          "CHEMBL143703",
          "CHEMBL1461728",
          "CHEMBL14762",
          "CHEMBL150894",
          "CHEMBL1516890",
          "CHEMBL1614701",
          "CHEMBL1614705",
          "CHEMBL162",
          "CHEMBL162034",
          "CHEMBL1624529",
          "CHEMBL162622",
          "CHEMBL1630107",
          "CHEMBL1630108",
          "CHEMBL1630109",
          "CHEMBL1630110",
          "CHEMBL1630111",
          "CHEMBL1630112",
          "CHEMBL1630113",
          "CHEMBL1630114",
          "CHEMBL1630115",
          "CHEMBL1630116",
          "CHEMBL1630117",
          "CHEMBL1630118",
          "CHEMBL164",
          "CHEMBL1642132",
          "CHEMBL1642133",
          "CHEMBL1642134",
          "CHEMBL1642135",
          "CHEMBL1642136",
          "CHEMBL1642137",
          "CHEMBL1642138",
          "CHEMBL1642139",
          "CHEMBL1642140",
          "CHEMBL1642141",
          "CHEMBL1642142",
          "CHEMBL1642143",
          "CHEMBL1642144",
          "CHEMBL1642145",
          "CHEMBL1642146",
          "CHEMBL1642148",
          "CHEMBL1642149",
          "CHEMBL1642253",
          "CHEMBL1642254",
          "CHEMBL1642255",
          "CHEMBL1642256",
          "CHEMBL1642257",
          "CHEMBL1642258",
          "CHEMBL1642259",
          "CHEMBL1642260",
          "CHEMBL1642261",
          "CHEMBL1642262",
          "CHEMBL1642263",
          "CHEMBL1642264",
          "CHEMBL1642265",
          "CHEMBL1644798",
          "CHEMBL1644799",
          "CHEMBL1644800",
          "CHEMBL1644801",
          "CHEMBL1644802",
          "CHEMBL1644804",
          "CHEMBL1644805",
          "CHEMBL1644806",
          "CHEMBL1644808",
          "CHEMBL1644809",
          "CHEMBL1644810",
          "CHEMBL1644811",
          "CHEMBL1644812",
          "CHEMBL1644813",
          "CHEMBL1644815",
          "CHEMBL1651521",
          "CHEMBL1667935",
          "CHEMBL1682341",
          "CHEMBL1682345",
          "CHEMBL1682346",
          "CHEMBL1682357",
          "CHEMBL1682359",
          "CHEMBL1682360",
          "CHEMBL1682540",
          "CHEMBL1682545",
          "CHEMBL1682546",
          "CHEMBL1682552",
          "CHEMBL1682553",
          "CHEMBL1682558",
          "CHEMBL1688215",
          "CHEMBL1688359",
          "CHEMBL1688360",
          "CHEMBL1688361",
          "CHEMBL1688362",
          "CHEMBL1688363",
          "CHEMBL1721885",
          "CHEMBL1727312",
          "CHEMBL17370",
          "CHEMBL1738758",
          "CHEMBL1738841",
          "CHEMBL175862",
          "CHEMBL1760035",
          "CHEMBL1760057",
          "CHEMBL176019",
          "CHEMBL176078",
          "CHEMBL1762110",
          "CHEMBL1762114",
          "CHEMBL1765781",
          "CHEMBL177298",
          "CHEMBL1774056",
          "CHEMBL177688",
          "CHEMBL1779202",
          "CHEMBL1784637",
          "CHEMBL178737",
          "CHEMBL1789941",
          "CHEMBL1789964",
          "CHEMBL1795355",
          "CHEMBL1796241",
          "CHEMBL1796242",
          "CHEMBL1796243",
          "CHEMBL1796244",
          "CHEMBL1796245",
          "CHEMBL1796246",
          "CHEMBL1796247",
          "CHEMBL1796249",
          "CHEMBL1796251",
          "CHEMBL1796253",
          "CHEMBL1796254",
          "CHEMBL1796256",
          "CHEMBL1796257",
          "CHEMBL1796258",
          "CHEMBL180022",
          "CHEMBL1806514",
          "CHEMBL1807757",
          "CHEMBL1807758",
          "CHEMBL1807759",
          "CHEMBL1807760",
          "CHEMBL1807761",
          "CHEMBL1807762",
          "CHEMBL1807763",
          "CHEMBL1807764",
          "CHEMBL1807765",
          "CHEMBL1807766",
          "CHEMBL1807767",
          "CHEMBL1807768",
          "CHEMBL1807769",
          "CHEMBL1807770",
          "CHEMBL1807771",
          "CHEMBL1807772",
          "CHEMBL1808087",
          "CHEMBL1808088",
          "CHEMBL1808089",
          "CHEMBL1808090",
          "CHEMBL1808091",
          "CHEMBL1808092",
          "CHEMBL1808093",
          "CHEMBL1808094",
          "CHEMBL1808095",
          "CHEMBL1808096",
          "CHEMBL1808097",
          "CHEMBL1808098",
          "CHEMBL1808099",
          "CHEMBL1808100",
          "CHEMBL1808101",
          "CHEMBL1808102",
          "CHEMBL1808103",
          "CHEMBL1808104",
          "CHEMBL1808105",
          "CHEMBL1808106",
          "CHEMBL1808107",
          "CHEMBL1808108",
          "CHEMBL1808220",
          "CHEMBL1808221",
          "CHEMBL1808222",
          "CHEMBL1808223",
          "CHEMBL1808224",
          "CHEMBL1808225",
          "CHEMBL1808226",
          "CHEMBL1809044",
          "CHEMBL1817789",
          "CHEMBL1821735",
          "CHEMBL1822511",
          "CHEMBL1822512",
          "CHEMBL1822513",
          "CHEMBL1822514",
          "CHEMBL1822515",
          "CHEMBL1822516",
          "CHEMBL1822517",
          "CHEMBL1822518",
          "CHEMBL1822519",
          "CHEMBL1822520",
          "CHEMBL1822521",
          "CHEMBL1822522",
          "CHEMBL1822523",
          "CHEMBL1822524",
          "CHEMBL1822525",
          "CHEMBL1822526",
          "CHEMBL1822527",
          "CHEMBL1823221",
          "CHEMBL1825138",
          "CHEMBL1834657",
          "CHEMBL183844",
          "CHEMBL184847",
          "CHEMBL185569",
          "CHEMBL1870314",
          "CHEMBL188386",
          "CHEMBL188502",
          "CHEMBL18879",
          "CHEMBL1891772",
          "CHEMBL189584",
          "CHEMBL1906225",
          "CHEMBL1908391",
          "CHEMBL1908392",
          "CHEMBL1908393",
          "CHEMBL1908394",
          "CHEMBL1908395",
          "CHEMBL1908396",
          "CHEMBL1908397",
          "CHEMBL190984",
          "CHEMBL191003",
          "CHEMBL1922961",
          "CHEMBL1922967",
          "CHEMBL1922968",
          "CHEMBL1922969",
          "CHEMBL1922970",
          "CHEMBL1922971",
          "CHEMBL1922972",
          "CHEMBL1922973",
          "CHEMBL1922974",
          "CHEMBL1922976",
          "CHEMBL1922980",
          "CHEMBL1922981",
          "CHEMBL1922983",
          "CHEMBL1922984",
          "CHEMBL1922985",
          "CHEMBL1922986",
          "CHEMBL1923343",
          "CHEMBL1923344",
          "CHEMBL1923345",
          "CHEMBL1923346",
          "CHEMBL1923347",
          "CHEMBL1923348",
          "CHEMBL1923349",
          "CHEMBL1923350",
          "CHEMBL1923351",
          "CHEMBL1923352",
          "CHEMBL1923353",
          "CHEMBL1923355",
          "CHEMBL1923357",
          "CHEMBL1923358",
          "CHEMBL1923359",
          "CHEMBL1923360",
          "CHEMBL1923361",
          "CHEMBL1923362",
          "CHEMBL1923363",
          "CHEMBL1923364",
          "CHEMBL1923365",
          "CHEMBL1923366",
          "CHEMBL1923368",
          "CHEMBL1923369",
          "CHEMBL1923371",
          "CHEMBL1923372",
          "CHEMBL1923379",
          "CHEMBL1923381",
          "CHEMBL1923382",
          "CHEMBL1923383",
          "CHEMBL1923384",
          "CHEMBL1923385",
          "CHEMBL1923386",
          "CHEMBL1923387",
          "CHEMBL1923388",
          "CHEMBL1923389",
          "CHEMBL1923393",
          "CHEMBL1929238",
          "CHEMBL1933552",
          "CHEMBL1933576",
          "CHEMBL1933582",
          "CHEMBL1934334",
          "CHEMBL1934353",
          "CHEMBL1934626",
          "CHEMBL1939320",
          "CHEMBL1939321",
          "CHEMBL1939481",
          "CHEMBL1939482",
          "CHEMBL1939483",
          "CHEMBL1939484",
          "CHEMBL1939485",
          "CHEMBL1939486",
          "CHEMBL1939487",
          "CHEMBL1939488",
          "CHEMBL1939489",
          "CHEMBL1939491",
          "CHEMBL1939492",
          "CHEMBL1939493",
          "CHEMBL1939494",
          "CHEMBL1944953",
          "CHEMBL1944954",
          "CHEMBL1944955",
          "CHEMBL1944956",
          "CHEMBL1944957",
          "CHEMBL1944958",
          "CHEMBL1944959",
          "CHEMBL1944960",
          "CHEMBL1944961",
          "CHEMBL1944962",
          "CHEMBL1944963",
          "CHEMBL1944964",
          "CHEMBL1944965",
          "CHEMBL1944966",
          "CHEMBL1944967",
          "CHEMBL1944968",
          "CHEMBL1944969",
          "CHEMBL1945455",
          "CHEMBL1945456",
          "CHEMBL1945457",
          "CHEMBL1945458",
          "CHEMBL1945459",
          "CHEMBL1945460",
          "CHEMBL1945461",
          "CHEMBL1945462",
          "CHEMBL1945463",
          "CHEMBL1945464",
          "CHEMBL1945465",
          "CHEMBL1945466",
          "CHEMBL1945467",
          "CHEMBL1945559",
          "CHEMBL1945929",
          "CHEMBL1945930",
          "CHEMBL1945931",
          "CHEMBL1946103",
          "CHEMBL1946104",
          "CHEMBL1946209",
          "CHEMBL1946210",
          "CHEMBL1946211",
          "CHEMBL1946212",
          "CHEMBL1946213",
          "CHEMBL1946214",
          "CHEMBL1946215",
          "CHEMBL1949788",
          "CHEMBL1949789",
          "CHEMBL1957085",
          "CHEMBL1957190",
          "CHEMBL1958401",
          "CHEMBL196363",
          "CHEMBL1964290",
          "CHEMBL1964307",
          "CHEMBL1964399",
          "CHEMBL1964413",
          "CHEMBL1964444",
          "CHEMBL1964644",
          "CHEMBL1964687",
          "CHEMBL1964692",
          "CHEMBL1964777",
          "CHEMBL1964804",
          "CHEMBL1964937",
          "CHEMBL1965131",
          "CHEMBL1965423",
          "CHEMBL1965495",
          "CHEMBL1965507",
          "CHEMBL1965570",
          "CHEMBL1965589",
          "CHEMBL1965631",
          "CHEMBL1965660",
          "CHEMBL1965836",
          "CHEMBL1965845",
          "CHEMBL1965910",
          "CHEMBL1965988",
          "CHEMBL1966035",
          "CHEMBL1966069",
          "CHEMBL1966087",
          "CHEMBL1966279",
          "CHEMBL1966343",
          "CHEMBL1966425",
          "CHEMBL1966514",
          "CHEMBL1966524",
          "CHEMBL1966628",
          "CHEMBL1966703",
          "CHEMBL1966722",
          "CHEMBL1966808",
          "CHEMBL1966816",
          "CHEMBL1967094",
          "CHEMBL1967116",
          "CHEMBL1967302",
          "CHEMBL1967531",
          "CHEMBL1967538",
          "CHEMBL1967544",
          "CHEMBL1967560",
          "CHEMBL1967564",
          "CHEMBL1967720",
          "CHEMBL1967878",
          "CHEMBL1967887",
          "CHEMBL1968070",
          "CHEMBL1968127",
          "CHEMBL1968151",
          "CHEMBL1968245",
          "CHEMBL1968380",
          "CHEMBL1968406",
          "CHEMBL1968590",
          "CHEMBL1968705",
          "CHEMBL1968791",
          "CHEMBL1968850",
          "CHEMBL1968926",
          "CHEMBL1969042",
          "CHEMBL1969049",
          "CHEMBL1969102",
          "CHEMBL1969126",
          "CHEMBL1969156",
          "CHEMBL1969190",
          "CHEMBL1969264",
          "CHEMBL1969301",
          "CHEMBL1969372",
          "CHEMBL1969502",
          "CHEMBL1969506",
          "CHEMBL1969523",
          "CHEMBL1969537",
          "CHEMBL1969561",
          "CHEMBL1969588",
          "CHEMBL1969664",
          "CHEMBL1969735",
          "CHEMBL1969755",
          "CHEMBL1969843",
          "CHEMBL1969879",
          "CHEMBL1970074",
          "CHEMBL1970083",
          "CHEMBL1970104",
          "CHEMBL1970142",
          "CHEMBL1970189",
          "CHEMBL1970203",
          "CHEMBL1970217",
          "CHEMBL1970314",
          "CHEMBL1970317",
          "CHEMBL1970340",
          "CHEMBL1970369",
          "CHEMBL1970522",
          "CHEMBL1970709",
          "CHEMBL1970735",
          "CHEMBL1970806",
          "CHEMBL1970873",
          "CHEMBL1970879",
          "CHEMBL1970903",
          "CHEMBL1970913",
          "CHEMBL1971017",
          "CHEMBL1971021",
          "CHEMBL1971141",
          "CHEMBL1971149",
          "CHEMBL1971186",
          "CHEMBL1971245",
          "CHEMBL1971430",
          "CHEMBL1971649",
          "CHEMBL1971694",
          "CHEMBL1971801",
          "CHEMBL1971943",
          "CHEMBL1971947",
          "CHEMBL1972119",
          "CHEMBL1972125",
          "CHEMBL1972142",
          "CHEMBL1972158",
          "CHEMBL1972183",
          "CHEMBL1972221",
          "CHEMBL1972250",
          "CHEMBL1972258",
          "CHEMBL1972276",
          "CHEMBL1972362",
          "CHEMBL1972365",
          "CHEMBL1972489",
          "CHEMBL1972568",
          "CHEMBL1972576",
          "CHEMBL1972584",
          "CHEMBL1972659",
          "CHEMBL1972820",
          "CHEMBL1972840",
          "CHEMBL1972849",
          "CHEMBL1972937",
          "CHEMBL1973098",
          "CHEMBL1973142",
          "CHEMBL1973145",
          "CHEMBL1973211",
          "CHEMBL1973348",
          "CHEMBL1973395",
          "CHEMBL1973399",
          "CHEMBL1973483",
          "CHEMBL1973540",
          "CHEMBL1973711",
          "CHEMBL1973808",
          "CHEMBL1973860",
          "CHEMBL1973893",
          "CHEMBL1973937",
          "CHEMBL1974254",
          "CHEMBL1974288",
          "CHEMBL1974310",
          "CHEMBL1974328",
          "CHEMBL1974416",
          "CHEMBL1974457",
          "CHEMBL1974664",
          "CHEMBL1974702",
          "CHEMBL1974803",
          "CHEMBL1974870",
          "CHEMBL1974935",
          "CHEMBL1975121",
          "CHEMBL1975128",
          "CHEMBL1975138",
          "CHEMBL1975208",
          "CHEMBL1975233",
          "CHEMBL1975256",
          "CHEMBL1975418",
          "CHEMBL1975490",
          "CHEMBL1975500",
          "CHEMBL1975534",
          "CHEMBL1975647",
          "CHEMBL1975787",
          "CHEMBL1975900",
          "CHEMBL1976090",
          "CHEMBL1976093",
          "CHEMBL1976134",
          "CHEMBL1976220",
          "CHEMBL1976240",
          "CHEMBL1976328",
          "CHEMBL1976420",
          "CHEMBL1976455",
          "CHEMBL197652",
          "CHEMBL1976732",
          "CHEMBL1976872",
          "CHEMBL1977041",
          "CHEMBL1977135",
          "CHEMBL1977148",
          "CHEMBL1977223",
          "CHEMBL1977346",
          "CHEMBL1977374",
          "CHEMBL1977619",
          "CHEMBL1977681",
          "CHEMBL1977814",
          "CHEMBL1978014",
          "CHEMBL1978099",
          "CHEMBL1978200",
          "CHEMBL1978448",
          "CHEMBL1979057",
          "CHEMBL1979093",
          "CHEMBL1979176",
          "CHEMBL1979252",
          "CHEMBL1979318",
          "CHEMBL1979357",
          "CHEMBL1979516",
          "CHEMBL1979554",
          "CHEMBL1979577",
          "CHEMBL1979718",
          "CHEMBL1979855",
          "CHEMBL1979883",
          "CHEMBL1979970",
          "CHEMBL1980142",
          "CHEMBL1980144",
          "CHEMBL1980161",
          "CHEMBL1980163",
          "CHEMBL1980297",
          "CHEMBL1980391",
          "CHEMBL1980489",
          "CHEMBL1980540",
          "CHEMBL1980704",
          "CHEMBL1980715",
          "CHEMBL1980802",
          "CHEMBL1980896",
          "CHEMBL1980995",
          "CHEMBL1981045",
          "CHEMBL1981047",
          "CHEMBL1981079",
          "CHEMBL1981410",
          "CHEMBL1981720",
          "CHEMBL1981725",
          "CHEMBL1981782",
          "CHEMBL1982122",
          "CHEMBL1982135",
          "CHEMBL1982167",
          "CHEMBL1982361",
          "CHEMBL1982383",
          "CHEMBL1982465",
          "CHEMBL1982466",
          "CHEMBL1982476",
          "CHEMBL1982506",
          "CHEMBL1982563",
          "CHEMBL1982610",
          "CHEMBL1982660",
          "CHEMBL1982711",
          "CHEMBL1982866",
          "CHEMBL1982874",
          "CHEMBL1982880",
          "CHEMBL1982924",
          "CHEMBL1982957",
          "CHEMBL1982980",
          "CHEMBL1982992",
          "CHEMBL1983006",
          "CHEMBL1983025",
          "CHEMBL1983111",
          "CHEMBL1983195",
          "CHEMBL1983309",
          "CHEMBL1983449",
          "CHEMBL1983534",
          "CHEMBL1983923",
          "CHEMBL1983932",
          "CHEMBL1983945",
          "CHEMBL1983963",
          "CHEMBL198399",
          "CHEMBL1984038",
          "CHEMBL1984044",
          "CHEMBL1984162",
          "CHEMBL1984191",
          "CHEMBL1984206",
          "CHEMBL1984274",
          "CHEMBL1984363",
          "CHEMBL1984367",
          "CHEMBL1984432",
          "CHEMBL1984541",
          "CHEMBL1984586",
          "CHEMBL1984633",
          "CHEMBL1984700",
          "CHEMBL1984711",
          "CHEMBL1984788",
          "CHEMBL1984842",
          "CHEMBL1985074",
          "CHEMBL1985092",
          "CHEMBL1985095",
          "CHEMBL1985311",
          "CHEMBL1985406",
          "CHEMBL1985566",
          "CHEMBL1985580",
          "CHEMBL1986139",
          "CHEMBL1986186",
          "CHEMBL1986263",
          "CHEMBL1986328",
          "CHEMBL1986499",
          "CHEMBL1986530",
          "CHEMBL1986588",
          "CHEMBL1986597",
          "CHEMBL1986603",
          "CHEMBL1986781",
          "CHEMBL1986869",
          "CHEMBL1986943",
          "CHEMBL1986970",
          "CHEMBL1987007",
          "CHEMBL1987009",
          "CHEMBL1987034",
          "CHEMBL1987054",
          "CHEMBL1987143",
          "CHEMBL1987359",
          "CHEMBL1987533",
          "CHEMBL1987648",
          "CHEMBL1987679",
          "CHEMBL1987756",
          "CHEMBL1987793",
          "CHEMBL1987910",
          "CHEMBL1988075",
          "CHEMBL1988153",
          "CHEMBL1988163",
          "CHEMBL1988173",
          "CHEMBL1988300",
          "CHEMBL1988370",
          "CHEMBL1988387",
          "CHEMBL1988437",
          "CHEMBL1988537",
          "CHEMBL1988594",
          "CHEMBL1988608",
          "CHEMBL1988717",
          "CHEMBL1988838",
          "CHEMBL1988995",
          "CHEMBL1989029",
          "CHEMBL1989265",
          "CHEMBL1989423",
          "CHEMBL1989474",
          "CHEMBL1989518",
          "CHEMBL1989646",
          "CHEMBL1989708",
          "CHEMBL1989805",
          "CHEMBL1989834",
          "CHEMBL1989856",
          "CHEMBL1990212",
          "CHEMBL1990254",
          "CHEMBL1990288",
          "CHEMBL1990346",
          "CHEMBL1990415",
          "CHEMBL1990482",
          "CHEMBL1990496",
          "CHEMBL1990583",
          "CHEMBL1990821",
          "CHEMBL1990884",
          "CHEMBL1990885",
          "CHEMBL1990904",
          "CHEMBL1990912",
          "CHEMBL1991063",
          "CHEMBL1991078",
          "CHEMBL1991138",
          "CHEMBL1991180",
          "CHEMBL1991188",
          "CHEMBL1991285",
          "CHEMBL1991356",
          "CHEMBL1991395",
          "CHEMBL1991429",
          "CHEMBL1991434",
          "CHEMBL1991577",
          "CHEMBL1991640",
          "CHEMBL1991674",
          "CHEMBL1991678",
          "CHEMBL1991725",
          "CHEMBL1991728",
          "CHEMBL1991800",
          "CHEMBL1991846",
          "CHEMBL1991867",
          "CHEMBL1992242",
          "CHEMBL1992323",
          "CHEMBL1992342",
          "CHEMBL1992536",
          "CHEMBL1992555",
          "CHEMBL1992634",
          "CHEMBL1992645",
          "CHEMBL1992732",
          "CHEMBL1992740",
          "CHEMBL1992796",
          "CHEMBL1992922",
          "CHEMBL1992937",
          "CHEMBL199298",
          "CHEMBL1993166",
          "CHEMBL1993243",
          "CHEMBL1993424",
          "CHEMBL1993548",
          "CHEMBL1993584",
          "CHEMBL1993661",
          "CHEMBL1993722",
          "CHEMBL1993781",
          "CHEMBL1993941",
          "CHEMBL1994040",
          "CHEMBL1994074",
          "CHEMBL1994241",
          "CHEMBL1994321",
          "CHEMBL1994361",
          "CHEMBL1994526",
          "CHEMBL1994538",
          "CHEMBL1994693",
          "CHEMBL1994830",
          "CHEMBL1994864",
          "CHEMBL1994938",
          "CHEMBL1995172",
          "CHEMBL1995592",
          "CHEMBL1995736",
          "CHEMBL1995740",
          "CHEMBL1995813",
          "CHEMBL1995832",
          "CHEMBL1995927",
          "CHEMBL1996066",
          "CHEMBL1996111",
          "CHEMBL1996155",
          "CHEMBL1996208",
          "CHEMBL1996234",
          "CHEMBL1996390",
          "CHEMBL1996500",
          "CHEMBL1996543",
          "CHEMBL1996587",
          "CHEMBL1996780",
          "CHEMBL1996791",
          "CHEMBL1996817",
          "CHEMBL1996831",
          "CHEMBL1996837",
          "CHEMBL1996923",
          "CHEMBL1996931",
          "CHEMBL1996979",
          "CHEMBL1997023",
          "CHEMBL1997025",
          "CHEMBL1997129",
          "CHEMBL199723",
          "CHEMBL1997340",
          "CHEMBL1997349",
          "CHEMBL1997503",
          "CHEMBL1997534",
          "CHEMBL1997597",
          "CHEMBL1997617",
          "CHEMBL1997623",
          "CHEMBL1997759",
          "CHEMBL1997764",
          "CHEMBL1997822",
          "CHEMBL1997846",
          "CHEMBL1997872",
          "CHEMBL1998112",
          "CHEMBL1998121",
          "CHEMBL1998159",
          "CHEMBL1998193",
          "CHEMBL1998414",
          "CHEMBL1998545",
          "CHEMBL1998585",
          "CHEMBL1998611",
          "CHEMBL1998829",
          "CHEMBL199886",
          "CHEMBL1999112",
          "CHEMBL1999321",
          "CHEMBL1999428",
          "CHEMBL1999496",
          "CHEMBL1999556",
          "CHEMBL1999590",
          "CHEMBL1999714",
          "CHEMBL1999718",
          "CHEMBL1999749",
          "CHEMBL1999774",
          "CHEMBL1999811",
          "CHEMBL1999918",
          "CHEMBL1999931",
          "CHEMBL2000071",
          "CHEMBL2000104",
          "CHEMBL2000114",
          "CHEMBL2000271",
          "CHEMBL2000335",
          "CHEMBL2000345",
          "CHEMBL2000354",
          "CHEMBL2000393",
          "CHEMBL2000408",
          "CHEMBL2000429",
          "CHEMBL2000481",
          "CHEMBL2000508",
          "CHEMBL2000568",
          "CHEMBL2000685",
          "CHEMBL2000801",
          "CHEMBL2000832",
          "CHEMBL2000894",
          "CHEMBL2001224",
          "CHEMBL2001239",
          "CHEMBL2001257",
          "CHEMBL2001288",
          "CHEMBL2001485",
          "CHEMBL2001539",
          "CHEMBL2001547",
          "CHEMBL2001668",
          "CHEMBL2001751",
          "CHEMBL2001920",
          "CHEMBL2001923",
          "CHEMBL2001957",
          "CHEMBL2001998",
          "CHEMBL2002165",
          "CHEMBL2002240",
          "CHEMBL2002322",
          "CHEMBL2002323",
          "CHEMBL2002346",
          "CHEMBL2002373",
          "CHEMBL2002407",
          "CHEMBL2002446",
          "CHEMBL2002479",
          "CHEMBL2002649",
          "CHEMBL2002682",
          "CHEMBL2002702",
          "CHEMBL2002726",
          "CHEMBL2002992",
          "CHEMBL2003271",
          "CHEMBL2003286",
          "CHEMBL2003341",
          "CHEMBL2003420",
          "CHEMBL2003456",
          "CHEMBL2003482",
          "CHEMBL2003524",
          "CHEMBL2003638",
          "CHEMBL2003657",
          "CHEMBL2003817",
          "CHEMBL2004290",
          "CHEMBL2004311",
          "CHEMBL2004355",
          "CHEMBL2004365",
          "CHEMBL2004419",
          "CHEMBL2004438",
          "CHEMBL2004447",
          "CHEMBL2004544",
          "CHEMBL2004615",
          "CHEMBL2004692",
          "CHEMBL2004716",
          "CHEMBL2004771",
          "CHEMBL2004871",
          "CHEMBL2004872",
          "CHEMBL2004892",
          "CHEMBL2004934",
          "CHEMBL2005112",
          "CHEMBL2005186",
          "CHEMBL2005375",
          "CHEMBL2005475",
          "CHEMBL2005528",
          "CHEMBL2005548",
          "CHEMBL2005631",
          "CHEMBL2005792",
          "CHEMBL2005828",
          "CHEMBL2005886",
          "CHEMBL2005899",
          "CHEMBL2005936",
          "CHEMBL2006010",
          "CHEMBL2006156",
          "CHEMBL2006188",
          "CHEMBL2006237",
          "CHEMBL2006263",
          "CHEMBL2006276",
          "CHEMBL2006439",
          "CHEMBL2006481",
          "CHEMBL2006493",
          "CHEMBL2006567",
          "CHEMBL2006580",
          "CHEMBL2006581",
          "CHEMBL2006715",
          "CHEMBL2006778",
          "CHEMBL2006785",
          "CHEMBL2006836",
          "CHEMBL2006933",
          "CHEMBL2007002",
          "CHEMBL2007044",
          "CHEMBL2007064",
          "CHEMBL2007151",
          "CHEMBL2007296",
          "CHEMBL2007372",
          "CHEMBL2007592",
          "CHEMBL2012519",
          "CHEMBL201277",
          "CHEMBL201511",
          "CHEMBL201553",
          "CHEMBL201638",
          "CHEMBL201639",
          "CHEMBL2017214",
          "CHEMBL202830",
          "CHEMBL202831",
          "CHEMBL2029988",
          "CHEMBL2031893",
          "CHEMBL203354",
          "CHEMBL2035810",
          "CHEMBL203599",
          "CHEMBL2042693",
          "CHEMBL2042694",
          "CHEMBL2042695",
          "CHEMBL2042696",
          "CHEMBL2042697",
          "CHEMBL2042827",
          "CHEMBL2042828",
          "CHEMBL2042829",
          "CHEMBL2042830",
          "CHEMBL2042831",
          "CHEMBL2042981",
          "CHEMBL2042982",
          "CHEMBL2042983",
          "CHEMBL2048912",
          "CHEMBL2063926",
          "CHEMBL207400",
          "CHEMBL207995",
          "CHEMBL208637",
          "CHEMBL2086760",
          "CHEMBL2088089",
          "CHEMBL2088090",
          "CHEMBL2088091",
          "CHEMBL2088092",
          "CHEMBL2088093",
          "CHEMBL2088094",
          "CHEMBL2088095",
          "CHEMBL2088096",
          "CHEMBL209148",
          "CHEMBL209534",
          "CHEMBL210032",
          "CHEMBL210618",
          "CHEMBL210928",
          "CHEMBL210963",
          "CHEMBL211378",
          "CHEMBL213505",
          "CHEMBL214329",
          "CHEMBL2148053",
          "CHEMBL215152",
          "CHEMBL2152252",
          "CHEMBL2152253",
          "CHEMBL2158511",
          "CHEMBL2158512",
          "CHEMBL2158513",
          "CHEMBL2158514",
          "CHEMBL2158515",
          "CHEMBL2158516",
          "CHEMBL2158529",
          "CHEMBL2158530",
          "CHEMBL2158531",
          "CHEMBL2158586",
          "CHEMBL2158587",
          "CHEMBL2172308",
          "CHEMBL2172315",
          "CHEMBL2178352",
          "CHEMBL219722",
          "CHEMBL220057",
          "CHEMBL220241",
          "CHEMBL2204532",
          "CHEMBL2206666",
          "CHEMBL221959",
          "CHEMBL223257",
          "CHEMBL223360",
          "CHEMBL223367",
          "CHEMBL223460",
          "CHEMBL225519",
          "CHEMBL226403",
          "CHEMBL226471",
          "CHEMBL226813",
          "CHEMBL230011",
          "CHEMBL2309006",
          "CHEMBL2309609",
          "CHEMBL231209",
          "CHEMBL2312290",
          "CHEMBL2312301",
          "CHEMBL2312303",
          "CHEMBL2312304",
          "CHEMBL2312645",
          "CHEMBL2312646",
          "CHEMBL2312649",
          "CHEMBL2312652",
          "CHEMBL2312654",
          "CHEMBL231450",
          "CHEMBL23254",
          "CHEMBL23327",
          "CHEMBL2333163",
          "CHEMBL234085",
          "CHEMBL2348417",
          "CHEMBL237570",
          "CHEMBL243088",
          "CHEMBL243946",
          "CHEMBL244378",
          "CHEMBL246970",
          "CHEMBL24828",
          "CHEMBL248757",
          "CHEMBL249282",
          "CHEMBL249697",
          "CHEMBL253881",
          "CHEMBL253969",
          "CHEMBL255863",
          "CHEMBL256835",
          "CHEMBL258015",
          "CHEMBL259084",
          "CHEMBL259850",
          "CHEMBL259922",
          "CHEMBL260092",
          "CHEMBL260135",
          "CHEMBL261720",
          "CHEMBL261849",
          "CHEMBL262433",
          "CHEMBL271381",
          "CHEMBL272453",
          "CHEMBL274064",
          "CHEMBL278041",
          "CHEMBL280766",
          "CHEMBL281957",
          "CHEMBL288441",
          "CHEMBL289959",
          "CHEMBL296468",
          "CHEMBL296586",
          "CHEMBL296682",
          "CHEMBL299026",
          "CHEMBL299763",
          "CHEMBL300138",
          "CHEMBL301018",
          "CHEMBL301483",
          "CHEMBL302449",
          "CHEMBL306380",
          "CHEMBL316264",
          "CHEMBL31965",
          "CHEMBL326282",
          "CHEMBL327300",
          "CHEMBL331137",
          "CHEMBL336961",
          "CHEMBL340384",
          "CHEMBL340921",
          "CHEMBL354676",
          "CHEMBL360190",
          "CHEMBL362558",
          "CHEMBL363130",
          "CHEMBL363607",
          "CHEMBL363648",
          "CHEMBL370800",
          "CHEMBL370967",
          "CHEMBL370968",
          "CHEMBL371169",
          "CHEMBL371206",
          "CHEMBL372657",
          "CHEMBL373598",
          "CHEMBL373882",
          "CHEMBL375284",
          "CHEMBL377300",
          "CHEMBL377383",
          "CHEMBL377408",
          "CHEMBL378627",
          "CHEMBL379218",
          "CHEMBL379835",
          "CHEMBL381738",
          "CHEMBL38380",
          "CHEMBL384304",
          "CHEMBL385478",
          "CHEMBL386051",
          "CHEMBL386637",
          "CHEMBL387971",
          "CHEMBL392642",
          "CHEMBL394619",
          "CHEMBL394790",
          "CHEMBL396523",
          "CHEMBL398606",
          "CHEMBL398610",
          "CHEMBL398951",
          "CHEMBL401896",
          "CHEMBL401930",
          "CHEMBL402548",
          "CHEMBL402846",
          "CHEMBL403776",
          "CHEMBL404367",
          "CHEMBL410659",
          "CHEMBL411903",
          "CHEMBL412142",
          "CHEMBL413779",
          "CHEMBL41783",
          "CHEMBL422897",
          "CHEMBL424872",
          "CHEMBL427188",
          "CHEMBL428690",
          "CHEMBL432738",
          "CHEMBL432971",
          "CHEMBL433520",
          "CHEMBL436509",
          "CHEMBL437747",
          "CHEMBL440084",
          "CHEMBL442826",
          "CHEMBL443906",
          "CHEMBL443962",
          "CHEMBL444394",
          "CHEMBL445813",
          "CHEMBL447107",
          "CHEMBL447132",
          "CHEMBL447317",
          "CHEMBL448929",
          "CHEMBL450786",
          "CHEMBL451401",
          "CHEMBL451964",
          "CHEMBL452965",
          "CHEMBL454220",
          "CHEMBL457705",
          "CHEMBL457706",
          "CHEMBL457886",
          "CHEMBL45827",
          "CHEMBL458796",
          "CHEMBL458997",
          "CHEMBL459850",
          "CHEMBL459886",
          "CHEMBL460389",
          "CHEMBL460472",
          "CHEMBL460702",
          "CHEMBL460746",
          "CHEMBL460824",
          "CHEMBL461109",
          "CHEMBL461110",
          "CHEMBL461139",
          "CHEMBL461140",
          "CHEMBL461991",
          "CHEMBL462120",
          "CHEMBL462160",
          "CHEMBL462161",
          "CHEMBL462162",
          "CHEMBL462301",
          "CHEMBL462338",
          "CHEMBL464014",
          "CHEMBL464210",
          "CHEMBL464552",
          "CHEMBL466397",
          "CHEMBL468280",
          "CHEMBL47203",
          "CHEMBL472946",
          "CHEMBL473250",
          "CHEMBL473351",
          "CHEMBL473354",
          "CHEMBL473553",
          "CHEMBL473556",
          "CHEMBL473557",
          "CHEMBL473761",
          "CHEMBL474346",
          "CHEMBL474347",
          "CHEMBL474432",
          "CHEMBL474543",
          "CHEMBL474544",
          "CHEMBL475251",
          "CHEMBL475351",
          "CHEMBL475352",
          "CHEMBL475593",
          "CHEMBL477772",
          "CHEMBL480365",
          "CHEMBL480373",
          "CHEMBL480374",
          "CHEMBL480547",
          "CHEMBL480554",
          "CHEMBL480555",
          "CHEMBL480566",
          "CHEMBL480573",
          "CHEMBL480574",
          "CHEMBL480592",
          "CHEMBL480753",
          "CHEMBL480754",
          "CHEMBL481360",
          "CHEMBL481361",
          "CHEMBL481362",
          "CHEMBL481369",
          "CHEMBL481370",
          "CHEMBL481378",
          "CHEMBL481379",
          "CHEMBL481380",
          "CHEMBL481491",
          "CHEMBL481559",
          "CHEMBL481567",
          "CHEMBL481720",
          "CHEMBL481721",
          "CHEMBL481738",
          "CHEMBL481884",
          "CHEMBL481900",
          "CHEMBL481901",
          "CHEMBL482169",
          "CHEMBL482367",
          "CHEMBL482767",
          "CHEMBL482967",
          "CHEMBL483158",
          "CHEMBL483181",
          "CHEMBL483321",
          "CHEMBL483397",
          "CHEMBL483403",
          "CHEMBL483602",
          "CHEMBL484390",
          "CHEMBL484940",
          "CHEMBL485202",
          "CHEMBL485203",
          "CHEMBL485206",
          "CHEMBL485232",
          "CHEMBL485233",
          "CHEMBL485402",
          "CHEMBL485555",
          "CHEMBL485556",
          "CHEMBL485564",
          "CHEMBL485565",
          "CHEMBL485607",
          "CHEMBL485922",
          "CHEMBL485936",
          "CHEMBL485937",
          "CHEMBL486147",
          "CHEMBL486951",
          "CHEMBL487571",
          "CHEMBL487785",
          "CHEMBL487786",
          "CHEMBL488271",
          "CHEMBL488397",
          "CHEMBL488596",
          "CHEMBL488646",
          "CHEMBL488811",
          "CHEMBL488840",
          "CHEMBL489083",
          "CHEMBL490555",
          "CHEMBL491473",
          "CHEMBL491677",
          "CHEMBL491686",
          "CHEMBL491758",
          "CHEMBL492757",
          "CHEMBL492758",
          "CHEMBL492809",
          "CHEMBL492931",
          "CHEMBL492990",
          "CHEMBL493007",
          "CHEMBL493008",
          "CHEMBL493106",
          "CHEMBL493107",
          "CHEMBL493318",
          "CHEMBL493319",
          "CHEMBL493537",
          "CHEMBL493742",
          "CHEMBL493928",
          "CHEMBL494027",
          "CHEMBL494089",
          "CHEMBL494135",
          "CHEMBL494136",
          "CHEMBL494743",
          "CHEMBL494993",
          "CHEMBL495026",
          "CHEMBL495181",
          "CHEMBL497151",
          "CHEMBL497949",
          "CHEMBL499219",
          "CHEMBL499247",
          "CHEMBL500349",
          "CHEMBL500517",
          "CHEMBL500583",
          "CHEMBL501364",
          "CHEMBL501661",
          "CHEMBL501963",
          "CHEMBL502835",
          "CHEMBL504194",
          "CHEMBL504547",
          "CHEMBL504950",
          "CHEMBL505637",
          "CHEMBL505830",
          "CHEMBL507249",
          "CHEMBL507625",
          "CHEMBL507714",
          "CHEMBL507769",
          "CHEMBL507936",
          "CHEMBL508928",
          "CHEMBL50894",
          "CHEMBL509032",
          "CHEMBL509101",
          "CHEMBL509435",
          "CHEMBL510587",
          "CHEMBL510877",
          "CHEMBL512933",
          "CHEMBL513846",
          "CHEMBL513897",
          "CHEMBL513909",
          "CHEMBL514016",
          "CHEMBL514499",
          "CHEMBL514873",
          "CHEMBL514929",
          "CHEMBL514941",
          "CHEMBL514942",
          "CHEMBL515519",
          "CHEMBL515598",
          "CHEMBL518803",
          "CHEMBL518937",
          "CHEMBL519116",
          "CHEMBL519239",
          "CHEMBL519250",
          "CHEMBL519388",
          "CHEMBL519697",
          "CHEMBL519698",
          "CHEMBL519927",
          "CHEMBL519960",
          "CHEMBL520110",
          "CHEMBL520312",
          "CHEMBL520432",
          "CHEMBL520768",
          "CHEMBL521113",
          "CHEMBL521241",
          "CHEMBL521432",
          "CHEMBL521468",
          "CHEMBL521695",
          "CHEMBL521851",
          "CHEMBL522328",
          "CHEMBL522682",
          "CHEMBL522711",
          "CHEMBL522785",
          "CHEMBL522849",
          "CHEMBL522871",
          "CHEMBL522892",
          "CHEMBL523823",
          "CHEMBL52387",
          "CHEMBL524266",
          "CHEMBL525191",
          "CHEMBL525203",
          "CHEMBL526133",
          "CHEMBL529663",
          "CHEMBL535",
          "CHEMBL535331",
          "CHEMBL539474",
          "CHEMBL545315",
          "CHEMBL549826",
          "CHEMBL551064",
          "CHEMBL551264",
          "CHEMBL551570",
          "CHEMBL551906",
          "CHEMBL553",
          "CHEMBL554",
          "CHEMBL556596",
          "CHEMBL557491",
          "CHEMBL558708",
          "CHEMBL558752",
          "CHEMBL560245",
          "CHEMBL560446",
          "CHEMBL560813",
          "CHEMBL56236",
          "CHEMBL562488",
          "CHEMBL562943",
          "CHEMBL563080",
          "CHEMBL563257",
          "CHEMBL563555",
          "CHEMBL564365",
          "CHEMBL564417",
          "CHEMBL564679",
          "CHEMBL564829",
          "CHEMBL565612",
          "CHEMBL565657",
          "CHEMBL568922",
          "CHEMBL56983",
          "CHEMBL572878",
          "CHEMBL572881",
          "CHEMBL57323",
          "CHEMBL573339",
          "CHEMBL57347",
          "CHEMBL57366",
          "CHEMBL574588",
          "CHEMBL574613",
          "CHEMBL574738",
          "CHEMBL576887",
          "CHEMBL576982",
          "CHEMBL576989",
          "CHEMBL578601",
          "CHEMBL583144",
          "CHEMBL589065",
          "CHEMBL589499",
          "CHEMBL589530",
          "CHEMBL589531",
          "CHEMBL589744",
          "CHEMBL590022",
          "CHEMBL590023",
          "CHEMBL590109",
          "CHEMBL590769",
          "CHEMBL591021",
          "CHEMBL591022",
          "CHEMBL591252",
          "CHEMBL591504",
          "CHEMBL591702",
          "CHEMBL591703",
          "CHEMBL591896",
          "CHEMBL592030",
          "CHEMBL592665",
          "CHEMBL592666",
          "CHEMBL596598",
          "CHEMBL596807",
          "CHEMBL596808",
          "CHEMBL596988",
          "CHEMBL597005",
          "CHEMBL597191",
          "CHEMBL597207",
          "CHEMBL597393",
          "CHEMBL597586",
          "CHEMBL597596",
          "CHEMBL597597",
          "CHEMBL597754",
          "CHEMBL598000",
          "CHEMBL598024",
          "CHEMBL598025",
          "CHEMBL598201",
          "CHEMBL598418",
          "CHEMBL598431",
          "CHEMBL598434",
          "CHEMBL598435",
          "CHEMBL598633",
          "CHEMBL598837",
          "CHEMBL599027",
          "CHEMBL599055",
          "CHEMBL599056",
          "CHEMBL599224",
          "CHEMBL599247",
          "CHEMBL599248",
          "CHEMBL599428",
          "CHEMBL599446",
          "CHEMBL599645",
          "CHEMBL599666",
          "CHEMBL599844",
          "CHEMBL600795",
          "CHEMBL601199",
          "CHEMBL601719",
          "CHEMBL601739",
          "CHEMBL602043",
          "CHEMBL602471",
          "CHEMBL602472",
          "CHEMBL602518",
          "CHEMBL602643",
          "CHEMBL602738",
          "CHEMBL602749",
          "CHEMBL602890",
          "CHEMBL602919",
          "CHEMBL603255",
          "CHEMBL603259",
          "CHEMBL603463",
          "CHEMBL603481",
          "CHEMBL603545",
          "CHEMBL604159",
          "CHEMBL604254",
          "CHEMBL604545",
          "CHEMBL604712",
          "CHEMBL604912",
          "CHEMBL605118",
          "CHEMBL605324",
          "CHEMBL605841",
          "CHEMBL606119",
          "CHEMBL606185",
          "CHEMBL606255",
          "CHEMBL606395",
          "CHEMBL606410",
          "CHEMBL607707",
          "CHEMBL608154",
          "CHEMBL608427",
          "CHEMBL610512",
          "CHEMBL6246",
          "CHEMBL66031",
          "CHEMBL7064",
          "CHEMBL75188",
          "CHEMBL75680",
          "CHEMBL76599",
          "CHEMBL91829",
          "CHEMBL939",
          "CHEMBL941",
          "CHEMBL95692"
        ],
        "number_of_missing_values": "0"
      },
      {
        "data_type": "numeric",
        "index": "1",
        "is_ignore": "false",
        "is_row_identifier": "false",
        "is_target": "false",
        "name": "nDB",
        "number_of_missing_values": "0"
      },
      {
        "data_type": "numeric",
        "index": "2",
        "is_ignore": "false",
        "is_row_identifier": "false",
        "is_target": "false",
        "name": "O.",
        "number_of_missing_values": "0"
      },
      {
        "data_type": "numeric",
        "index": "3",
        "is_ignore": "false",
        "is_row_identifier": "false",
        "is_target": "false",
        "name": "nSK",
        "number_of_missing_values": "0"
      },
      {
        "data_type": "numeric",
        "index": "4",
        "is_ignore": "false",
        "is_row_identifier": "false",
        "is_target": "false",
        "name": "Se",
        "number_of_missing_values": "0"
      },
      {
        "data_type": "numeric",
        "index": "5",
        "is_ignore": "false",
        "is_row_identifier": "false",
        "is_target": "false",
        "name": "nC",
        "number_of_missing_values": "0"
      },
      {
        "data_type": "numeric",
        "index": "6",
        "is_ignore": "false",
        "is_row_identifier": "false",
        "is_target": "false",
        "name": "Sp",
        "number_of_missing_values": "0"
      },
      {
        "data_type": "numeric",
        "index": "7",
        "is_ignore": "false",
        "is_row_identifier": "false",
        "is_target": "false",
        "name": "Sv",
        "number_of_missing_values": "0"
      },
      {
        "data_type": "numeric",
        "index": "8",
        "is_ignore": "false",
        "is_row_identifier": "false",
        "is_target": "false",
        "name": "MW",
        "number_of_missing_values": "0"
      },
      {
        "data_type": "numeric",
        "index": "9",
        "is_ignore": "false",
        "is_row_identifier": "false",
        "is_target": "false",
        "name": "nAB",
        "number_of_missing_values": "0"
      },
      {
        "data_type": "numeric",
        "index": "10",
        "is_ignore": "false",
        "is_row_identifier": "false",
        "is_target": "false",
        "name": "nBO",
        "number_of_missing_values": "0"
      },
      {
        "data_type": "numeric",
        "index": "11",
        "is_ignore": "false",
        "is_row_identifier": "false",
        "is_target": "false",
        "name": "Si",
        "number_of_missing_values": "0"
      },
      {
        "data_type": "numeric",
        "index": "12",
        "is_ignore": "false",
        "is_row_identifier": "false",
        "is_target": "false",
        "name": "nAT",
        "number_of_missing_values": "0"
      },
      {
        "data_type": "numeric",
        "index": "13",
        "is_ignore": "false",
        "is_row_identifier": "false",
        "is_target": "false",
        "name": "SCBO",
        "number_of_missing_values": "0"
      },
      {
        "data_type": "numeric",
        "index": "14",
        "is_ignore": "false",
        "is_row_identifier": "false",
        "is_target": "false",
        "name": "nBT",
        "number_of_missing_values": "0"
      },
      {
        "data_type": "numeric",
        "index": "15",
        "is_ignore": "false",
        "is_row_identifier": "false",
        "is_target": "false",
        "name": "nHet",
        "number_of_missing_values": "0"
      },
      {
        "data_type": "numeric",
        "index": "16",
        "is_ignore": "false",
        "is_row_identifier": "false",
        "is_target": "false",
        "name": "nH",
        "number_of_missing_values": "0"
      },
      {
        "data_type": "numeric",
        "index": "17",
        "is_ignore": "false",
        "is_row_identifier": "false",
        "is_target": "false",
        "name": "H.",
        "number_of_missing_values": "0"
      },
      {
        "data_type": "numeric",
        "index": "18",
        "is_ignore": "false",
        "is_row_identifier": "false",
        "is_target": "false",
        "name": "nCsp3",
        "number_of_missing_values": "0"
      },
      {
        "data_type": "numeric",
        "index": "19",
        "is_ignore": "false",
        "is_row_identifier": "false",
        "is_target": "false",
        "name": "RBF",
        "number_of_missing_values": "0"
      },
      {
        "data_type": "numeric",
        "index": "20",
        "is_ignore": "false",
        "is_row_identifier": "false",
        "is_target": "false",
        "name": "RBN",
        "number_of_missing_values": "0"
      },
      {
        "data_type": "numeric",
        "index": "21",
        "is_ignore": "false",
        "is_row_identifier": "false",
        "is_target": "false",
        "name": "nO",
        "number_of_missing_values": "0"
      },
      {
        "data_type": "numeric",
        "index": "22",
        "is_ignore": "false",
        "is_row_identifier": "false",
        "is_target": "false",
        "name": "Me",
        "number_of_missing_values": "0"
      },
      {
        "data_type": "numeric",
        "index": "23",
        "is_ignore": "false",
        "is_row_identifier": "false",
        "is_target": "true",
        "name": "pXC50",
        "number_of_missing_values": "0"
      }
    ]
  }
}