{
  "data_set_description": {
    "collection_date": "November 2013",
    "creator": "Dr Jeremy Besnard, Dr Ivan Olier, Dr Noureddin Sadawi, Dr Larisa Soldatova, Dr Crina Grosan, Prof Ross King, Dr Richard Bickerton, Prof Andrew Hopkins and Dr Willem van Hoorn",
    "default_target_attribute": "pXC50",
    "description": "This dataset contains QSAR data (from ChEMBL version 17) showing activity values (unit is pseudo-pCI50) of several compounds on drug target ChEMBL_ID: CHEMBL3521 (TID: 12114), and it has 131 rows and 1317 features (not including molecule IDs and class feature: molecule_id and pXC50). The features represent Molecular Descriptors which were generated from SMILES strings. Missing value imputation was applied to this dataset (By choosing the Median).",
    "description_version": "1",
    "file_id": "3336637",
    "format": "ARFF",
    "id": "27655",
    "licence": "Public",
    "md5_checksum": "c9211abcf7d2dc2290953a69f93d8163",
    "minio_url": "https://data.openml.org/datasets/0002/27655/dataset_27655.pq",
    "name": "QSAR-DATASET-FOR-DRUG-TARGET-CHEMBL3521",
    "original_data_url": "https://www.ebi.ac.uk/chembl/target/inspect/CHEMBL3521",
    "parquet_url": "https://data.openml.org/datasets/0002/27655/dataset_27655.pq",
    "processing_date": "2018-10-04 00:18:45",
    "row_id_attribute": "molecule_id",
    "status": "deactivated",
    "tag": [
      "MetaQSAR",
      "study_13"
    ],
    "upload_date": "2016-07-14T22:05:25",
    "url": "https://api.openml.org/data/v1/download/3336637/QSAR-DATASET-FOR-DRUG-TARGET-CHEMBL3521.arff",
    "version": "9",
    "visibility": "public"
  }
}