{
  "data_set_description": {
    "collection_date": "November 2013",
    "creator": "Dr Jeremy Besnard, Dr Ivan Olier, Dr Noureddin Sadawi, Dr Larisa Soldatova, Dr Crina Grosan, Prof Ross King, Dr Richard Bickerton, Prof Andrew Hopkins and Dr Willem van Hoorn",
    "default_target_attribute": "pXC50",
    "description": "This dataset contains QSAR data (from ChEMBL version 17) showing activity values (unit is pseudo-pCI50) of several compounds on drug target ChEMBL_ID: CHEMBL6109 (TID: 102437), and it has 33 rows and 1166 features (not including molecule IDs and class feature: molecule_id and pXC50). The features represent Molecular Descriptors which were generated from SMILES strings. Missing value imputation was applied to this dataset (By choosing the Median).",
    "description_version": "1",
    "file_id": "3335756",
    "format": "ARFF",
    "id": "27634",
    "licence": "Public",
    "md5_checksum": "5500b88d1b152ee19c1abda3e2830bb0",
    "minio_url": "https://data.openml.org/datasets/0002/27634/dataset_27634.pq",
    "name": "QSAR-DATASET-FOR-DRUG-TARGET-CHEMBL6109",
    "original_data_url": "https://www.ebi.ac.uk/chembl/target/inspect/CHEMBL6109",
    "parquet_url": "https://data.openml.org/datasets/0002/27634/dataset_27634.pq",
    "processing_date": "2018-10-04 00:19:22",
    "row_id_attribute": "molecule_id",
    "status": "deactivated",
    "tag": [
      "MetaQSAR",
      "study_13"
    ],
    "upload_date": "2016-07-14T22:02:12",
    "url": "https://api.openml.org/data/v1/download/3335756/QSAR-DATASET-FOR-DRUG-TARGET-CHEMBL6109.arff",
    "version": "8",
    "visibility": "public"
  }
}