{
  "data_set_description": {
    "collection_date": "November 2013",
    "creator": "Dr Jeremy Besnard, Dr Ivan Olier, Dr Noureddin Sadawi, Dr Larisa Soldatova, Dr Crina Grosan, Prof Ross King, Dr Richard Bickerton, Prof Andrew Hopkins and Dr Willem van Hoorn",
    "default_target_attribute": "pXC50",
    "description": "This dataset contains QSAR data (from ChEMBL version 17) showing activity values (unit is pseudo-pCI50) of several compounds on drug target ChEMBL_ID: CHEMBL1795186 (TID: 104266), and it has 64 rows and 43 features (not including molecule IDs and class feature: molecule_id and pXC50). The features represent Basic Molecular Descriptors which were generated from SMILES strings.  Missing value imputation was applied to this dataset (By choosing the Median).",
    "description_version": "1",
    "file_id": "3335678",
    "format": "ARFF",
    "id": "27618",
    "licence": "Public",
    "md5_checksum": "b7e332ce8c81773b03480b656a2c0b64",
    "minio_url": "https://data.openml.org/datasets/0002/27618/dataset_27618.pq",
    "name": "QSAR-DATASET-FOR-DRUG-TARGET-CHEMBL1795186",
    "original_data_url": "https://www.ebi.ac.uk/chembl/target/inspect/CHEMBL1795186",
    "parquet_url": "https://data.openml.org/datasets/0002/27618/dataset_27618.pq",
    "processing_date": "2018-10-04 00:18:10",
    "row_id_attribute": "molecule_id",
    "status": "deactivated",
    "tag": [
      "MetaQSAR",
      "study_13"
    ],
    "upload_date": "2016-07-14T22:00:10",
    "url": "https://api.openml.org/data/v1/download/3335678/QSAR-DATASET-FOR-DRUG-TARGET-CHEMBL1795186.arff",
    "version": "7",
    "visibility": "public"
  }
}