{
  "data_set_description": {
    "collection_date": "November 2013",
    "creator": "Dr Jeremy Besnard, Dr Ivan Olier, Dr Noureddin Sadawi, Dr Larisa Soldatova, Dr Crina Grosan, Prof Ross King, Dr Richard Bickerton, Prof Andrew Hopkins and Dr Willem van Hoorn",
    "default_target_attribute": "pXC50",
    "description": "This dataset contains QSAR data (from ChEMBL version 17) showing activity values (unit is pseudo-pCI50) of several compounds on drug target ChEMBL_ID: CHEMBL5836 (TID: 102676), and it has 75 rows and 1304 features (not including molecule IDs and class feature: molecule_id and pXC50). The features represent Molecular Descriptors which were generated from SMILES strings. Missing value imputation was applied to this dataset (By choosing the Median).",
    "description_version": "1",
    "file_id": "3335335",
    "format": "ARFF",
    "id": "27605",
    "licence": "Public",
    "md5_checksum": "010d850f8cb22cdec4a94f9c38589a99",
    "minio_url": "https://data.openml.org/datasets/0002/27605/dataset_27605.pq",
    "name": "QSAR-DATASET-FOR-DRUG-TARGET-CHEMBL5836",
    "original_data_url": "https://www.ebi.ac.uk/chembl/target/inspect/CHEMBL5836",
    "parquet_url": "https://data.openml.org/datasets/0002/27605/dataset_27605.pq",
    "processing_date": "2018-10-04 00:22:55",
    "row_id_attribute": "molecule_id",
    "status": "deactivated",
    "tag": [
      "MetaQSAR",
      "study_13"
    ],
    "upload_date": "2016-07-14T21:58:22",
    "url": "https://api.openml.org/data/v1/download/3335335/QSAR-DATASET-FOR-DRUG-TARGET-CHEMBL5836.arff",
    "version": "10",
    "visibility": "public"
  }
}