{
  "data_set_description": {
    "collection_date": "November 2013",
    "creator": "Dr Jeremy Besnard, Dr Ivan Olier, Dr Noureddin Sadawi, Dr Larisa Soldatova, Dr Crina Grosan, Prof Ross King, Dr Richard Bickerton, Prof Andrew Hopkins and Dr Willem van Hoorn",
    "default_target_attribute": "pXC50",
    "description": "This dataset contains QSAR data (from ChEMBL version 17) showing activity values (unit is pseudo-pCI50) of several compounds on drug target ChEMBL_ID: CHEMBL2052039 (TID: 104581), and it has 40 rows and 1160 features (not including molecule IDs and class feature: molecule_id and pXC50). The features represent Molecular Descriptors which were generated from SMILES strings. Missing value imputation was applied to this dataset (By choosing the Median).",
    "description_version": "1",
    "file_id": "3334583",
    "format": "ARFF",
    "id": "27587",
    "licence": "Public",
    "md5_checksum": "264f60b4d2188c28ce63e6c81eac64bd",
    "minio_url": "https://data.openml.org/datasets/0002/27587/dataset_27587.pq",
    "name": "QSAR-DATASET-FOR-DRUG-TARGET-CHEMBL2052039",
    "original_data_url": "https://www.ebi.ac.uk/chembl/target/inspect/CHEMBL2052039",
    "parquet_url": "https://data.openml.org/datasets/0002/27587/dataset_27587.pq",
    "processing_date": "2018-10-04 00:16:21",
    "row_id_attribute": "molecule_id",
    "status": "deactivated",
    "tag": [
      "MetaQSAR",
      "study_13"
    ],
    "upload_date": "2016-07-14T21:55:44",
    "url": "https://api.openml.org/data/v1/download/3334583/QSAR-DATASET-FOR-DRUG-TARGET-CHEMBL2052039.arff",
    "version": "8",
    "visibility": "public"
  }
}