"molecule_id","FCFP4_1024b1","FCFP4_1024b10","FCFP4_1024b100","FCFP4_1024b1000","FCFP4_1024b1001","FCFP4_1024b1002","FCFP4_1024b1003","FCFP4_1024b1004","FCFP4_1024b1005","FCFP4_1024b1006","FCFP4_1024b1007","FCFP4_1024b1008","FCFP4_1024b1009","FCFP4_1024b101","FCFP4_1024b1010","FCFP4_1024b1011","FCFP4_1024b1012","FCFP4_1024b1013","FCFP4_1024b1014","FCFP4_1024b1015","FCFP4_1024b1016","FCFP4_1024b1017","FCFP4_1024b1018","FCFP4_1024b1019","FCFP4_1024b102","FCFP4_1024b1020","FCFP4_1024b1021","FCFP4_1024b1022","FCFP4_1024b1023","FCFP4_1024b1024","FCFP4_1024b103","FCFP4_1024b104","FCFP4_1024b105","FCFP4_1024b106","FCFP4_1024b107","FCFP4_1024b108","FCFP4_1024b109","FCFP4_1024b11","FCFP4_1024b110","FCFP4_1024b111","FCFP4_1024b112","FCFP4_1024b113","FCFP4_1024b114","FCFP4_1024b115","FCFP4_1024b116","FCFP4_1024b117","FCFP4_1024b118","FCFP4_1024b119","FCFP4_1024b12","FCFP4_1024b120","FCFP4_1024b121","FCFP4_1024b122","FCFP4_1024b123","FCFP4_1024b124","FCFP4_1024b125","FCFP4_1024b126","FCFP4_1024b127","FCFP4_1024b128","FCFP4_1024b129","FCFP4_1024b13","FCFP4_1024b130","FCFP4_1024b131","FCFP4_1024b132","FCFP4_1024b133","FCFP4_1024b134","FCFP4_1024b135","FCFP4_1024b136","FCFP4_1024b137","FCFP4_1024b138","FCFP4_1024b139","FCFP4_1024b14","FCFP4_1024b140","FCFP4_1024b141","FCFP4_1024b142","FCFP4_1024b143","FCFP4_1024b144","FCFP4_1024b145","FCFP4_1024b146","FCFP4_1024b147","FCFP4_1024b148","FCFP4_1024b149","FCFP4_1024b15","FCFP4_1024b150","FCFP4_1024b151","FCFP4_1024b152","FCFP4_1024b153","FCFP4_1024b154","FCFP4_1024b155","FCFP4_1024b156","FCFP4_1024b157","FCFP4_1024b158","FCFP4_1024b159","FCFP4_1024b16","FCFP4_1024b160","FCFP4_1024b161","FCFP4_1024b162","FCFP4_1024b163","FCFP4_1024b164","FCFP4_1024b165","FCFP4_1024b166","FCFP4_1024b167","FCFP4_1024b168","FCFP4_1024b169","FCFP4_1024b17","FCFP4_1024b170","FCFP4_1024b171","FCFP4_1024b172","FCFP4_1024b173","FCFP4_1024b174","FCFP4_1024b175","FCFP4_1024b176","FCFP4_1024b177","FCFP4_1024b178","FCFP4_1024b179","FCFP4_1024b18","FCFP4_1024b180","FCFP4_1024b181","FCFP4_1024b182","FCFP4_1024b183","FCFP4_1024b184","FCFP4_1024b185","FCFP4_1024b186","FCFP4_1024b187","FCFP4_1024b188","FCFP4_1024b189","FCFP4_1024b19","FCFP4_1024b190","FCFP4_1024b191","FCFP4_1024b192","FCFP4_1024b193","FCFP4_1024b194","FCFP4_1024b195","FCFP4_1024b196","FCFP4_1024b197","FCFP4_1024b198","FCFP4_1024b199","FCFP4_1024b2","FCFP4_1024b20","FCFP4_1024b200","FCFP4_1024b201","FCFP4_1024b202","FCFP4_1024b203","FCFP4_1024b204","FCFP4_1024b205","FCFP4_1024b206","FCFP4_1024b207","FCFP4_1024b208","FCFP4_1024b209","FCFP4_1024b21","FCFP4_1024b210","FCFP4_1024b211","FCFP4_1024b212","FCFP4_1024b213","FCFP4_1024b214","FCFP4_1024b215","FCFP4_1024b216","FCFP4_1024b217","FCFP4_1024b218","FCFP4_1024b219","FCFP4_1024b22","FCFP4_1024b220","FCFP4_1024b221","FCFP4_1024b222","FCFP4_1024b223","FCFP4_1024b224","FCFP4_1024b225","FCFP4_1024b226","FCFP4_1024b227","FCFP4_1024b228","FCFP4_1024b229","FCFP4_1024b23","FCFP4_1024b230","FCFP4_1024b231","FCFP4_1024b232","FCFP4_1024b233","FCFP4_1024b234","FCFP4_1024b235","FCFP4_1024b236","FCFP4_1024b237","FCFP4_1024b238","FCFP4_1024b239","FCFP4_1024b24","FCFP4_1024b240","FCFP4_1024b241","FCFP4_1024b242","FCFP4_1024b243","FCFP4_1024b244","FCFP4_1024b245","FCFP4_1024b246","FCFP4_1024b247","FCFP4_1024b248","FCFP4_1024b249","FCFP4_1024b25","FCFP4_1024b250","FCFP4_1024b251","FCFP4_1024b252","FCFP4_1024b253","FCFP4_1024b254","FCFP4_1024b255","FCFP4_1024b256","FCFP4_1024b257","FCFP4_1024b258","FCFP4_1024b259","FCFP4_1024b26","FCFP4_1024b260","pXC50"
{1 1,48 1,137 1,206 4.115}
{0 CHEMBL1254000,1 1,24 1,39 1,104 1,105 1,137 1,193 1,206 6.602}
{0 CHEMBL1254093,1 1,39 1,104 1,105 1,137 1,193 1,206 6.097}
{0 CHEMBL1673217,1 1,2 1,26 1,115 1,118 1,137 1,206 4.921}
{0 CHEMBL1673218,1 1,2 1,26 1,115 1,118 1,137 1,206 5.481}
{0 CHEMBL192017,1 1,104 1,105 1,137 1,193 1,206 5.043}
{0 CHEMBL192342,1 1,104 1,105 1,137 1,193 1,206 4.875}
{0 CHEMBL2048241,1 1,16 1,35 1,69 1,104 1,105 1,115 1,137 1,174 1,202 1,206 4}
{0 CHEMBL2048242,1 1,16 1,35 1,69 1,104 1,105 1,115 1,137 1,174 1,202 1,206 4}
{0 CHEMBL2048244,1 1,16 1,35 1,69 1,104 1,105 1,115 1,137 1,174 1,202 1,206 4}
{0 CHEMBL2096899,1 1,39 1,137 1,206 5.222}
{0 CHEMBL213343,1 1,104 1,105 1,137 1,193 1,206 4.285}
{0 CHEMBL213470,1 1,70 1,104 1,105 1,137 1,193 1,206 4}
{0 CHEMBL213490,1 1,6 1,28 1,104 1,105 1,137 1,193 1,206 5.678}
{0 CHEMBL235059,1 1,40 1,99 1,137 1,206 4.19}
{0 CHEMBL235690,1 1,99 1,115 1,137 1,173 1,206 5.495}
{0 CHEMBL237808,1 1,99 1,115 1,137 1,173 1,206 5.815}
{0 CHEMBL238046,1 1,99 1,115 1,137 1,173 1,206 5.905}
{0 CHEMBL258994,1 1,39 1,137 1,206 6.198}
{0 CHEMBL259026,1 1,6 1,28 1,35 1,64 1,104 1,105 1,137 1,193 1,206 5.585}
{0 CHEMBL259064,1 1,39 1,137 1,206 4}
{0 CHEMBL259208,1 1,39 1,137 1,206 4.398}
{0 CHEMBL260712,1 1,39 1,137 1,206 5.155}
{0 CHEMBL260713,1 1,39 1,137 1,206 5.222}
{0 CHEMBL260714,1 1,39 1,137 1,206 5.523}
{0 CHEMBL260715,1 1,39 1,137 1,206 4.222}
{0 CHEMBL260880,1 1,104 1,105 1,137 1,161 1,206 5.39}
{0 CHEMBL261097,1 1,39 1,137 1,206 4}
{0 CHEMBL261336,1 1,39 1,137 1,206 4.155}
{0 CHEMBL261582,1 1,137 1,206 4}
{0 CHEMBL262616,1 1,6 1,28 1,104 1,105 1,137 1,193 1,206 6.122}
{0 CHEMBL263111,1 1,39 1,137 1,206 5}
{0 CHEMBL264168,1 1,39 1,137 1,206 5.155}
{0 CHEMBL264169,1 1,39 1,137 1,206 4.222}
{0 CHEMBL264692,1 1,39 1,137 1,206 6}
{0 CHEMBL265175,1 1,39 1,137 1,206 4.155}
{0 CHEMBL265176,1 1,15 1,35 1,39 1,104 1,105 1,137 1,193 1,206 4}
{0 CHEMBL277580,1 1,99 1,137 1,206 4.19}
{0 CHEMBL291314,1 1,80 1,115 1,137 1,173 1,206 7}
{0 CHEMBL298547,1 1,115 1,137 1,206 5.367}
{0 CHEMBL298852,1 1,115 1,137 1,206 5.854}
{0 CHEMBL299988,1 1,115 1,137 1,206 4.276}
{0 CHEMBL305530,1 1,2 1,39 1,99 1,116 1,118 1,137 1,164 1,177 1,206 4}
{0 CHEMBL319144,1 1,104 1,105 1,111 1,115 1,137 1,206 4.094}
{0 CHEMBL392884,1 1,99 1,115 1,137 1,173 1,206 5.08}
{0 CHEMBL405865,1 1,39 1,104 1,105 1,137 1,193 1,206 5.075}
{0 CHEMBL408792,1 1,39 1,137 1,187 1,206 6.222}
{0 CHEMBL410064,1 1,39 1,137 1,206 6.523}
{0 CHEMBL411030,1 1,15 1,35 1,39 1,104 1,105 1,137 1,193 1,206 6.046}
{0 CHEMBL411274,1 1,6 1,28 1,104 1,105 1,115 1,137 1,193 1,206 5.4}
{0 CHEMBL411665,1 1,15 1,35 1,104 1,105 1,137 1,193 1,206 4}
{0 CHEMBL416301,1 1,115 1,137 1,206 5.585}
{0 CHEMBL419627,1 1,2 1,39 1,99 1,118 1,137 1,164 1,177 1,200 1,206 6.509}
{0 CHEMBL427733,1 1,15 1,35 1,39 1,104 1,105 1,137 1,193 1,206 6.046}
{0 CHEMBL427939,1 1,39 1,137 1,206 4.398}
{0 CHEMBL429860,1 1,39 1,137 1,206 6.222}
{0 CHEMBL441692,1 1,104 1,105 1,137 1,193 1,206 5}
{0 CHEMBL442917,1 1,99 1,115 1,137 1,173 1,206 4.1}
{0 CHEMBL492471,1 1,66 1,104 1,105 1,115 1,137 1,193 1,196 1,206 5.32}
{0 CHEMBL492621,1 1,104 1,105 1,115 1,137 1,148 1,193 1,206 6.11}
{0 CHEMBL492622,1 1,80 1,115 1,137 1,173 1,206 6.076}
{0 CHEMBL493443,1 1,28 1,104 1,105 1,115 1,137 1,193 1,206 6.215}
{0 CHEMBL493706,1 1,66 1,104 1,105 1,115 1,137 1,193 1,206 5.685}
{0 CHEMBL493906,1 1,115 1,137 1,206 5.6}
{0 CHEMBL494279,1 1,10 1,104 1,105 1,115 1,137 1,193 1,206 5.92}
{0 CHEMBL494317,1 1,66 1,104 1,105 1,115 1,137 1,193 1,196 1,206 5.3}
{0 CHEMBL494694,1 1,66 1,104 1,105 1,115 1,137 1,193 1,206 6.577}
{0 CHEMBL494708,1 1,115 1,137 1,206 5.715}
{0 CHEMBL494876,1 1,104 1,105 1,115 1,137 1,183 1,193 1,206 5.78}
{0 CHEMBL494896,1 1,2 1,26 1,115 1,118 1,137 1,206 6.478}
{0 CHEMBL494897,1 1,104 1,105 1,115 1,137 1,193 1,206 6.577}
{0 CHEMBL494898,1 1,104 1,105 1,115 1,137 1,193 1,206 6.399}
{0 CHEMBL495079,1 1,35 1,104 1,105 1,115 1,137 1,193 1,206 5.9}
{0 CHEMBL495126,1 1,104 1,105 1,137 1,193 1,206 5.6}
{0 CHEMBL495127,1 1,104 1,105 1,115 1,137 1,193 1,206 5.51}
{0 CHEMBL495315,1 1,70 1,104 1,105 1,137 1,193 1,206 4.58}
{0 CHEMBL495485,1 1,104 1,105 1,109 1,115 1,137 1,193 1,206 6.19}
{0 CHEMBL522167,1 1,35 1,104 1,105 1,115 1,137 1,193 1,206 5.6}
{0 CHEMBL522337,1 1,104 1,105 1,115 1,137 1,193 1,206 6.296}
{0 CHEMBL52251,1 1,52 1,115 1,137 1,206 5.658}
{0 CHEMBL522861,1 1,104 1,105 1,115 1,137 1,193 1,206 5.2}
{0 CHEMBL523845,1 1,104 1,105 1,137 1,193 1,206 4.015}
{0 CHEMBL524189,1 1,104 1,105 1,115 1,137 1,193 1,206 5.616}
{0 CHEMBL54004,1 1,115 1,137 1,206 6.149}
{0 CHEMBL55264,1 1,115 1,137 1,206 4.955}
{0 CHEMBL56073,1 1,2 1,104 1,105 1,118 1,137 1,193 1,206 5.39}
{0 CHEMBL56254,1 1,52 1,115 1,137 1,206 4.721}
{0 CHEMBL67986,1 1,2 1,39 1,99 1,118 1,137 1,164 1,177 1,200 1,206 6.432}
{0 CHEMBL69330,1 1,39 1,99 1,137 1,164 1,177 1,206 6.149}
{0 CHEMBL71017,1 1,2 1,39 1,99 1,118 1,137 1,164 1,177 1,200 1,206 6.131}
{0 CHEMBL71360,1 1,2 1,39 1,99 1,118 1,137 1,164 1,177 1,200 1,206 6.854}
{0 CHEMBL84909,1 1,39 1,137 1,206 5}
{0 CHEMBL86513,1 1,39 1,137 1,206 7}
{0 CHEMBL923,1 1,28 1,104 1,105 1,115 1,137 1,193 1,196 1,206 4}
{0 CHEMBL924,1 1,50 1,64 1,104 1,115 1,137 1,206 4}
{0 CHEMBL997,1 1,2 1,115 1,118 1,137 1,206 4.1}
