{
  "data_features": {
    "feature": [
      {
        "data_type": "nominal",
        "index": "0",
        "is_ignore": "false",
        "is_row_identifier": "true",
        "is_target": "false",
        "name": "molecule_id",
        "nominal_value": [
          "CHEMBL106681",
          "CHEMBL106804",
          "CHEMBL107171",
          "CHEMBL107521",
          "CHEMBL107573",
          "CHEMBL107585",
          "CHEMBL107994",
          "CHEMBL108803",
          "CHEMBL109318",
          "CHEMBL109867",
          "CHEMBL121607",
          "CHEMBL124167",
          "CHEMBL139598",
          "CHEMBL140853",
          "CHEMBL141926",
          "CHEMBL150472",
          "CHEMBL151182",
          "CHEMBL153631",
          "CHEMBL153687",
          "CHEMBL153784",
          "CHEMBL168210",
          "CHEMBL168672",
          "CHEMBL169148",
          "CHEMBL173350",
          "CHEMBL184251",
          "CHEMBL274879",
          "CHEMBL275989",
          "CHEMBL299880",
          "CHEMBL301989",
          "CHEMBL323163",
          "CHEMBL347069",
          "CHEMBL355626",
          "CHEMBL356390",
          "CHEMBL363742",
          "CHEMBL444837",
          "CHEMBL49333",
          "CHEMBL49480",
          "CHEMBL8523",
          "CHEMBL8548"
        ],
        "number_of_missing_values": "0"
      },
      {
        "data_type": "numeric",
        "index": "1",
        "is_ignore": "false",
        "is_row_identifier": "false",
        "is_target": "false",
        "name": "nN",
        "number_of_missing_values": "0"
      },
      {
        "data_type": "numeric",
        "index": "2",
        "is_ignore": "false",
        "is_row_identifier": "false",
        "is_target": "false",
        "name": "nHet",
        "number_of_missing_values": "0"
      },
      {
        "data_type": "numeric",
        "index": "3",
        "is_ignore": "false",
        "is_row_identifier": "false",
        "is_target": "true",
        "name": "pXC50",
        "number_of_missing_values": "0"
      }
    ]
  }
}