"molecule_id","nN","nHet","pXC50"
{1 3,2 7,3 4.301}
{0 CHEMBL106804,1 3,2 6,3 4.301}
{0 CHEMBL107171,1 2,2 6,3 5.24}
{0 CHEMBL107521,1 3,2 6,3 4.301}
{0 CHEMBL107573,1 3,2 6,3 4.301}
{0 CHEMBL107585,1 4,2 7,3 4.301}
{0 CHEMBL107994,1 3,2 6,3 4.301}
{0 CHEMBL108803,1 3,2 6,3 4.301}
{0 CHEMBL109318,1 3,2 6,3 4.301}
{0 CHEMBL109867,1 3,2 7,3 4.301}
{0 CHEMBL121607,1 3,2 6,3 4.301}
{0 CHEMBL124167,1 3,2 6,3 4.301}
{0 CHEMBL139598,1 1,2 5,3 5.023}
{0 CHEMBL140853,1 1,2 4,3 6.097}
{0 CHEMBL141926,1 2,2 6,3 4.531}
{0 CHEMBL150472,1 2,2 5,3 6.237}
{0 CHEMBL151182,1 2,2 5,3 5.785}
{0 CHEMBL153631,1 2,2 5,3 4.824}
{0 CHEMBL153687,1 2,2 5,3 5.125}
{0 CHEMBL153784,1 3,2 7,3 4.301}
{0 CHEMBL168210,1 3,2 6,3 4.301}
{0 CHEMBL168672,1 3,2 6,3 4.301}
{0 CHEMBL169148,1 3,2 7,3 4.301}
{0 CHEMBL173350,1 3,2 7,3 4.301}
{0 CHEMBL184251,1 3,2 8,3 4.301}
{0 CHEMBL274879,1 2,2 6,3 4.301}
{0 CHEMBL275989,1 2,2 5,3 6.201}
{0 CHEMBL299880,1 2,2 5,3 5.73}
{0 CHEMBL301989,1 2,2 6,3 5.244}
{0 CHEMBL323163,1 3,2 6,3 4.301}
{0 CHEMBL347069,1 2,2 5,3 5.194}
{0 CHEMBL355626,1 3,2 6,3 4.301}
{0 CHEMBL356390,1 2,2 5,3 5.222}
{0 CHEMBL363742,1 3,2 6,3 4.301}
{0 CHEMBL444837,1 2,2 5,3 5.367}
{0 CHEMBL49333,1 2,2 5,3 4.301}
{0 CHEMBL49480,1 2,2 5,3 4.745}
{0 CHEMBL8523,1 3,2 6,3 4.301}
{0 CHEMBL8548,1 2,2 5,3 5.668}
