"molecule_id","AMW","C.","H.","Me","Mi","Mp","Mv","MW","N.","nAB","nAT","nB","nBM","nBO","nBR","nBT","nC","nCL","nCsp","nCsp2","nCsp3","nDB","nF","nH","nHet","nHM","nI","nN","nO","nP","nS","nSK","nTB","nX","O.","RBF","RBN","SCBO","Se","Si","Sp","Sv","X.","pXC50"
{1 6.874,2 36,3 50.6,4 1.005,5 1.138,6 0.623,7 0.592,8 611.82,9 5.6,10 10,11 89,13 15,14 47,16 92,17 32,20 13,21 19,22 5,24 45,25 12,28 5,29 7,32 44,35 7.9,36 0.12,37 11,38 57,39 89.472,40 101.261,41 55.438,42 52.647,44 7.523}
{0 CHEMBL149842,1 6.859,2 36.6,3 50.5,4 1.004,5 1.136,6 0.626,7 0.593,8 637.86,9 5.4,10 10,11 93,13 15,14 50,16 97,17 34,20 13,21 21,22 5,24 47,25 12,28 5,29 7,32 46,35 7.5,36 0.124,37 12,38 60,39 93.356,40 105.677,41 58.199,42 55.173,44 9}
{0 CHEMBL1790593,1 6.687,2 34.4,3 52.2,4 1.004,5 1.141,6 0.613,7 0.58,8 601.83,9 5.6,10 6,11 90,13 11,14 45,16 92,17 31,20 11,21 20,22 5,24 47,25 12,28 5,29 7,32 43,35 7.8,36 0.13,37 12,38 53,39 90.356,40 102.677,41 55.199,42 52.173,44 8.318}
{0 CHEMBL1793967,1 6.83,2 37.1,3 50.6,4 1.002,5 1.135,6 0.629,7 0.595,8 607.83,9 5.6,10 10,11 89,13 16,14 47,16 92,17 33,20 14,21 19,22 6,24 45,25 11,28 5,29 6,32 44,35 6.7,36 0.12,37 11,38 58,39 89.145,40 101.052,41 55.983,42 52.932,44 8}
{0 CHEMBL1793968,1 6.976,2 35.6,3 50,4 1.009,5 1.139,6 0.621,7 0.593,8 627.82,9 5.6,10 6,11 90,13 14,14 47,16 92,17 32,20 12,21 20,22 8,24 45,25 13,28 5,29 8,32 45,35 8.9,36 0.141,37 13,38 58,39 90.799,40 102.471,41 55.892,42 53.361,44 7.481}
{0 CHEMBL1793969,1 6.623,2 36.4,3 52.3,4 0.999,5 1.136,6 0.622,7 0.585,8 582.82,9 4.5,10 6,11 88,13 12,14 44,16 90,17 32,20 12,21 20,22 6,24 46,25 10,28 4,29 6,32 42,35 6.8,36 0.133,37 12,38 53,39 87.927,40 99.969,41 54.739,42 51.437,44 7.699}
{0 CHEMBL1793972,1 6.694,2 36.8,3 51.6,4 0.999,5 1.136,6 0.626,7 0.589,8 635.89,9 5.3,10 6,11 95,13 13,14 49,16 98,17 35,20 14,21 21,22 7,24 49,25 11,28 5,29 6,32 46,35 6.3,36 0.112,37 11,38 59,39 94.912,40 107.882,41 59.506,42 55.985,44 7.959}
{0 CHEMBL1793973,1 6.859,2 36.6,3 50.5,4 1.004,5 1.136,6 0.626,7 0.593,8 637.86,9 5.4,10 6,11 93,13 13,14 49,16 96,17 34,20 14,21 20,22 7,24 47,25 12,28 5,29 7,32 46,35 7.5,36 0.115,37 11,38 59,39 93.356,40 105.677,41 58.199,42 55.173,44 8.398}
{0 CHEMBL1793974,1 6.498,2 35.6,3 53.3,4 0.998,5 1.138,6 0.617,7 0.577,8 584.84,9 4.4,10 6,11 90,13 11,14 44,16 92,17 32,20 11,21 21,22 5,24 48,25 10,28 4,29 6,32 42,35 6.7,36 0.141,37 13,38 52,39 89.81,40 102.384,41 55.501,42 51.964,44 8.523}
{0 CHEMBL1793975,1 7.475,2 36.7,3 51.1,4 0.999,5 1.134,6 0.64,7 0.597,8 672.74,9 5.6,10 10,11 90,13 15,14 47,15 1,16 93,17 33,20 13,21 20,22 5,24 46,25 11,26 1,28 5,29 5,32 44,34 1,35 5.6,36 0.118,37 11,38 57,39 89.93,40 102.099,41 57.643,42 53.769,43 1.1,44 6.699}
{0 CHEMBL1793976,1 6.757,2 39.3,3 50.5,4 0.995,5 1.131,6 0.641,7 0.601,8 723.02,9 5.6,10 20,11 107,13 25,14 58,16 112,17 42,20 21,21 21,22 5,24 54,25 11,28 6,29 5,32 53,35 4.7,36 0.107,37 12,38 73,39 106.454,40 121.002,41 68.58,42 64.346,44 7.602}
{0 CHEMBL1793977,1 6.791,2 36.5,3 51,4 1.002,5 1.136,6 0.625,7 0.591,8 651.89,9 5.2,10 10,11 96,13 16,14 50,16 99,17 35,20 14,21 21,22 6,24 49,25 12,28 5,29 7,32 47,35 7.3,36 0.131,37 13,38 61,39 96.239,40 109.092,41 59.961,42 56.7,44 7}
{0 CHEMBL1793978,1 6.559,2 36.3,3 52.7,4 0.998,5 1.136,6 0.621,7 0.582,8 596.85,9 4.4,10 6,11 91,13 12,14 45,16 93,17 33,20 12,21 21,22 6,24 48,25 10,28 4,29 6,32 43,35 6.6,36 0.14,37 13,38 54,39 90.81,40 103.384,41 56.501,42 52.964,44 7.301}
{0 CHEMBL1793979,1 6.759,2 37,3 51.1,4 1,5 1.136,6 0.628,7 0.592,8 621.86,9 5.4,10 10,11 92,13 16,14 48,16 95,17 34,20 14,21 20,22 6,24 47,25 11,28 5,29 6,32 45,35 6.5,36 0.116,37 11,38 59,39 92.028,40 104.467,41 57.745,42 54.459,44 7.523}
{0 CHEMBL1793980,1 6.83,2 37.1,3 50.6,4 1.002,5 1.135,6 0.629,7 0.595,8 607.83,9 5.6,10 10,11 89,13 16,14 47,16 92,17 33,20 14,21 19,22 6,24 45,25 11,28 5,29 6,32 44,35 6.7,36 0.12,37 11,38 58,39 89.145,40 101.052,41 55.983,42 52.932,44 7.638}
{0 CHEMBL1793981,1 6.254,2 33.3,3 55.6,4 0.997,5 1.142,6 0.603,7 0.561,8 562.84,9 4.4,11 90,13 6,14 41,16 91,17 30,20 6,21 24,22 6,24 50,25 10,28 4,29 6,32 40,35 6.7,36 0.132,37 12,38 47,39 89.694,40 102.799,41 54.262,42 50.491,44 7.347}
{0 CHEMBL1793982,1 6.553,2 36.9,3 52.4,4 0.995,5 1.136,6 0.627,7 0.586,8 674.98,9 5.8,10 11,11 103,13 16,14 53,16 107,17 38,20 14,21 24,22 5,24 54,25 11,28 6,29 5,32 49,35 4.9,36 0.103,37 11,38 63.5,39 102.454,40 117.002,41 64.58,42 60.346,44 9.097}
{0 CHEMBL1793983,1 7.117,2 37.5,3 50,4 1.002,5 1.134,6 0.641,7 0.603,8 626.27,9 5.7,10 11,11 88,13 16,14 47,16 91,17 33,18 1,20 14,21 19,22 5,24 44,25 11,26 1,28 5,29 5,32 44,34 1,35 5.7,36 0.11,37 10,38 57.5,39 88.141,40 99.787,41 56.387,42 53.044,43 1.1,44 8.699}
{0 CHEMBL1793985,1 6.759,2 38,3 50.9,4 0.999,5 1.133,6 0.632,7 0.595,8 730.01,9 4.6,10 16,11 108,13 21,14 57,16 112,17 41,20 19,21 22,22 5,24 55,25 12,28 5,29 7,32 53,35 6.5,36 0.125,37 14,38 70,39 107.89,40 122.337,41 68.245,42 64.281,44 9.699}
{0 CHEMBL1793986,1 7.342,2 35.4,3 52.1,4 1,5 1.137,6 0.631,7 0.589,8 704.79,9 5.2,10 6,11 96,13 11,14 49,15 1,16 99,17 34,20 11,21 23,22 5,24 50,25 12,26 1,28 5,29 6,32 46,34 1,35 6.3,36 0.121,37 12,38 57,39 96.025,40 109.139,41 60.62,42 56.537,43 1,44 5.602}
{0 CHEMBL1793988,1 7.476,2 36.2,3 51.1,4 1.002,5 1.135,6 0.637,7 0.596,8 702.77,9 5.3,10 10,11 94,13 15,14 49,15 1,16 97,17 34,20 13,21 21,22 5,24 48,25 12,26 1,28 5,29 6,32 46,34 1,35 6.4,36 0.124,37 12,38 59,39 94.141,40 106.724,41 59.859,42 56.011,43 1.1,44 6.757}
{0 CHEMBL1793989,1 6.598,2 36.7,3 52.2,4 0.997,5 1.136,6 0.625,7 0.586,8 593.85,9 5.6,10 10,11 90,13 15,14 46,16 93,17 33,20 13,21 20,22 5,24 47,25 10,28 5,29 5,32 43,35 5.6,36 0.118,37 11,38 56,39 89.701,40 102.258,41 56.29,42 52.744,44 9}
{0 CHEMBL1793990,1 6.632,2 36.7,3 52,4 0.998,5 1.136,6 0.625,7 0.587,8 649.92,9 5.1,10 10,11 98,13 16,14 50,16 101,17 36,20 14,21 22,22 6,24 51,25 11,28 5,29 6,32 47,35 6.1,36 0.129,37 13,38 61,39 97.796,40 111.298,41 61.268,42 57.512,44 8.398}
{0 CHEMBL1793993,1 6.478,2 36.5,3 53.1,4 0.994,5 1.136,6 0.623,7 0.581,8 621.91,9 5.2,10 10,11 96,13 15,14 48,16 99,17 35,20 13,21 22,22 5,24 51,25 10,28 5,29 5,32 45,35 5.2,36 0.121,37 12,38 58,39 95.468,40 109.088,41 59.813,42 55.797,44 7}
{0 CHEMBL1793994,1 6.536,2 36.6,3 52.7,4 0.996,5 1.136,6 0.624,7 0.584,8 607.88,9 5.4,10 10,11 93,13 15,14 47,16 96,17 34,20 13,21 21,22 5,24 49,25 10,28 5,29 5,32 44,35 5.4,36 0.115,37 11,38 57,39 92.585,40 105.673,41 58.052,42 54.271,44 8.301}
{0 CHEMBL356176,1 6.736,2 35.8,3 51.6,4 1.003,5 1.138,6 0.621,7 0.586,8 639.88,9 5.3,10 10,11 95,13 15,14 49,16 98,17 34,20 13,21 21,22 5,24 49,25 12,28 5,29 7,32 46,35 7.4,36 0.122,37 12,38 59,39 95.239,40 108.092,41 58.961,42 55.7,44 8.398}
{0 CHEMBL356177,1 6.803,2 35.9,3 51.1,4 1.004,5 1.138,6 0.622,7 0.589,8 625.85,9 5.4,10 10,11 92,13 15,14 48,16 95,17 33,20 13,21 20,22 5,24 47,25 12,28 5,29 7,32 45,35 7.6,36 0.126,37 12,38 58,39 92.356,40 104.677,41 57.199,42 54.173,44 9.097}
{0 CHEMBL358466,1 6.888,2 35.2,3 50.5,4 1.006,5 1.14,6 0.62,7 0.59,8 626.84,9 6.6,10 10,11 91,13 15,14 48,16 94,17 32,20 13,21 19,22 5,24 46,25 13,28 6,29 7,32 45,35 7.7,36 0.117,37 11,38 58,39 91.574,40 103.76,41 56.444,42 53.668,44 8.398}
{0 CHEMBL430060,1 6.637,2 36.2,3 52.1,4 0.999,5 1.137,6 0.622,7 0.585,8 623.88,9 5.3,10 10,11 94,13 15,14 48,16 97,17 34,20 13,21 21,22 5,24 49,25 11,28 5,29 6,32 45,35 6.4,36 0.124,37 12,38 58,39 93.912,40 106.882,41 58.506,42 54.985,44 9}
