{
  "data_set_description": {
    "collection_date": "November 2013",
    "creator": "Dr Jeremy Besnard, Dr Ivan Olier, Dr Noureddin Sadawi, Dr Larisa Soldatova, Dr Crina Grosan, Prof Ross King, Dr Richard Bickerton, Prof Andrew Hopkins and Dr Willem van Hoorn",
    "default_target_attribute": "pXC50",
    "description": "This dataset contains QSAR data (from ChEMBL version 17) showing activity values (unit is pseudo-pCI50) of several compounds on drug target ChEMBL_ID: CHEMBL1795148 (TID: 104228), and it has 32 rows and 1051 features (not including molecule IDs and class feature: molecule_id and pXC50). The features represent Molecular Descriptors which were generated from SMILES strings. Missing value imputation was applied to this dataset (By choosing the Median).",
    "description_version": "1",
    "file_id": "3332716",
    "format": "ARFF",
    "id": "27524",
    "licence": "Public",
    "md5_checksum": "6c7b0806d4f565ce27cad8127a47a95f",
    "minio_url": "https://data.openml.org/datasets/0002/27524/dataset_27524.pq",
    "name": "QSAR-DATASET-FOR-DRUG-TARGET-CHEMBL1795148",
    "original_data_url": "https://www.ebi.ac.uk/chembl/target/inspect/CHEMBL1795148",
    "parquet_url": "https://data.openml.org/datasets/0002/27524/dataset_27524.pq",
    "processing_date": "2018-10-04 00:22:49",
    "row_id_attribute": "molecule_id",
    "status": "deactivated",
    "tag": [
      "MetaQSAR",
      "study_13"
    ],
    "upload_date": "2016-07-14T21:46:53",
    "url": "https://api.openml.org/data/v1/download/3332716/QSAR-DATASET-FOR-DRUG-TARGET-CHEMBL1795148.arff",
    "version": "6",
    "visibility": "public"
  }
}