"molecule_id","FCFP4_1024b760","FCFP4_1024b616","FCFP4_1024b303","FCFP4_1024b352","FCFP4_1024b564","FCFP4_1024b294","FCFP4_1024b764","FCFP4_1024b229","FCFP4_1024b876","FCFP4_1024b409","FCFP4_1024b870","FCFP4_1024b107","FCFP4_1024b758","FCFP4_1024b855","FCFP4_1024b2","FCFP4_1024b521","FCFP4_1024b925","FCFP4_1024b504","FCFP4_1024b632","FCFP4_1024b603","FCFP4_1024b683","FCFP4_1024b492","FCFP4_1024b859","FCFP4_1024b65","FCFP4_1024b429","FCFP4_1024b799","FCFP4_1024b152","FCFP4_1024b376","FCFP4_1024b943","FCFP4_1024b284","FCFP4_1024b446","FCFP4_1024b529","FCFP4_1024b705","FCFP4_1024b892","FCFP4_1024b273","FCFP4_1024b655","FCFP4_1024b863","FCFP4_1024b846","FCFP4_1024b947","FCFP4_1024b537","FCFP4_1024b592","FCFP4_1024b958","FCFP4_1024b978","FCFP4_1024b1","FCFP4_1024b10","FCFP4_1024b100","FCFP4_1024b1000","FCFP4_1024b1001","FCFP4_1024b1002","FCFP4_1024b1003","FCFP4_1024b1004","FCFP4_1024b1005","FCFP4_1024b1006","FCFP4_1024b1007","FCFP4_1024b1008","FCFP4_1024b1009","FCFP4_1024b101","FCFP4_1024b1010","FCFP4_1024b1011","FCFP4_1024b1012","FCFP4_1024b1013","FCFP4_1024b1014","FCFP4_1024b1015","FCFP4_1024b1016","FCFP4_1024b1017","FCFP4_1024b1018","FCFP4_1024b1019","FCFP4_1024b102","FCFP4_1024b1020","FCFP4_1024b1021","FCFP4_1024b1022","FCFP4_1024b1023","FCFP4_1024b1024","FCFP4_1024b103","FCFP4_1024b104","FCFP4_1024b105","FCFP4_1024b106","FCFP4_1024b108","FCFP4_1024b109","FCFP4_1024b11","FCFP4_1024b110","FCFP4_1024b111","FCFP4_1024b112","FCFP4_1024b113","FCFP4_1024b114","FCFP4_1024b115","FCFP4_1024b116","FCFP4_1024b117","FCFP4_1024b118","FCFP4_1024b119","FCFP4_1024b12","FCFP4_1024b120","FCFP4_1024b121","FCFP4_1024b122","FCFP4_1024b123","FCFP4_1024b124","FCFP4_1024b125","FCFP4_1024b126","FCFP4_1024b127","FCFP4_1024b128","FCFP4_1024b129","FCFP4_1024b13","pXC50"
{1 1,2 1,3 1,4 1,5 1,6 1,7 1,8 1,9 1,10 1,11 1,12 1,13 1,14 1,16 1,18 1,19 1,21 1,22 1,23 1,30 1,33 1,36 1,37 1,44 1,103 4.097}
{0 CHEMBL1097701,12 1,15 1,16 1,17 1,19 1,27 1,44 1,45 1,64 1,74 1,91 1,95 1,103 4.542}
{0 CHEMBL115845,15 1,22 1,25 1,28 1,44 1,101 1,103 5.481}
{0 CHEMBL116780,15 1,22 1,25 1,28 1,44 1,101 1,103 5.569}
{0 CHEMBL1269457,15 1,17 1,20 1,24 1,27 1,28 1,44 1,45 1,76 1,103 5.31}
{0 CHEMBL1270208,15 1,16 1,17 1,20 1,25 1,44 1,49 1,103 5}
{0 CHEMBL1271309,12 1,15 1,16 1,17 1,32 1,44 1,45 1,49 1,67 1,103 5}
{0 CHEMBL132818,15 1,17 1,22 1,24 1,25 1,28 1,44 1,103 6.174}
{0 CHEMBL132914,15 1,17 1,20 1,24 1,25 1,28 1,44 1,103 6.125}
{0 CHEMBL135329,15 1,17 1,20 1,24 1,25 1,26 1,27 1,28 1,29 1,44 1,103 6.495}
{0 CHEMBL135401,15 1,17 1,20 1,24 1,25 1,28 1,44 1,103 6.367}
{0 CHEMBL135637,15 1,17 1,20 1,24 1,25 1,28 1,44 1,68 1,103 6.081}
{0 CHEMBL135646,15 1,17 1,20 1,24 1,25 1,26 1,27 1,28 1,29 1,44 1,103 6}
{0 CHEMBL135774,15 1,17 1,20 1,23 1,24 1,25 1,28 1,44 1,94 1,103 6.319}
{0 CHEMBL13674,15 1,17 1,20 1,24 1,25 1,26 1,27 1,28 1,44 1,45 1,64 1,103 6.495}
{0 CHEMBL137037,15 1,20 1,23 1,24 1,25 1,28 1,44 1,94 1,103 5.328}
{0 CHEMBL13798,15 1,17 1,20 1,24 1,25 1,26 1,27 1,28 1,44 1,45 1,103 6.31}
{0 CHEMBL13944,15 1,17 1,20 1,24 1,25 1,26 1,27 1,28 1,44 1,45 1,103 6}
{0 CHEMBL13959,15 1,17 1,20 1,24 1,25 1,26 1,27 1,28 1,44 1,45 1,103 6.108}
{0 CHEMBL13989,15 1,17 1,20 1,24 1,25 1,26 1,27 1,28 1,44 1,45 1,103 5.959}
{0 CHEMBL14091,15 1,17 1,20 1,24 1,25 1,26 1,27 1,28 1,29 1,34 1,44 1,45 1,103 5.796}
{0 CHEMBL14762,1 1,2 1,3 1,4 1,5 1,6 1,7 1,8 1,9 1,10 1,11 1,12 1,13 1,14 1,16 1,18 1,19 1,21 1,22 1,23 1,30 1,33 1,36 1,37 1,44 1,103 4.559}
{0 CHEMBL1643712,15 1,17 1,20 1,23 1,44 1,49 1,67 1,94 1,95 1,103 6.056}
{0 CHEMBL1643713,15 1,17 1,18 1,19 1,22 1,23 1,26 1,44 1,49 1,67 1,78 1,103 6.222}
{0 CHEMBL1643714,14 1,15 1,17 1,18 1,19 1,22 1,44 1,49 1,67 1,103 6.06}
{0 CHEMBL1643718,14 1,15 1,17 1,18 1,19 1,20 1,22 1,26 1,27 1,44 1,49 1,67 1,103 5.939}
{0 CHEMBL1643719,14 1,15 1,17 1,18 1,19 1,20 1,22 1,23 1,27 1,44 1,49 1,67 1,103 5.932}
{0 CHEMBL1643720,14 1,15 1,17 1,18 1,19 1,20 1,22 1,34 1,44 1,49 1,67 1,103 6.167}
{0 CHEMBL1643723,15 1,17 1,18 1,19 1,20 1,27 1,34 1,44 1,49 1,67 1,93 1,103 6.18}
{0 CHEMBL1643724,15 1,17 1,18 1,19 1,20 1,27 1,34 1,44 1,49 1,67 1,103 6.721}
{0 CHEMBL1643725,15 1,17 1,18 1,19 1,20 1,27 1,34 1,44 1,49 1,67 1,74 1,103 6.284}
{0 CHEMBL1643726,15 1,17 1,18 1,19 1,20 1,23 1,27 1,34 1,44 1,49 1,67 1,103 6.268}
{0 CHEMBL1651027,15 1,17 1,19 1,20 1,22 1,23 1,26 1,27 1,29 1,44 1,69 1,86 1,96 1,103 7.549}
{0 CHEMBL1684954,15 1,16 1,17 1,20 1,24 1,25 1,27 1,28 1,40 1,44 1,103 4.523}
{0 CHEMBL170243,15 1,17 1,20 1,24 1,25 1,26 1,27 1,28 1,29 1,34 1,41 1,42 1,43 1,44 1,86 1,95 1,103 6.301}
{0 CHEMBL170403,15 1,17 1,20 1,24 1,25 1,26 1,27 1,28 1,44 1,76 1,100 1,103 6.036}
{0 CHEMBL170453,15 1,17 1,20 1,24 1,25 1,26 1,27 1,28 1,34 1,41 1,42 1,43 1,44 1,76 1,95 1,100 1,103 6.409}
{0 CHEMBL170471,15 1,17 1,20 1,24 1,25 1,26 1,27 1,28 1,29 1,34 1,44 1,45 1,88 1,103 6.398}
{0 CHEMBL170618,15 1,17 1,20 1,24 1,25 1,26 1,27 1,28 1,29 1,34 1,38 1,39 1,41 1,42 1,43 1,44 1,86 1,95 1,103 6.444}
{0 CHEMBL170698,15 1,17 1,20 1,24 1,25 1,26 1,27 1,28 1,29 1,34 1,38 1,39 1,41 1,42 1,43 1,44 1,45 1,86 1,95 1,103 6.481}
{0 CHEMBL171282,15 1,17 1,20 1,22 1,24 1,25 1,26 1,27 1,28 1,29 1,34 1,44 1,103 5.42}
{0 CHEMBL171442,15 1,17 1,20 1,24 1,25 1,26 1,27 1,28 1,29 1,34 1,44 1,45 1,103 5.357}
{0 CHEMBL171526,15 1,17 1,22 1,24 1,25 1,28 1,44 1,100 1,103 5.237}
{0 CHEMBL171586,15 1,17 1,20 1,24 1,25 1,26 1,27 1,28 1,29 1,34 1,44 1,45 1,103 5.854}
{0 CHEMBL171631,15 1,17 1,20 1,24 1,25 1,26 1,27 1,28 1,29 1,34 1,44 1,45 1,103 5.194}
{0 CHEMBL171817,15 1,17 1,20 1,24 1,25 1,26 1,27 1,28 1,44 1,76 1,100 1,103 5.921}
{0 CHEMBL172239,11 1,15 1,17 1,20 1,25 1,26 1,27 1,29 1,34 1,41 1,42 1,43 1,44 1,86 1,95 1,103 6.222}
{0 CHEMBL172384,15 1,17 1,20 1,22 1,23 1,24 1,25 1,26 1,27 1,28 1,29 1,38 1,39 1,44 1,45 1,86 1,103 6.456}
{0 CHEMBL172936,15 1,17 1,20 1,24 1,25 1,26 1,27 1,28 1,44 1,45 1,49 1,69 1,103 5.921}
{0 CHEMBL173002,15 1,17 1,20 1,22 1,24 1,25 1,26 1,27 1,28 1,29 1,34 1,44 1,45 1,103 5.658}
{0 CHEMBL173056,15 1,17 1,20 1,24 1,25 1,26 1,27 1,28 1,29 1,34 1,44 1,45 1,103 5.509}
{0 CHEMBL173060,15 1,17 1,20 1,24 1,25 1,26 1,27 1,28 1,29 1,34 1,44 1,45 1,103 6.553}
{0 CHEMBL173121,15 1,17 1,20 1,24 1,25 1,28 1,44 1,76 1,100 1,103 6.215}
{0 CHEMBL173582,9 1,15 1,16 1,17 1,20 1,24 1,25 1,28 1,44 1,76 1,92 1,100 1,103 5.721}
{0 CHEMBL176918,15 1,17 1,20 1,24 1,25 1,26 1,27 1,28 1,29 1,44 1,76 1,86 1,100 1,103 5.569}
{0 CHEMBL177237,15 1,17 1,20 1,25 1,26 1,27 1,29 1,34 1,41 1,42 1,43 1,44 1,86 1,95 1,103 5.745}
{0 CHEMBL190784,10 1,15 1,20 1,23 1,24 1,25 1,28 1,44 1,45 1,100 1,103 6.277}
{0 CHEMBL201057,15 1,17 1,44 1,66 1,78 1,103 5.77}
{0 CHEMBL201061,11 1,15 1,17 1,44 1,66 1,78 1,103 5.456}
{0 CHEMBL201257,15 1,17 1,44 1,66 1,67 1,78 1,103 5.337}
{0 CHEMBL201258,15 1,17 1,44 1,66 1,103 5.959}
{0 CHEMBL201306,15 1,17 1,44 1,66 1,78 1,103 5.886}
{0 CHEMBL201401,15 1,17 1,44 1,58 1,66 1,67 1,78 1,103 4.432}
{0 CHEMBL201566,8 1,15 1,17 1,44 1,66 1,103 6.167}
{0 CHEMBL201599,15 1,17 1,20 1,23 1,27 1,44 1,78 1,103 5.347}
{0 CHEMBL201860,15 1,17 1,44 1,66 1,103 6}
{0 CHEMBL201984,15 1,17 1,25 1,44 1,66 1,103 6.081}
{0 CHEMBL202374,15 1,17 1,44 1,66 1,67 1,78 1,103 5.745}
{0 CHEMBL202459,15 1,16 1,17 1,44 1,66 1,78 1,103 5.208}
{0 CHEMBL202464,15 1,17 1,44 1,66 1,78 1,103 5.699}
{0 CHEMBL202605,1 1,12 1,15 1,17 1,27 1,44 1,66 1,103 4.553}
{0 CHEMBL203041,15 1,17 1,44 1,66 1,78 1,103 6.051}
{0 CHEMBL2030591,15 1,17 1,20 1,44 1,78 1,103 5.959}
{0 CHEMBL2030592,15 1,17 1,20 1,44 1,78 1,103 5.959}
{0 CHEMBL2030593,15 1,17 1,20 1,44 1,78 1,103 6}
{0 CHEMBL2030594,15 1,17 1,20 1,44 1,78 1,103 6.284}
{0 CHEMBL2030595,15 1,17 1,20 1,24 1,25 1,28 1,44 1,78 1,100 1,103 5.824}
{0 CHEMBL2030596,15 1,17 1,20 1,25 1,28 1,44 1,78 1,100 1,103 5.921}
{0 CHEMBL2030597,15 1,17 1,20 1,44 1,67 1,78 1,91 1,103 5.959}
{0 CHEMBL2030598,15 1,17 1,20 1,44 1,78 1,103 5.796}
{0 CHEMBL2030599,15 1,17 1,20 1,44 1,78 1,103 5.921}
{0 CHEMBL2030600,15 1,17 1,20 1,44 1,78 1,103 6.125}
{0 CHEMBL2030601,15 1,17 1,20 1,44 1,67 1,78 1,91 1,103 5.921}
{0 CHEMBL2030602,15 1,17 1,20 1,24 1,25 1,28 1,44 1,78 1,100 1,103 5.886}
{0 CHEMBL2030603,15 1,17 1,20 1,25 1,28 1,44 1,78 1,100 1,103 6.143}
{0 CHEMBL203470,15 1,16 1,17 1,44 1,66 1,78 1,103 4.62}
{0 CHEMBL204486,11 1,15 1,17 1,44 1,66 1,78 1,103 4.432}
{0 CHEMBL210514,1 1,2 1,12 1,15 1,16 1,17 1,23 1,25 1,28 1,35 1,44 1,45 1,67 1,103 5.281}
{0 CHEMBL2114022,15 1,17 1,20 1,24 1,25 1,28 1,44 1,100 1,103 5.699}
{0 CHEMBL2180887,15 1,17 1,44 1,45 1,67 1,91 1,103 5.602}
{0 CHEMBL2180889,15 1,17 1,20 1,24 1,25 1,28 1,44 1,45 1,103 5.959}
{0 CHEMBL2180891,15 1,17 1,24 1,25 1,28 1,44 1,45 1,67 1,87 1,91 1,100 1,103 5.319}
{0 CHEMBL2180892,15 1,17 1,24 1,25 1,28 1,44 1,45 1,67 1,87 1,91 1,100 1,103 7.222}
{0 CHEMBL2180894,15 1,17 1,20 1,24 1,25 1,28 1,44 1,45 1,67 1,91 1,103 6.921}
{0 CHEMBL2180895,15 1,17 1,20 1,24 1,25 1,28 1,44 1,45 1,67 1,91 1,103 6.432}
{0 CHEMBL2180896,15 1,17 1,20 1,24 1,25 1,28 1,44 1,45 1,67 1,91 1,103 6.523}
{0 CHEMBL2180897,15 1,17 1,44 1,45 1,67 1,91 1,103 6.42}
{0 CHEMBL2180898,15 1,17 1,24 1,28 1,44 1,45 1,67 1,91 1,103 6.62}
{0 CHEMBL2180902,15 1,17 1,44 1,45 1,67 1,91 1,103 6.18}
{0 CHEMBL2180905,15 1,17 1,44 1,45 1,67 1,91 1,103 6.252}
{0 CHEMBL2206239,1 1,2 1,3 1,4 1,5 1,6 1,7 1,8 1,9 1,10 1,11 1,12 1,13 1,14 1,16 1,18 1,19 1,21 1,22 1,23 1,30 1,36 1,37 1,44 1,46 1,103 4.947}
{0 CHEMBL2206240,1 1,2 1,3 1,4 1,5 1,6 1,7 1,8 1,9 1,10 1,11 1,12 1,13 1,14 1,16 1,18 1,19 1,21 1,22 1,23 1,30 1,33 1,36 1,37 1,44 1,67 1,91 1,103 4}
{0 CHEMBL2206241,1 1,2 1,3 1,4 1,5 1,6 1,7 1,8 1,9 1,10 1,11 1,12 1,13 1,14 1,16 1,18 1,19 1,21 1,22 1,23 1,31 1,35 1,44 1,46 1,103 4.523}
{0 CHEMBL2206242,1 1,2 1,3 1,4 1,5 1,6 1,7 1,8 1,9 1,10 1,11 1,12 1,13 1,14 1,16 1,18 1,19 1,21 1,22 1,23 1,32 1,44 1,46 1,103 5.142}
{0 CHEMBL2206243,1 1,2 1,3 1,4 1,5 1,6 1,7 1,8 1,9 1,10 1,11 1,12 1,13 1,14 1,16 1,18 1,19 1,21 1,22 1,23 1,32 1,33 1,44 1,103 4}
{0 CHEMBL2206244,1 1,2 1,3 1,4 1,5 1,6 1,7 1,8 1,9 1,10 1,11 1,12 1,13 1,14 1,16 1,18 1,19 1,22 1,23 1,25 1,32 1,40 1,44 1,103 4}
{0 CHEMBL2206245,1 1,2 1,3 1,4 1,5 1,6 1,7 1,8 1,9 1,10 1,11 1,12 1,13 1,14 1,16 1,18 1,19 1,21 1,22 1,23 1,31 1,33 1,35 1,44 1,103 4}
{0 CHEMBL2206246,1 1,2 1,3 1,4 1,5 1,6 1,7 1,8 1,9 1,10 1,11 1,12 1,13 1,14 1,16 1,18 1,19 1,22 1,23 1,31 1,35 1,44 1,103 4}
{0 CHEMBL2206247,1 1,2 1,3 1,4 1,5 1,6 1,7 1,8 1,9 1,10 1,11 1,12 1,13 1,14 1,16 1,18 1,19 1,22 1,23 1,31 1,35 1,40 1,44 1,103 4}
{0 CHEMBL2206248,1 1,2 1,3 1,4 1,5 1,6 1,7 1,8 1,9 1,10 1,11 1,12 1,13 1,14 1,16 1,18 1,19 1,21 1,22 1,23 1,31 1,33 1,35 1,44 1,103 4.155}
{0 CHEMBL2206249,1 1,2 1,3 1,4 1,5 1,6 1,7 1,8 1,9 1,10 1,11 1,12 1,14 1,16 1,18 1,19 1,22 1,23 1,31 1,35 1,44 1,103 4}
{0 CHEMBL2206250,1 1,2 1,3 1,4 1,5 1,6 1,7 1,8 1,9 1,10 1,11 1,12 1,13 1,14 1,16 1,18 1,19 1,22 1,23 1,25 1,31 1,35 1,40 1,44 1,103 4}
{0 CHEMBL2206251,1 1,2 1,3 1,4 1,5 1,6 1,7 1,8 1,9 1,10 1,11 1,12 1,13 1,14 1,16 1,18 1,19 1,21 1,22 1,23 1,31 1,33 1,35 1,44 1,103 4}
{0 CHEMBL2206252,1 1,2 1,3 1,4 1,5 1,6 1,7 1,8 1,9 1,10 1,11 1,12 1,13 1,14 1,16 1,18 1,19 1,21 1,22 1,23 1,32 1,33 1,44 1,91 1,103 4}
{0 CHEMBL2206253,1 1,2 1,3 1,4 1,5 1,6 1,7 1,8 1,9 1,10 1,11 1,12 1,13 1,14 1,16 1,18 1,19 1,22 1,23 1,25 1,30 1,36 1,37 1,40 1,44 1,103 4}
{0 CHEMBL2206254,1 1,2 1,3 1,4 1,5 1,6 1,7 1,8 1,9 1,10 1,11 1,12 1,13 1,14 1,16 1,18 1,19 1,22 1,23 1,30 1,36 1,37 1,40 1,44 1,103 4}
{0 CHEMBL2206255,1 1,2 1,3 1,4 1,5 1,6 1,7 1,8 1,9 1,10 1,11 1,12 1,13 1,14 1,16 1,18 1,19 1,22 1,23 1,30 1,36 1,37 1,44 1,103 4}
{0 CHEMBL2206259,1 1,2 1,3 1,4 1,5 1,6 1,7 1,8 1,9 1,10 1,11 1,12 1,13 1,14 1,16 1,18 1,19 1,21 1,22 1,23 1,32 1,33 1,44 1,103 4}
{0 CHEMBL2206260,1 1,2 1,3 1,4 1,5 1,6 1,7 1,8 1,9 1,10 1,11 1,12 1,13 1,14 1,16 1,18 1,19 1,22 1,23 1,32 1,44 1,103 4}
{0 CHEMBL2206261,1 1,2 1,3 1,4 1,5 1,6 1,7 1,8 1,9 1,10 1,11 1,12 1,13 1,14 1,16 1,18 1,19 1,22 1,23 1,32 1,40 1,44 1,103 4}
{0 CHEMBL2206262,1 1,2 1,3 1,4 1,5 1,6 1,7 1,8 1,9 1,10 1,11 1,12 1,13 1,14 1,16 1,18 1,19 1,21 1,22 1,23 1,32 1,33 1,44 1,103 4.847}
{0 CHEMBL2206263,1 1,2 1,3 1,4 1,5 1,6 1,7 1,8 1,9 1,10 1,11 1,12 1,14 1,16 1,18 1,19 1,22 1,23 1,32 1,44 1,103 4}
{0 CHEMBL231799,15 1,16 1,17 1,25 1,44 1,103 6.155}
{0 CHEMBL231820,15 1,16 1,17 1,44 1,59 1,103 6.678}
{0 CHEMBL231826,15 1,16 1,17 1,24 1,25 1,28 1,44 1,100 1,103 5.049}
{0 CHEMBL232032,15 1,16 1,17 1,44 1,59 1,103 6.201}
{0 CHEMBL232034,15 1,16 1,17 1,25 1,44 1,59 1,103 5.4}
{0 CHEMBL232848,15 1,16 1,17 1,25 1,44 1,103 5.876}
{0 CHEMBL232849,15 1,16 1,17 1,25 1,44 1,59 1,103 6.247}
{0 CHEMBL233855,15 1,16 1,17 1,25 1,44 1,59 1,103 6.292}
{0 CHEMBL234273,15 1,16 1,17 1,25 1,44 1,59 1,103 5.401}
{0 CHEMBL234274,15 1,16 1,17 1,25 1,44 1,59 1,103 5.355}
{0 CHEMBL234490,15 1,16 1,17 1,25 1,44 1,103 6.237}
{0 CHEMBL234491,15 1,16 1,17 1,25 1,44 1,103 5.382}
{0 CHEMBL234510,15 1,16 1,17 1,20 1,23 1,25 1,27 1,44 1,67 1,91 1,103 5.889}
{0 CHEMBL234511,15 1,16 1,17 1,44 1,53 1,103 5.09}
{0 CHEMBL234698,15 1,16 1,17 1,24 1,25 1,28 1,44 1,100 1,103 5.854}
{0 CHEMBL234719,15 1,16 1,17 1,44 1,103 4.526}
{0 CHEMBL234914,15 1,16 1,17 1,25 1,44 1,103 6.229}
{0 CHEMBL234915,15 1,16 1,17 1,25 1,44 1,103 6.276}
{0 CHEMBL234916,15 1,16 1,17 1,44 1,91 1,103 5.863}
{0 CHEMBL234938,15 1,16 1,17 1,25 1,44 1,59 1,103 6.18}
{0 CHEMBL234943,15 1,16 1,17 1,25 1,44 1,103 5.9}
{0 CHEMBL243019,15 1,16 1,17 1,25 1,44 1,59 1,103 6.056}
{0 CHEMBL245171,15 1,16 1,17 1,25 1,44 1,59 1,103 6.222}
{0 CHEMBL245173,15 1,16 1,17 1,25 1,44 1,59 1,103 6.31}
{0 CHEMBL250699,12 1,15 1,16 1,17 1,25 1,28 1,31 1,44 1,100 1,103 5}
{0 CHEMBL268157,15 1,16 1,17 1,44 1,91 1,103 6.252}
{0 CHEMBL273705,15 1,17 1,20 1,24 1,25 1,26 1,27 1,28 1,29 1,34 1,44 1,45 1,103 6.081}
{0 CHEMBL273893,15 1,17 1,20 1,24 1,25 1,26 1,27 1,28 1,44 1,45 1,103 5.824}
{0 CHEMBL275612,15 1,17 1,20 1,23 1,24 1,25 1,26 1,27 1,28 1,29 1,34 1,44 1,94 1,103 6.523}
{0 CHEMBL275614,15 1,17 1,20 1,24 1,25 1,26 1,27 1,28 1,44 1,45 1,103 6}
{0 CHEMBL277085,15 1,17 1,20 1,24 1,25 1,26 1,27 1,28 1,29 1,34 1,44 1,45 1,103 6.495}
{0 CHEMBL277819,15 1,17 1,20 1,23 1,24 1,25 1,26 1,27 1,28 1,29 1,44 1,94 1,103 6.398}
{0 CHEMBL29188,15 1,24 1,25 1,28 1,44 1,45 1,63 1,100 1,103 5.614}
{0 CHEMBL292011,15 1,17 1,20 1,24 1,25 1,26 1,27 1,28 1,29 1,34 1,44 1,45 1,103 6.495}
{0 CHEMBL292090,15 1,17 1,20 1,24 1,25 1,26 1,28 1,44 1,100 1,103 5.268}
{0 CHEMBL293426,15 1,17 1,20 1,44 1,103 5.481}
{0 CHEMBL294369,15 1,17 1,20 1,24 1,25 1,28 1,44 1,100 1,103 5.42}
{0 CHEMBL297029,15 1,17 1,20 1,24 1,25 1,26 1,27 1,28 1,44 1,45 1,103 6.18}
{0 CHEMBL298909,15 1,17 1,20 1,23 1,24 1,25 1,26 1,27 1,28 1,29 1,44 1,45 1,103 5.387}
{0 CHEMBL299749,15 1,17 1,20 1,24 1,25 1,26 1,27 1,28 1,29 1,34 1,44 1,45 1,46 1,103 7.398}
{0 CHEMBL30008,44 1,45 1,78 1,103 5.777}
{0 CHEMBL300198,15 1,17 1,20 1,23 1,24 1,25 1,26 1,27 1,28 1,29 1,44 1,45 1,103 5.959}
{0 CHEMBL300261,15 1,17 1,20 1,24 1,25 1,26 1,27 1,28 1,44 1,45 1,46 1,103 7.046}
{0 CHEMBL300478,15 1,17 1,20 1,24 1,25 1,26 1,27 1,28 1,44 1,45 1,69 1,103 6.495}
{0 CHEMBL300626,15 1,17 1,20 1,24 1,25 1,26 1,27 1,28 1,44 1,45 1,46 1,49 1,103 6.301}
{0 CHEMBL300652,15 1,17 1,20 1,24 1,25 1,26 1,27 1,28 1,44 1,45 1,103 5.721}
{0 CHEMBL300706,15 1,17 1,20 1,24 1,25 1,26 1,27 1,28 1,44 1,45 1,49 1,103 5.921}
{0 CHEMBL300890,15 1,17 1,20 1,24 1,25 1,26 1,27 1,28 1,44 1,45 1,49 1,103 5.921}
{0 CHEMBL301152,15 1,17 1,20 1,23 1,24 1,25 1,26 1,27 1,28 1,29 1,44 1,45 1,103 6.056}
{0 CHEMBL302506,15 1,16 1,17 1,20 1,24 1,25 1,26 1,27 1,28 1,29 1,34 1,44 1,45 1,103 5.796}
{0 CHEMBL302628,15 1,17 1,20 1,44 1,103 5.469}
{0 CHEMBL303039,15 1,17 1,20 1,24 1,25 1,26 1,27 1,28 1,29 1,34 1,44 1,45 1,103 6.638}
{0 CHEMBL303609,15 1,17 1,20 1,24 1,25 1,26 1,27 1,28 1,29 1,34 1,44 1,45 1,103 6.444}
{0 CHEMBL304309,15 1,17 1,20 1,24 1,25 1,26 1,27 1,28 1,29 1,34 1,44 1,45 1,46 1,103 7.444}
{0 CHEMBL305133,15 1,17 1,20 1,24 1,25 1,27 1,28 1,29 1,44 1,100 1,103 5.398}
{0 CHEMBL305303,15 1,17 1,20 1,24 1,25 1,28 1,44 1,76 1,100 1,103 5.921}
{0 CHEMBL306399,15 1,17 1,20 1,25 1,26 1,27 1,34 1,41 1,42 1,43 1,44 1,76 1,95 1,103 6.301}
{0 CHEMBL307098,15 1,17 1,20 1,24 1,25 1,26 1,27 1,28 1,29 1,34 1,44 1,45 1,103 6}
{0 CHEMBL308984,15 1,17 1,20 1,23 1,25 1,26 1,27 1,29 1,34 1,41 1,42 1,43 1,44 1,56 1,74 1,86 1,95 1,103 6.42}
{0 CHEMBL309411,15 1,17 1,20 1,44 1,45 1,65 1,67 1,103 4.854}
{0 CHEMBL309614,44 1,45 1,67 1,103 6.367}
{0 CHEMBL310428,22 1,44 1,45 1,67 1,103 6.31}
{0 CHEMBL310432,44 1,45 1,50 1,103 5.959}
{0 CHEMBL310442,15 1,17 1,20 1,23 1,44 1,45 1,67 1,103 4.77}
{0 CHEMBL310763,15 1,17 1,20 1,23 1,27 1,44 1,45 1,67 1,103 5.745}
{0 CHEMBL311456,12 1,15 1,16 1,17 1,20 1,24 1,25 1,28 1,44 1,46 1,53 1,103 5.959}
{0 CHEMBL311867,15 1,17 1,20 1,24 1,25 1,28 1,44 1,103 6.469}
{0 CHEMBL312166,44 1,45 1,50 1,65 1,103 5.602}
{0 CHEMBL312235,15 1,17 1,20 1,24 1,25 1,28 1,44 1,103 6.174}
{0 CHEMBL312381,13 1,16 1,19 1,44 1,45 1,67 1,88 1,103 5.357}
{0 CHEMBL314816,12 1,15 1,17 1,20 1,22 1,23 1,24 1,25 1,28 1,44 1,53 1,103 5.745}
{0 CHEMBL315003,15 1,17 1,20 1,24 1,25 1,28 1,44 1,53 1,103 5.959}
{0 CHEMBL334438,15 1,17 1,20 1,24 1,25 1,26 1,27 1,28 1,29 1,34 1,44 1,103 6.229}
{0 CHEMBL336328,15 1,17 1,20 1,24 1,25 1,27 1,28 1,29 1,44 1,103 6.585}
{0 CHEMBL336605,15 1,17 1,20 1,24 1,25 1,28 1,44 1,103 6.292}
{0 CHEMBL337010,15 1,17 1,20 1,24 1,25 1,28 1,44 1,103 5.824}
{0 CHEMBL337744,15 1,17 1,20 1,22 1,24 1,25 1,28 1,44 1,103 5.337}
{0 CHEMBL352393,15 1,17 1,20 1,24 1,25 1,26 1,27 1,28 1,29 1,34 1,44 1,45 1,103 5.824}
{0 CHEMBL353259,15 1,17 1,20 1,24 1,25 1,26 1,27 1,28 1,29 1,34 1,44 1,45 1,103 5.553}
{0 CHEMBL353606,15 1,17 1,20 1,24 1,25 1,26 1,27 1,28 1,29 1,38 1,39 1,44 1,86 1,103 6.538}
{0 CHEMBL353717,15 1,17 1,20 1,24 1,25 1,28 1,44 1,76 1,100 1,103 6.143}
{0 CHEMBL354153,15 1,17 1,20 1,24 1,25 1,26 1,27 1,28 1,29 1,34 1,44 1,45 1,103 5.638}
{0 CHEMBL354624,15 1,17 1,20 1,24 1,25 1,26 1,27 1,28 1,29 1,34 1,44 1,78 1,103 5.638}
{0 CHEMBL355254,15 1,17 1,20 1,24 1,25 1,26 1,27 1,28 1,29 1,34 1,38 1,39 1,41 1,42 1,43 1,44 1,86 1,95 1,103 6.921}
{0 CHEMBL355833,15 1,17 1,20 1,24 1,25 1,26 1,27 1,28 1,29 1,34 1,38 1,39 1,41 1,42 1,43 1,44 1,86 1,95 1,103 6.921}
{0 CHEMBL366590,15 1,17 1,20 1,24 1,25 1,26 1,27 1,28 1,29 1,34 1,41 1,42 1,43 1,44 1,86 1,95 1,103 6.215}
{0 CHEMBL366890,15 1,17 1,20 1,24 1,25 1,26 1,27 1,28 1,44 1,76 1,96 1,100 1,103 6.056}
{0 CHEMBL369244,15 1,17 1,20 1,24 1,25 1,26 1,27 1,28 1,29 1,34 1,44 1,45 1,69 1,103 6.42}
{0 CHEMBL369934,15 1,17 1,44 1,66 1,78 1,103 6.102}
{0 CHEMBL370409,15 1,17 1,20 1,22 1,44 1,103 5.77}
{0 CHEMBL372748,15 1,17 1,44 1,66 1,103 5.409}
{0 CHEMBL380499,15 1,16 1,17 1,44 1,66 1,103 5}
{0 CHEMBL382072,15 1,17 1,44 1,66 1,78 1,103 6}
{0 CHEMBL382236,15 1,16 1,17 1,44 1,66 1,78 1,103 5.538}
{0 CHEMBL382450,11 1,15 1,17 1,44 1,66 1,78 1,103 4.678}
{0 CHEMBL382528,15 1,17 1,44 1,66 1,78 1,103 5.824}
{0 CHEMBL382629,15 1,16 1,17 1,44 1,66 1,78 1,103 4.959}
{0 CHEMBL389103,15 1,16 1,17 1,25 1,44 1,59 1,91 1,103 5.971}
{0 CHEMBL389993,15 1,16 1,17 1,25 1,44 1,103 6.301}
{0 CHEMBL390187,15 1,16 1,17 1,24 1,28 1,44 1,103 4.971}
{0 CHEMBL390703,15 1,16 1,17 1,44 1,103 5.775}
{0 CHEMBL390704,15 1,16 1,17 1,44 1,67 1,91 1,103 5.618}
{0 CHEMBL390705,15 1,16 1,17 1,20 1,23 1,25 1,27 1,44 1,103 5.873}
{0 CHEMBL394578,15 1,16 1,17 1,25 1,44 1,103 5.308}
{0 CHEMBL395109,15 1,16 1,17 1,25 1,44 1,59 1,103 5.889}
{0 CHEMBL395982,15 1,16 1,17 1,44 1,59 1,103 5.886}
{0 CHEMBL398157,15 1,16 1,17 1,25 1,44 1,103 5.708}
{0 CHEMBL398158,15 1,16 1,17 1,25 1,44 1,59 1,91 1,103 5.479}
{0 CHEMBL402674,15 1,17 1,20 1,24 1,25 1,26 1,27 1,28 1,29 1,44 1,45 1,69 1,103 6.509}
{0 CHEMBL408390,15 1,17 1,20 1,23 1,24 1,25 1,26 1,27 1,28 1,29 1,44 1,45 1,69 1,103 6}
{0 CHEMBL412849,15 1,16 1,17 1,44 1,59 1,103 5.879}
{0 CHEMBL419068,15 1,16 1,17 1,20 1,24 1,25 1,26 1,27 1,28 1,29 1,34 1,44 1,45 1,103 5.77}
{0 CHEMBL419253,15 1,17 1,20 1,24 1,25 1,26 1,27 1,28 1,29 1,34 1,44 1,45 1,103 5.77}
{0 CHEMBL419805,15 1,17 1,20 1,24 1,25 1,26 1,27 1,28 1,29 1,34 1,44 1,45 1,100 1,103 6.301}
{0 CHEMBL420771,15 1,23 1,24 1,25 1,28 1,44 1,45 1,50 1,100 1,103 5}
{0 CHEMBL420920,15 1,17 1,20 1,24 1,25 1,26 1,27 1,28 1,29 1,34 1,44 1,45 1,69 1,103 6.161}
{0 CHEMBL421719,44 1,45 1,67 1,103 6.013}
{0 CHEMBL422096,12 1,15 1,17 1,20 1,24 1,25 1,28 1,44 1,103 5.602}
{0 CHEMBL422741,15 1,17 1,20 1,24 1,25 1,26 1,27 1,28 1,29 1,34 1,44 1,45 1,103 6.699}
{0 CHEMBL423302,15 1,17 1,20 1,24 1,25 1,26 1,27 1,28 1,29 1,34 1,44 1,45 1,103 6.699}
{0 CHEMBL424169,15 1,17 1,20 1,24 1,25 1,26 1,27 1,28 1,44 1,76 1,100 1,103 5.886}
{0 CHEMBL430104,15 1,17 1,20 1,24 1,25 1,26 1,27 1,28 1,29 1,34 1,44 1,45 1,103 6.432}
{0 CHEMBL430996,15 1,17 1,20 1,24 1,25 1,26 1,27 1,28 1,29 1,34 1,44 1,45 1,103 6.886}
{0 CHEMBL431324,15 1,17 1,20 1,24 1,25 1,27 1,28 1,29 1,44 1,86 1,100 1,103 6.198}
{0 CHEMBL433125,15 1,17 1,20 1,24 1,25 1,26 1,27 1,28 1,34 1,41 1,42 1,43 1,44 1,76 1,95 1,103 6.409}
{0 CHEMBL439485,15 1,17 1,19 1,20 1,22 1,23 1,25 1,26 1,27 1,29 1,44 1,69 1,86 1,103 6.262}
{0 CHEMBL451812,15 1,17 1,20 1,44 1,66 1,78 1,103 5.523}
{0 CHEMBL452076,11 1,15 1,17 1,44 1,78 1,103 5.796}
{0 CHEMBL452325,15 1,17 1,20 1,23 1,25 1,27 1,29 1,44 1,78 1,94 1,103 5.824}
{0 CHEMBL455389,1 1,2 1,3 1,4 1,5 1,6 1,7 1,8 1,9 1,10 1,11 1,12 1,13 1,14 1,16 1,18 1,19 1,21 1,22 1,23 1,30 1,33 1,36 1,37 1,44 1,103 4}
{0 CHEMBL45816,15 1,16 1,17 1,19 1,25 1,44 1,45 1,66 1,67 1,74 1,95 1,103 5.873}
{0 CHEMBL461557,1 1,2 1,3 1,4 1,5 1,6 1,7 1,8 1,9 1,10 1,11 1,12 1,13 1,14 1,16 1,18 1,19 1,21 1,22 1,23 1,30 1,33 1,36 1,37 1,44 1,103 4}
{0 CHEMBL482193,1 1,2 1,3 1,4 1,5 1,10 1,12 1,16 1,19 1,22 1,23 1,31 1,33 1,44 1,61 1,63 1,103 4}
{0 CHEMBL50210,15 1,17 1,20 1,24 1,25 1,26 1,27 1,28 1,29 1,34 1,44 1,45 1,69 1,103 6.301}
{0 CHEMBL52199,15 1,17 1,20 1,24 1,25 1,26 1,27 1,28 1,29 1,44 1,45 1,103 5.886}
{0 CHEMBL52200,15 1,17 1,20 1,24 1,25 1,26 1,27 1,28 1,44 1,45 1,49 1,103 6.119}
{0 CHEMBL52611,15 1,17 1,20 1,24 1,25 1,26 1,27 1,28 1,29 1,34 1,44 1,45 1,103 5.553}
{0 CHEMBL52649,15 1,17 1,20 1,24 1,25 1,26 1,27 1,28 1,29 1,44 1,45 1,46 1,103 6.569}
{0 CHEMBL52679,15 1,17 1,20 1,24 1,25 1,26 1,27 1,28 1,44 1,45 1,49 1,103 6.229}
{0 CHEMBL52699,15 1,17 1,20 1,23 1,24 1,25 1,26 1,27 1,28 1,29 1,44 1,45 1,46 1,103 6.509}
{0 CHEMBL52732,15 1,17 1,20 1,24 1,25 1,26 1,27 1,28 1,29 1,44 1,45 1,103 6.056}
{0 CHEMBL53077,15 1,17 1,20 1,24 1,25 1,26 1,27 1,28 1,44 1,45 1,46 1,49 1,103 6.357}
{0 CHEMBL53111,15 1,17 1,20 1,24 1,25 1,26 1,27 1,28 1,44 1,45 1,49 1,69 1,103 6.377}
{0 CHEMBL53176,15 1,17 1,20 1,24 1,25 1,26 1,27 1,28 1,44 1,45 1,103 6.42}
{0 CHEMBL534704,15 1,17 1,22 1,44 1,66 1,103 5.804}
{0 CHEMBL53604,15 1,17 1,20 1,24 1,25 1,26 1,27 1,28 1,44 1,45 1,49 1,103 5.252}
{0 CHEMBL536956,10 1,15 1,20 1,23 1,24 1,25 1,28 1,44 1,45 1,94 1,100 1,103 5.465}
{0 CHEMBL54019,15 1,17 1,20 1,24 1,25 1,26 1,27 1,28 1,44 1,45 1,49 1,103 4.886}
{0 CHEMBL54081,15 1,17 1,20 1,24 1,25 1,26 1,27 1,28 1,29 1,44 1,45 1,103 5.585}
{0 CHEMBL554925,15 1,17 1,20 1,24 1,25 1,26 1,27 1,28 1,29 1,38 1,39 1,44 1,45 1,86 1,103 6.699}
{0 CHEMBL558362,15 1,17 1,20 1,25 1,26 1,27 1,29 1,44 1,66 1,78 1,103 5.523}
{0 CHEMBL62518,15 1,17 1,20 1,24 1,25 1,28 1,44 1,100 1,103 5.469}
{0 CHEMBL62825,15 1,17 1,20 1,24 1,25 1,28 1,44 1,100 1,103 4.824}
{0 CHEMBL65110,15 1,17 1,20 1,24 1,25 1,27 1,28 1,29 1,44 1,86 1,100 1,103 6.215}
{0 CHEMBL65117,15 1,17 1,20 1,24 1,25 1,28 1,44 1,100 1,103 5.585}
{0 CHEMBL65145,15 1,17 1,20 1,24 1,25 1,28 1,44 1,100 1,103 4.585}
{0 CHEMBL65360,15 1,17 1,20 1,24 1,25 1,27 1,28 1,29 1,44 1,86 1,100 1,103 6.022}
{0 CHEMBL65402,15 1,17 1,20 1,24 1,25 1,28 1,44 1,76 1,100 1,103 5.796}
{0 CHEMBL65467,15 1,17 1,20 1,24 1,25 1,28 1,44 1,76 1,100 1,103 5.745}
{0 CHEMBL66001,15 1,17 1,20 1,24 1,25 1,26 1,27 1,28 1,29 1,34 1,44 1,45 1,103 5.721}
{0 CHEMBL66138,15 1,17 1,20 1,24 1,25 1,28 1,44 1,100 1,103 5.638}
{0 CHEMBL67766,15 1,17 1,20 1,24 1,25 1,26 1,27 1,28 1,29 1,34 1,44 1,45 1,103 6.252}
{0 CHEMBL68088,15 1,17 1,20 1,24 1,25 1,26 1,27 1,28 1,29 1,34 1,44 1,45 1,103 6.553}
{0 CHEMBL69748,15 1,17 1,20 1,24 1,25 1,26 1,27 1,28 1,29 1,34 1,44 1,45 1,103 6}
{0 CHEMBL72446,15 1,17 1,20 1,25 1,26 1,27 1,34 1,41 1,42 1,43 1,44 1,45 1,49 1,76 1,95 1,103 6.432}
{0 CHEMBL73525,15 1,17 1,20 1,25 1,26 1,27 1,29 1,34 1,41 1,42 1,43 1,44 1,45 1,86 1,95 1,103 6.481}
{0 CHEMBL74345,15 1,17 1,20 1,24 1,25 1,26 1,27 1,28 1,29 1,34 1,38 1,39 1,41 1,42 1,43 1,44 1,86 1,95 1,103 6.854}
{0 CHEMBL75902,12 1,15 1,17 1,20 1,25 1,26 1,27 1,34 1,41 1,42 1,43 1,44 1,76 1,95 1,103 6.18}
{0 CHEMBL76163,15 1,17 1,20 1,24 1,25 1,26 1,27 1,28 1,29 1,34 1,41 1,42 1,43 1,44 1,86 1,95 1,103 6.824}
{0 CHEMBL78017,44 1,45 1,50 1,103 6.337}
{0 CHEMBL78546,22 1,44 1,45 1,67 1,103 5.745}
{0 CHEMBL78968,16 1,44 1,45 1,103 4.456}
{0 CHEMBL79068,23 1,44 1,45 1,50 1,103 4.824}
{0 CHEMBL79649,12 1,15 1,17 1,20 1,23 1,24 1,25 1,28 1,44 1,53 1,88 1,103 6.745}
{0 CHEMBL79868,15 1,17 1,20 1,24 1,25 1,28 1,44 1,103 6}
{0 CHEMBL80274,44 1,45 1,50 1,103 4}
{0 CHEMBL80681,44 1,45 1,50 1,103 5.131}
{0 CHEMBL80735,23 1,44 1,45 1,50 1,103 5.292}
{0 CHEMBL80856,44 1,45 1,50 1,103 5.319}
{0 CHEMBL80994,15 1,17 1,20 1,24 1,25 1,28 1,44 1,53 1,103 6.721}
{0 CHEMBL81155,15 1,16 1,30 1,44 1,103 4.456}
{0 CHEMBL81511,12 1,15 1,17 1,20 1,24 1,25 1,28 1,33 1,44 1,53 1,103 6.31}
{0 CHEMBL81629,15 1,17 1,20 1,24 1,25 1,28 1,44 1,53 1,69 1,103 5.658}
{0 CHEMBL81663,44 1,45 1,50 1,103 5.886}
{0 CHEMBL81861,12 1,15 1,17 1,20 1,23 1,24 1,25 1,28 1,44 1,53 1,103 6.538}
{0 CHEMBL81973,12 1,15 1,17 1,20 1,24 1,25 1,28 1,33 1,44 1,53 1,103 6.161}
{0 CHEMBL82536,12 1,15 1,17 1,20 1,24 1,25 1,28 1,33 1,44 1,53 1,103 6.398}
{0 CHEMBL84404,44 1,45 1,67 1,103 6.131}
