"molecule_id","AMW","C.","H.","Me","Mi","Mp","Mv","MW","N.","nAB","nAT","nB","nBM","nBO","nBR","nBT","nC","nCL","nCsp","nCsp2","nCsp3","nDB","nF","nH","nHet","nHM","nI","nN","nO","nP","nS","nSK","nTB","nX","O.","RBF","RBN","SCBO","Se","Si","Sp","Sv","X.","pXC50"
{1 7.567,2 42.3,3 44.2,4 1.009,5 1.125,6 0.662,7 0.638,8 393.48,9 5.8,10 12,11 52,13 16,14 32,16 55,17 22,20 14,21 8,22 4,24 23,25 7,28 3,29 4,32 29,35 7.7,36 0.109,37 6,38 42,39 52.451,40 58.485,41 34.449,42 33.191,44 7.903}
{0 CHEMBL106891,1 6.97,2 44,3 48,4 0.992,5 1.12,6 0.666,7 0.625,8 348.48,9 4,10 12,11 50,13 14,14 29,16 53,17 22,20 14,21 8,22 2,24 24,25 4,28 2,29 2,32 26,35 4,36 0.094,37 5,38 37,39 49.578,40 55.983,41 33.296,42 31.267,44 7.523}
{0 CHEMBL1076547,1 6.822,2 45,3 48.8,4 0.986,5 1.117,6 0.67,7 0.625,8 545.78,9 3.8,10 24,11 80,13 25,14 46,16 85,17 36,20 25,21 11,22 1,24 39,25 5,28 3,29 2,32 41,35 2.5,36 0.094,37 8,38 59,39 78.865,40 89.387,41 53.631,42 49.976,44 4}
{0 CHEMBL1076548,1 6.822,2 45,3 48.8,4 0.986,5 1.117,6 0.67,7 0.625,8 545.78,9 3.8,10 24,11 80,13 25,14 46,16 85,17 36,20 25,21 11,22 1,24 39,25 5,28 3,29 2,32 41,35 2.5,36 0.094,37 8,38 59,39 78.865,40 89.387,41 53.631,42 49.976,44 4}
{0 CHEMBL1079797,1 7.574,2 44.3,3 45.9,4 0.996,5 1.119,6 0.683,7 0.642,8 462.03,9 4.9,10 18,11 61,13 19,14 37,16 65,17 27,18 1,20 19,21 8,22 1,24 28,25 6,26 1,28 3,29 2,32 33,34 1,35 3.3,36 0.092,37 6,38 47,39 60.771,40 68.255,41 41.682,42 39.17,43 1.6,44 4}
{0 CHEMBL1080386,1 6.71,2 42.9,3 50,4 0.987,5 1.122,6 0.659,7 0.613,8 469.68,9 4.3,10 18,11 70,13 19,14 39,16 74,17 30,20 19,21 11,22 1,24 35,25 5,28 3,29 2,32 35,35 2.9,36 0.095,37 7,38 49,39 69.098,40 78.557,41 46.108,42 42.923,44 4}
{0 CHEMBL1080387,1 6.626,2 42.5,3 50.7,4 0.986,5 1.123,6 0.656,7 0.609,8 483.71,9 4.1,10 18,11 73,13 19,14 40,16 77,17 31,20 19,21 12,22 1,24 37,25 5,28 3,29 2,32 36,35 2.7,36 0.091,37 7,38 50,39 71.981,40 81.972,41 47.87,42 44.449,44 4.824}
{0 CHEMBL1080541,1 7.202,2 42.9,3 48.6,4 0.992,5 1.121,6 0.671,7 0.625,8 504.12,9 4.3,10 18,11 70,13 19,14 40,16 74,17 30,18 1,20 19,21 11,22 1,24 34,25 6,26 1,28 3,29 2,32 36,34 1,35 2.9,36 0.095,37 7,38 50,39 69.421,40 78.501,41 46.966,42 43.75,43 1.4,44 4}
{0 CHEMBL1080542,1 6.478,2 41.8,3 51.9,4 0.984,5 1.124,6 0.651,7 0.601,8 511.77,9 3.8,10 18,11 79,13 19,14 42,16 83,17 33,20 19,21 14,22 1,24 41,25 5,28 3,29 2,32 38,35 2.5,36 0.096,37 8,38 52,39 77.748,40 88.803,41 51.393,42 47.503,44 4}
{0 CHEMBL1080546,1 6.314,2 39.1,3 53.6,4 0.985,5 1.13,6 0.636,7 0.586,8 435.67,9 4.3,10 12,11 69,13 13,14 35,16 72,17 27,20 13,21 14,22 1,24 37,25 5,28 3,29 2,32 32,35 2.9,36 0.139,37 10,38 42,39 67.981,40 77.972,41 43.87,42 40.449,44 6.013}
{0 CHEMBL1080547,1 7.01,2 44.3,3 47.5,4 0.991,5 1.12,6 0.669,7 0.629,8 427.59,9 4.9,10 18,11 61,13 19,14 36,16 65,17 27,20 19,21 8,22 1,24 29,25 5,28 3,29 2,32 32,35 3.3,36 0.092,37 6,38 46,39 60.447,40 68.311,41 40.824,42 38.342,44 5.796}
{0 CHEMBL1080562,1 7.694,2 42.9,3 47.1,4 0.996,5 1.121,6 0.683,7 0.637,8 538.56,9 4.3,10 18,11 70,13 19,14 41,16 74,17 30,18 2,20 19,21 11,22 1,24 33,25 7,26 2,28 3,29 2,32 37,34 2,35 2.9,36 0.095,37 7,38 51,39 69.745,40 78.445,41 47.824,42 44.578,43 2.9,44 4}
{0 CHEMBL1080720,1 6.549,2 42.1,3 51.3,4 0.985,5 1.124,6 0.653,7 0.605,8 497.74,9 3.9,10 18,11 76,13 19,14 41,16 80,17 32,20 19,21 13,22 1,24 39,25 5,28 3,29 2,32 37,35 2.6,36 0.088,37 7,38 51,39 74.865,40 85.387,41 49.631,42 45.976,44 4}
{0 CHEMBL1080730,1 6.626,2 42.5,3 50.7,4 0.986,5 1.123,6 0.656,7 0.609,8 483.71,9 4.1,10 18,11 73,13 19,14 40,16 77,17 31,20 19,21 12,22 1,24 37,25 5,28 3,29 2,32 36,35 2.7,36 0.091,37 7,38 50,39 71.981,40 81.972,41 47.87,42 44.449,44 4}
{0 CHEMBL1080737,1 6.821,2 42,3 49.3,4 0.99,5 1.125,6 0.657,7 0.615,8 470.67,9 5.8,10 18,11 69,13 19,14 39,16 73,17 29,20 18,21 11,22 1,24 34,25 6,28 4,29 2,32 35,35 2.9,36 0.096,37 7,38 49,39 68.316,40 77.64,41 45.353,42 42.417,44 5.377}
{0 CHEMBL1080753,1 6.821,2 42,3 49.3,4 0.99,5 1.125,6 0.657,7 0.615,8 470.67,9 5.8,10 18,11 69,13 19,14 39,16 73,17 29,20 19,21 10,22 1,24 34,25 6,28 4,29 2,32 35,35 2.9,36 0.096,37 7,38 49,39 68.316,40 77.64,41 45.353,42 42.417,44 4}
{0 CHEMBL1081031,1 6.472,2 40.3,3 52.2,4 0.987,5 1.128,6 0.643,7 0.596,8 433.65,9 4.5,10 12,11 67,13 13,14 36,16 71,17 27,20 13,21 14,22 1,24 35,25 5,28 3,29 2,32 32,35 3,36 0.085,37 6,38 43,39 66.098,40 75.557,41 43.108,42 39.923,44 5.252}
{0 CHEMBL1081032,1 6.395,2 40,3 52.9,4 0.985,5 1.128,6 0.641,7 0.592,8 447.68,9 4.3,10 12,11 70,13 13,14 37,16 74,17 28,20 13,21 15,22 1,24 37,25 5,28 3,29 2,32 33,35 2.9,36 0.095,37 7,38 44,39 68.981,40 78.972,41 44.87,42 41.449,44 5.602}
{0 CHEMBL1081085,1 6.626,2 42.5,3 50.7,4 0.986,5 1.123,6 0.656,7 0.609,8 483.71,9 4.1,10 18,11 73,13 19,14 40,16 77,17 31,20 19,21 12,22 1,24 37,25 5,28 3,29 2,32 36,35 2.7,36 0.117,37 9,38 50,39 71.981,40 81.972,41 47.87,42 44.449,44 4.319}
{0 CHEMBL1081275,1 6.356,2 38.7,3 53.3,4 0.986,5 1.132,6 0.635,7 0.587,8 476.73,9 5.3,10 12,11 75,13 13,14 39,16 79,17 29,20 13,21 16,22 1,24 40,25 6,28 4,29 2,32 35,35 2.7,36 0.089,37 7,38 46,39 73.967,40 84.886,41 47.637,42 43.998,44 5.456}
{0 CHEMBL1081427,1 6.821,2 42,3 49.3,4 0.99,5 1.125,6 0.657,7 0.615,8 470.67,9 5.8,10 18,11 69,13 19,14 39,16 73,17 29,20 18,21 11,22 1,24 34,25 6,28 4,29 2,32 35,35 2.9,36 0.096,37 7,38 49,39 68.316,40 77.64,41 45.353,42 42.417,44 4}
{0 CHEMBL1081428,1 6.821,2 42,3 49.3,4 0.99,5 1.125,6 0.657,7 0.615,8 470.67,9 5.8,10 18,11 69,13 19,14 39,16 73,17 29,20 18,21 11,22 1,24 34,25 6,28 4,29 2,32 35,35 2.9,36 0.096,37 7,38 49,39 68.316,40 77.64,41 45.353,42 42.417,44 4.638}
{0 CHEMBL1081433,1 7.094,2 46.5,3 46.5,4 0.989,5 1.115,6 0.681,7 0.639,8 503.69,9 4.2,10 24,11 71,13 25,14 43,16 76,17 33,20 25,21 8,22 1,24 33,25 5,28 3,29 2,32 38,35 2.8,36 0.092,37 7,38 56,39 70.214,40 79.142,41 48.347,42 45.396,44 4}
{0 CHEMBL1081455,1 7.129,2 46.3,3 46.3,4 0.99,5 1.115,6 0.68,7 0.64,8 477.65,9 4.5,10 23,11 67,13 24,14 41,16 72,17 31,20 23,21 8,22 1,24 31,25 5,28 3,29 2,32 36,35 3,36 0.083,37 6,38 53.5,39 66.33,40 74.727,41 45.586,42 42.869,44 4.357}
{0 CHEMBL1081456,1 7.04,2 43.1,3 47.7,4 0.995,5 1.122,6 0.662,7 0.624,8 457.62,9 4.6,10 18,11 65,13 19,14 38,16 69,17 28,20 19,21 9,22 1,24 31,25 6,28 3,29 3,32 34,35 4.6,36 0.101,37 7,38 48,39 64.658,40 72.936,41 43.04,42 40.584,44 4.481}
{0 CHEMBL1081457,1 6.597,2 41.3,3 51.3,4 0.988,5 1.125,6 0.648,7 0.603,8 527.77,9 3.8,10 18,11 80,13 19,14 43,16 84,17 33,20 19,21 14,22 1,24 41,25 6,28 3,29 3,32 39,35 3.8,36 0.143,37 12,38 53,39 79.076,40 90.012,41 51.847,42 48.218,44 4}
{0 CHEMBL1081652,1 7.116,2 43.9,3 47,4 0.995,5 1.12,6 0.667,7 0.63,8 469.63,9 4.5,10 18,11 66,13 20,14 39,16 70,17 29,20 20,21 9,22 2,24 31,25 6,28 3,29 3,32 35,35 4.5,36 0.1,37 7,38 50,39 65.658,40 73.936,41 44.04,42 41.584,44 4}
{0 CHEMBL1081653,1 7.501,2 42.9,3 44.4,4 1.005,5 1.124,6 0.666,7 0.639,8 472.59,9 6.3,10 18,11 63,13 21,14 39,16 67,17 27,20 19,21 8,22 3,24 28,25 8,28 4,29 4,32 35,35 6.3,36 0.104,37 7,38 51,39 63.32,40 70.813,41 41.978,42 40.266,44 4}
{0 CHEMBL1081834,1 6.9,2 43.8,3 48.4,4 0.99,5 1.121,6 0.665,7 0.623,8 441.62,9 4.7,10 18,11 64,13 19,14 37,16 68,17 28,20 19,21 9,22 1,24 31,25 5,28 3,29 2,32 33,35 3.1,36 0.103,37 7,38 47,39 63.33,40 71.727,41 42.586,42 39.869,44 6.745}
{0 CHEMBL1081835,1 6.801,2 43.3,3 49.3,4 0.988,5 1.122,6 0.662,7 0.618,8 455.65,9 4.5,10 18,11 67,13 19,14 38,16 71,17 29,20 19,21 10,22 1,24 33,25 5,28 3,29 2,32 34,35 3,36 0.113,37 8,38 48,39 66.214,40 75.142,41 44.347,42 41.396,44 6.347}
{0 CHEMBL1081968,1 7.218,2 45.8,3 45.8,4 0.994,5 1.116,6 0.678,7 0.64,8 519.69,9 4.2,10 24,11 72,13 25,14 44,16 77,17 33,20 25,21 8,22 1,24 33,25 6,28 3,29 3,32 39,35 4.2,36 0.104,37 8,38 57,39 71.541,40 80.351,41 48.802,42 46.111,44 4}
{0 CHEMBL1081969,1 7.067,2 42,3 47.8,4 0.998,5 1.124,6 0.656,7 0.621,8 487.65,9 4.3,10 18,11 69,13 19,14 40,16 73,17 29,20 19,21 10,22 1,24 33,25 7,28 3,29 4,32 36,35 5.8,36 0.11,37 8,38 50,39 68.869,40 77.561,41 45.256,42 42.825,44 4.959}
{0 CHEMBL1081970,1 7.369,2 43.8,3 45.3,4 1.002,5 1.121,6 0.668,7 0.637,8 471.6,9 4.7,10 18,11 64,13 19,14 40,16 69,17 28,20 19,21 9,22 1,24 29,25 7,28 3,29 4,32 35,35 6.3,36 0.087,37 6,38 50,39 64.101,40 71.73,41 42.733,42 40.772,44 5.721}
{0 CHEMBL1086635,1 6.549,2 42.1,3 51.3,4 0.985,5 1.124,6 0.653,7 0.605,8 497.74,9 3.9,10 18,11 76,13 19,14 41,16 80,17 32,20 19,21 13,22 1,24 39,25 5,28 3,29 2,32 37,35 2.6,36 0.113,37 9,38 51,39 74.865,40 85.387,41 49.631,42 45.976,44 4}
{0 CHEMBL1086636,1 6.626,2 42.5,3 50.7,4 0.986,5 1.123,6 0.656,7 0.609,8 483.71,9 4.1,10 18,11 73,13 19,14 40,16 77,17 31,20 19,21 12,22 1,24 37,25 5,28 3,29 2,32 36,35 2.7,36 0.091,37 7,38 50,39 71.981,40 81.972,41 47.87,42 44.449,44 4}
{0 CHEMBL1087152,1 6.626,2 42.5,3 50.7,4 0.986,5 1.123,6 0.656,7 0.609,8 483.71,9 4.1,10 18,11 73,13 19,14 40,16 77,17 31,20 19,21 12,22 1,24 37,25 5,28 3,29 2,32 36,35 2.7,36 0.104,37 8,38 50,39 71.981,40 81.972,41 47.87,42 44.449,44 4}
{0 CHEMBL1087623,1 6.967,2 42.9,3 48.6,4 0.994,5 1.127,6 0.658,7 0.619,8 487.67,9 4.3,10 18,11 70,13 19,14 40,16 74,17 30,20 19,21 11,22 1,23 1,24 34,25 6,28 3,29 2,32 36,34 1,35 2.9,36 0.095,37 7,38 50,39 69.61,40 78.897,41 46.046,42 43.306,43 1.4,44 4}
{0 CHEMBL1087663,1 6.801,2 43.3,3 49.3,4 0.988,5 1.122,6 0.662,7 0.618,8 455.65,9 4.5,10 18,11 67,13 19,14 38,16 71,17 29,20 19,21 10,22 1,24 33,25 5,28 3,29 2,32 34,35 3,36 0.085,37 6,38 48,39 66.214,40 75.142,41 44.347,42 41.396,44 4}
{0 CHEMBL1127,1 7.143,2 43.3,3 46.7,4 0.994,5 1.123,6 0.668,7 0.631,8 214.29,9 6.7,10 11,11 30,13 11,14 18,16 32,17 13,20 9,21 4,24 14,25 3,28 2,29 1,32 16,35 3.3,38 23.5,39 29.833,40 33.697,41 20.034,42 18.918,44 5.917}
{0 CHEMBL117651,1 6.968,2 44.2,3 47.4,4 0.986,5 1.123,6 0.675,7 0.631,8 661.95,9 8.4,10 38,11 95,13 38,14 57,16 102,17 42,20 30,21 12,24 45,25 8,28 8,32 50,36 0.118,37 12,38 76,39 93.661,40 106.668,41 64.131,42 59.917,44 9.387}
{0 CHEMBL1190,1 4.617,2 28.6,3 67.9,4 0.966,5 1.151,6 0.566,7 0.492,8 258.56,9 3.6,11 56,14 17,16 55,17 16,21 16,24 38,25 2,28 2,32 18,36 0.2,37 11,38 17,39 54.108,40 64.47,41 31.717,42 27.525,44 5.456}
{0 CHEMBL1222256,1 6.111,2 28.2,3 61.5,4 0.99,5 1.151,6 0.601,7 0.528,8 238.32,11 39,13 1,14 14,16 38,17 11,21 11,22 1,23 1,24 24,25 4,26 1,29 2,30 1,32 15,34 1,35 5.1,36 0.237,37 9,38 15,39 38.629,40 44.88,41 23.427,42 20.585,43 2.6,44 6.921}
{0 CHEMBL123909,1 8.229,2 42.3,3 42.3,4 1.015,5 1.124,6 0.679,7 0.654,8 427.92,9 5.8,10 12,11 52,13 16,14 33,16 55,17 22,18 1,20 14,21 8,22 4,24 22,25 8,26 1,28 3,29 4,32 30,34 1,35 7.7,36 0.109,37 6,38 43,39 52.774,40 58.429,41 35.307,42 34.019,43 1.9,44 6.62}
{0 CHEMBL125571,1 6.937,2 40,3 49.1,4 0.998,5 1.129,6 0.646,7 0.61,8 381.52,9 5.5,10 12,11 55,13 15,14 30,16 57,17 22,20 13,21 9,22 3,24 27,25 6,28 3,29 3,32 28,35 5.5,36 0.123,37 7,38 39,39 54.891,40 62.106,41 35.517,42 33.53,44 5.482}
{0 CHEMBL125578,1 5.966,2 37,3 56.5,4 0.981,5 1.135,6 0.622,7 0.567,8 274.45,9 4.3,10 6,11 46,13 7,14 21,16 47,17 17,20 7,21 10,22 1,24 26,25 3,28 2,29 1,32 20,35 2.2,36 0.106,37 5,38 25,39 45.134,40 52.188,41 28.603,42 26.079,44 6.181}
{0 CHEMBL126304,1 6.26,2 41.1,3 53.6,4 0.98,5 1.125,6 0.645,7 0.592,8 350.55,9 3.6,10 12,11 56,13 13,14 28,16 58,17 23,20 13,21 10,22 1,24 30,25 3,28 2,29 1,32 26,35 1.8,36 0.103,37 6,38 35,39 54.901,40 63.019,41 36.126,42 33.133,44 6.114}
{0 CHEMBL126354,1 7.155,2 43.5,3 46.8,4 0.996,5 1.121,6 0.666,7 0.63,8 443.59,9 4.8,10 18,11 62,13 21,14 36,16 65,17 27,20 19,21 8,22 3,24 29,25 6,28 3,29 3,32 33,35 4.8,36 0.123,37 8,38 48,39 61.774,40 69.521,41 41.279,42 39.057,44 8.268}
{0 CHEMBL126457,1 6.01,2 38,3 56,4 0.98,5 1.132,6 0.627,7 0.572,8 300.49,9 4,10 6,11 50,13 7,14 24,16 52,17 19,20 7,21 12,22 1,24 28,25 3,28 2,29 1,32 22,35 2,36 0.115,37 6,38 28,39 49.018,40 56.604,41 31.364,42 28.606,44 4.42}
{0 CHEMBL126827,1 6.937,2 40,3 49.1,4 0.998,5 1.129,6 0.646,7 0.61,8 381.52,9 5.5,10 12,11 55,13 15,14 30,16 57,17 22,20 13,21 9,22 3,24 27,25 6,28 3,29 3,32 28,35 5.5,36 0.123,37 7,38 39,39 54.891,40 62.106,41 35.517,42 33.53,44 6.432}
{0 CHEMBL126852,1 6.74,2 42.3,3 50,4 0.99,5 1.123,6 0.655,7 0.611,8 350.5,9 3.8,10 12,11 52,13 14,14 28,16 54,17 22,20 14,21 8,22 2,24 26,25 4,28 2,29 2,32 26,35 3.8,36 0.093,37 5,38 36,39 51.461,40 58.398,41 34.057,42 31.794,44 4.284}
{0 CHEMBL127097,1 6.26,2 41.1,3 53.6,4 0.98,5 1.125,6 0.645,7 0.592,8 350.55,9 3.6,10 12,11 56,13 13,14 28,16 58,17 23,20 13,21 10,22 1,24 30,25 3,28 2,29 1,32 26,35 1.8,36 0.103,37 6,38 35,39 54.901,40 63.019,41 36.126,42 33.133,44 4.387}
{0 CHEMBL127398,1 6.454,2 42.6,3 51.9,4 0.982,5 1.122,6 0.655,7 0.604,8 348.53,9 3.7,10 12,11 54,13 14,14 28,16 56,17 23,20 15,21 8,22 2,24 28,25 3,28 2,29 1,32 26,35 1.9,36 0.125,37 7,38 36,39 53.018,40 60.604,41 35.364,42 32.606,44 4.268}
{0 CHEMBL127513,1 6.52,2 44.9,3 51,4 0.98,5 1.116,6 0.665,7 0.613,8 319.48,9 2,10 12,11 49,13 13,14 27,16 52,17 22,20 13,21 9,22 1,24 25,25 2,28 1,29 1,32 24,35 2,36 0.077,37 4,38 34,39 48.032,40 54.69,41 32.597,42 30.058,44 6.824}
{0 CHEMBL127527,1 6.431,2 40.4,3 52.6,4 0.986,5 1.127,6 0.642,7 0.594,8 366.55,9 3.5,10 12,11 57,13 13,14 29,16 59,17 23,20 13,21 10,22 1,24 30,25 4,28 2,29 2,32 27,35 3.5,36 0.119,37 7,38 36,39 56.229,40 64.228,41 36.58,42 33.848,44 7.337}
{0 CHEMBL127750,1 6.26,2 41.1,3 53.6,4 0.98,5 1.125,6 0.645,7 0.592,8 350.55,9 3.6,10 12,11 56,13 13,14 28,16 58,17 23,20 13,21 10,22 1,24 30,25 3,28 2,29 1,32 26,35 1.8,36 0.103,37 6,38 35,39 54.901,40 63.019,41 36.126,42 33.133,44 6.839}
{0 CHEMBL127917,1 6.28,2 37.8,3 54.1,4 0.986,5 1.134,6 0.63,7 0.581,8 232.36,9 5.4,10 6,11 37,13 7,14 18,16 38,17 14,20 7,21 7,22 1,24 20,25 3,28 2,29 1,32 17,35 2.7,36 0.105,37 4,38 22,39 36.483,40 41.943,41 23.319,42 21.499,44 4.585}
{0 CHEMBL129837,1 6.659,2 40.4,3 50.9,4 0.99,5 1.128,6 0.646,7 0.602,8 379.55,9 5.3,10 12,11 57,13 13,14 31,16 60,17 23,20 13,21 10,22 1,24 29,25 5,28 3,29 2,32 28,35 3.5,36 0.067,37 4,38 38,39 56.447,40 64.311,41 36.824,42 34.342,44 5.076}
{0 CHEMBL136916,1 5.152,2 28.6,3 64.3,4 0.98,5 1.151,6 0.569,7 0.508,8 144.27,9 3.6,11 28,13 1,14 9,16 27,17 8,20 1,21 7,22 1,24 18,25 2,28 1,29 1,32 10,35 3.6,36 0.148,37 4,38 10,39 27.44,40 32.237,41 15.932,42 14.214,44 4.638}
{0 CHEMBL138107,1 7.306,2 45.3,3 45.3,4 0.996,5 1.118,6 0.676,7 0.642,8 467.61,9 4.7,10 18,11 64,13 21,14 39,16 68,17 29,20 21,21 8,22 3,24 29,25 6,28 3,29 3,32 35,35 4.7,36 0.103,37 7,38 51,39 63.774,40 71.521,41 43.279,42 41.057,44 8.921}
{0 CHEMBL138442,1 6.99,2 42.3,3 48.1,4 0.994,5 1.125,6 0.66,7 0.621,8 363.5,9 5.8,10 12,11 52,13 14,14 30,16 55,17 22,20 14,21 8,22 2,24 25,25 5,28 3,29 2,32 27,35 3.8,36 0.091,37 5,38 38,39 51.68,40 58.481,41 34.302,42 32.289,44 7.959}
{0 CHEMBL138552,1 7.653,2 42.3,3 46.2,4 1,5 1.124,6 0.676,7 0.637,8 397.94,9 5.8,10 12,11 52,13 14,14 31,16 55,17 22,18 1,20 14,21 8,22 2,24 24,25 6,26 1,28 3,29 2,32 28,34 1,35 3.8,36 0.091,37 5,38 39,39 52.003,40 58.425,41 35.159,42 33.116,43 1.9,44 8.347}
{0 CHEMBL139353,1 6.99,2 42.3,3 48.1,4 0.994,5 1.125,6 0.66,7 0.621,8 363.5,9 5.8,10 12,11 52,13 14,14 30,16 55,17 22,20 14,21 8,22 2,24 25,25 5,28 3,29 2,32 27,35 3.8,36 0.091,37 5,38 38,39 51.68,40 58.481,41 34.302,42 32.289,44 8.056}
{0 CHEMBL14,1 5.889,2 24,3 60,4 1.004,5 1.165,6 0.555,7 0.516,8 147.23,9 8,11 25,13 1,14 9,16 24,17 6,20 1,21 5,22 1,24 15,25 4,28 2,29 2,32 10,35 8,36 0.167,37 4,38 10,39 25.102,40 29.114,41 13.869,42 12.897,44 4.18}
{0 CHEMBL140106,1 7.132,2 42.9,3 46.9,4 0.996,5 1.124,6 0.664,7 0.628,8 349.47,9 6.1,10 12,11 49,13 14,14 29,16 52,17 21,20 13,21 8,22 2,24 23,25 5,28 3,29 2,32 26,35 4.1,36 0.096,37 5,38 37,39 48.796,40 55.066,41 32.54,42 30.762,44 7.886}
{0 CHEMBL140228,1 7.189,2 44.8,3 46.3,4 0.995,5 1.118,6 0.672,7 0.636,8 481.64,9 4.5,10 18,11 67,13 21,14 40,16 71,17 30,20 21,21 9,22 3,24 31,25 6,28 3,29 3,32 36,35 4.5,36 0.113,37 8,38 52,39 66.658,40 74.936,41 45.04,42 42.584,44 8.658}
{0 CHEMBL140328,1 6.814,2 43.1,3 49,4 0.987,5 1.123,6 0.664,7 0.619,8 347.5,9 5.9,10 12,11 51,13 14,14 29,16 54,17 22,20 14,21 8,22 2,24 25,25 4,28 3,29 1,32 26,35 2,36 0.093,37 5,38 37,39 50.352,40 57.272,41 33.847,42 31.574,44 5.921}
{0 CHEMBL140737,1 6.943,2 45,3 48.3,4 0.99,5 1.123,6 0.668,7 0.625,8 416.58,9 3.3,10 18,11 60,13 19,14 34,16 63,17 27,20 19,21 8,22 1,23 1,24 29,25 4,28 2,29 1,32 31,34 1,35 1.7,36 0.111,37 7,38 44,39 59.414,40 67.359,41 40.063,42 37.516,43 1.7,44 7.745}
{0 CHEMBL140769,1 6.131,2 40.9,3 54.5,4 0.978,5 1.125,6 0.643,7 0.587,8 404.65,9 3,10 12,11 66,13 13,14 33,16 69,17 27,20 13,21 14,22 1,24 36,25 3,28 2,29 1,32 30,35 1.5,36 0.101,37 7,38 40,39 64.552,40 74.264,41 42.41,42 38.713,44 5.027}
{0 CHEMBL140770,1 7.009,2 42.6,3 48.1,4 0.996,5 1.122,6 0.658,7 0.621,8 378.51,9 3.7,10 12,11 54,13 14,14 31,16 57,17 23,20 14,21 9,22 2,24 26,25 5,28 2,29 3,32 28,35 5.6,36 0.105,37 6,38 39,39 53.789,40 60.607,41 35.512,42 33.509,44 8.097}
{0 CHEMBL140936,1 5.973,2 40.7,3 55.6,4 0.974,5 1.126,6 0.642,7 0.582,8 322.54,9 3.7,10 12,11 54,13 12,14 26,16 56,17 22,20 12,21 10,24 30,25 2,28 2,32 24,36 0.125,37 7,38 32,39 52.574,40 60.809,41 34.671,42 31.418,44 4.921}
{0 CHEMBL140948,1 7.557,2 38.1,3 45.2,4 1.016,5 1.135,6 0.641,7 0.622,8 317.38,9 7.1,10 6,11 42,13 10,14 25,16 44,17 16,20 8,21 8,22 4,24 19,25 7,28 3,29 4,32 23,35 9.5,36 0.091,37 4,38 32,39 42.683,40 47.654,41 26.926,42 26.138,44 5.167}
{0 CHEMBL140990,1 6.454,2 42.6,3 51.9,4 0.982,5 1.122,6 0.655,7 0.604,8 348.53,9 3.7,10 12,11 54,13 13,14 29,16 57,17 23,20 13,21 10,22 1,24 28,25 3,28 2,29 1,32 26,35 1.9,36 0.088,37 5,38 36,39 53.018,40 60.604,41 35.364,42 32.606,44 7.77}
{0 CHEMBL140999,1 7.3,2 46.8,3 45.2,4 0.995,5 1.113,6 0.682,7 0.646,8 452.59,9 3.2,10 18,11 62,13 21,14 38,16 66,17 29,20 21,21 8,22 3,24 28,25 5,28 2,29 3,32 34,35 4.8,36 0.106,37 7,38 50,39 61.672,40 69.022,41 42.273,42 40.036,44 8.62}
{0 CHEMBL141001,1 7.567,2 42.3,3 44.2,4 1.009,5 1.125,6 0.662,7 0.638,8 393.48,9 5.8,10 12,11 52,13 16,14 32,16 55,17 22,20 14,21 8,22 4,24 23,25 7,28 3,29 4,32 29,35 7.7,36 0.109,37 6,38 42,39 52.451,40 58.485,41 34.449,42 33.191,44 8.046}
{0 CHEMBL141042,1 6.84,2 43.4,3 49.1,4 0.99,5 1.121,6 0.661,7 0.619,8 362.51,9 3.8,10 12,11 53,13 14,14 30,16 56,17 23,20 14,21 9,22 2,24 26,25 4,28 2,29 2,32 27,35 3.8,36 0.089,37 5,38 38,39 52.461,40 59.398,41 35.057,42 32.794,44 7.638}
{0 CHEMBL141167,1 6.689,2 41.5,3 50.9,4 0.991,5 1.131,6 0.647,7 0.604,8 354.51,9 3.8,10 12,11 53,13 13,14 28,16 55,17 22,20 13,21 9,22 1,23 1,24 27,25 4,28 2,29 1,32 26,34 1,35 1.9,36 0.109,37 6,38 35,39 52.53,40 59.943,41 34.302,42 31.989,43 1.9,44 7.187}
{0 CHEMBL141203,1 6.664,2 44.2,3 50,4 0.983,5 1.119,6 0.665,7 0.617,8 346.51,9 3.8,10 12,11 52,13 14,14 29,16 55,17 23,20 15,21 8,22 2,24 26,25 3,28 2,29 1,32 26,35 1.9,36 0.091,37 5,38 37,39 51.134,40 58.188,41 34.603,42 32.079,44 5.959}
{0 CHEMBL141276,1 6.595,2 41.5,3 50.9,4 0.986,5 1.126,6 0.653,7 0.606,8 349.52,9 5.7,10 12,11 53,13 13,14 29,16 56,17 22,20 13,21 9,22 1,24 27,25 4,28 3,29 1,32 26,35 1.9,36 0.089,37 5,38 36,39 52.236,40 59.687,41 34.608,42 32.101,44 7.886}
{0 CHEMBL141352,1 6.491,2 40.4,3 51.9,4 0.985,5 1.129,6 0.646,7 0.598,8 337.51,9 5.8,10 12,11 52,13 13,14 27,16 54,17 21,20 12,21 9,22 1,24 27,25 4,28 3,29 1,32 25,35 1.9,36 0.111,37 6,38 34,39 51.236,40 58.687,41 33.608,42 31.101,44 6.967}
{0 CHEMBL141515,1 6.01,2 38,3 56,4 0.98,5 1.132,6 0.627,7 0.572,8 300.49,9 4,10 6,11 50,13 7,14 24,16 52,17 19,20 7,21 12,22 1,24 28,25 3,28 2,29 1,32 22,35 2,36 0.096,37 5,38 28,39 49.018,40 56.604,41 31.364,42 28.606,44 6.569}
{0 CHEMBL141622,1 7.306,2 45.3,3 45.3,4 0.996,5 1.118,6 0.676,7 0.642,8 467.61,9 4.7,10 18,11 64,13 21,14 39,16 68,17 29,20 21,21 8,22 3,24 29,25 6,28 3,29 3,32 35,35 4.7,36 0.103,37 7,38 51,39 63.774,40 71.521,41 43.279,42 41.057,44 6.469}
{0 CHEMBL141801,1 6.431,2 40.4,3 52.6,4 0.986,5 1.127,6 0.642,7 0.594,8 366.55,9 3.5,10 12,11 57,13 13,14 29,16 59,17 23,20 13,21 10,22 1,24 30,25 4,28 2,29 2,32 27,35 3.5,36 0.119,37 7,38 36,39 56.229,40 64.228,41 36.58,42 33.848,44 6.155}
{0 CHEMBL141810,1 6.595,2 41.5,3 50.9,4 0.986,5 1.126,6 0.653,7 0.606,8 349.52,9 5.7,10 12,11 53,13 13,14 29,16 56,17 22,20 13,21 9,22 1,24 27,25 4,28 3,29 1,32 26,35 1.9,36 0.089,37 5,38 36,39 52.236,40 59.687,41 34.608,42 32.101,44 6.097}
{0 CHEMBL141853,1 6.26,2 41.1,3 53.6,4 0.98,5 1.125,6 0.645,7 0.592,8 350.55,9 3.6,10 12,11 56,13 13,14 28,16 58,17 23,20 13,21 10,22 1,24 30,25 3,28 2,29 1,32 26,35 1.8,36 0.121,37 7,38 35,39 54.901,40 63.019,41 36.126,42 33.133,44 6.081}
{0 CHEMBL141873,1 6.697,2 43.8,3 50,4 0.986,5 1.119,6 0.662,7 0.615,8 428.62,9 3.1,10 18,11 64,13 19,14 35,16 67,17 28,20 19,21 9,22 1,24 32,25 4,28 2,29 2,32 32,35 3.1,36 0.119,37 8,38 45,39 63.112,40 71.643,41 42.341,42 39.374,44 6.229}
{0 CHEMBL142013,1 6.083,2 41.8,3 54.5,4 0.974,5 1.124,6 0.649,7 0.589,8 334.55,9 3.6,10 12,11 55,13 12,14 28,16 58,17 23,20 12,21 11,24 30,25 2,28 2,32 25,36 0.086,37 5,38 34,39 53.574,40 61.809,41 35.671,42 32.418,44 5.796}
{0 CHEMBL142014,1 6.454,2 42.6,3 51.9,4 0.982,5 1.122,6 0.655,7 0.604,8 348.53,9 3.7,10 12,11 54,13 13,14 29,16 57,17 23,20 13,21 10,22 1,24 28,25 3,28 2,29 1,32 26,35 1.9,36 0.088,37 5,38 36,39 53.018,40 60.604,41 35.364,42 32.606,44 6}
{0 CHEMBL142838,1 6.388,2 40.9,3 53,4 0.986,5 1.124,6 0.641,7 0.593,8 421.63,9 1.5,10 12,11 66,13 13,14 34,16 69,17 27,20 13,21 14,22 1,24 35,25 4,28 1,29 3,32 31,35 4.5,36 0.13,37 9,38 41,39 65.105,40 74.185,41 42.313,42 39.121,44 7.456}
{0 CHEMBL142980,1 6.595,2 43.4,3 50.9,4 0.986,5 1.119,6 0.657,7 0.609,8 349.51,9 1.9,10 12,11 53,13 13,14 29,16 56,17 23,20 13,21 10,22 1,24 27,25 3,28 1,29 2,32 26,35 3.8,36 0.089,37 5,38 36,39 52.243,40 59.315,41 34.813,42 32.299,44 7.092}
{0 CHEMBL144477,1 6.595,2 43.4,3 50.9,4 0.986,5 1.119,6 0.657,7 0.609,8 349.51,9 1.9,10 12,11 53,13 13,14 29,16 56,17 23,20 13,21 10,22 1,24 27,25 3,28 1,29 2,32 26,35 3.8,36 0.089,37 5,38 36,39 52.243,40 59.315,41 34.813,42 32.299,44 7.921}
{0 CHEMBL145361,1 7.196,2 40.7,3 47.5,4 1.006,5 1.126,6 0.647,7 0.618,8 424.54,9 3.4,10 12,11 59,13 15,14 34,16 62,17 24,20 13,21 11,22 3,24 28,25 7,28 2,29 5,32 31,35 8.5,36 0.113,37 7,38 43,39 59.327,40 66.441,41 38.182,42 36.465,44 6.796}
{0 CHEMBL145446,1 6.47,2 41.3,3 52.4,4 0.988,5 1.123,6 0.644,7 0.597,8 407.6,9 1.6,10 12,11 63,13 13,14 33,16 66,17 26,20 13,21 13,22 1,24 33,25 4,28 1,29 3,32 30,35 4.8,36 0.121,37 8,38 40,39 62.221,40 70.77,41 40.552,42 37.595,44 8.824}
{0 CHEMBL145713,1 6.314,2 40.6,3 53.6,4 0.985,5 1.125,6 0.639,7 0.589,8 435.66,9 1.4,10 12,11 69,13 13,14 35,16 72,17 28,20 13,21 15,22 1,24 37,25 4,28 1,29 3,32 32,35 4.3,36 0.139,37 10,38 42,39 67.989,40 77.6,41 44.074,42 40.648,44 7.854}
{0 CHEMBL1652,1 6.893,2 35.9,3 53.8,4 0.992,5 1.136,6 0.639,7 0.586,8 537.64,9 5.1,10 12,11 78,13 14,14 37,16 79,17 28,18 2,20 14,21 14,22 2,24 42,25 8,26 2,28 4,29 2,32 36,34 2,35 2.6,36 0.19,37 15,38 45,39 77.381,40 88.604,41 49.876,42 45.706,43 2.6,44 4.303}
{0 CHEMBL1678,1 6.659,2 42.1,3 50.9,4 0.99,5 1.122,6 0.65,7 0.606,8 379.54,9 1.8,10 12,11 57,13 13,14 31,16 60,17 24,20 13,21 11,22 1,24 29,25 4,28 1,29 3,32 28,35 5.3,36 0.1,37 6,38 38,39 56.454,40 63.939,41 37.029,42 34.541,44 8.244}
{0 CHEMBL168938,1 6.864,2 43.6,3 49.1,4 0.992,5 1.119,6 0.659,7 0.618,8 377.52,9 1.8,10 12,11 55,13 14,14 31,16 58,17 24,20 15,21 9,22 2,24 27,25 4,28 1,29 3,32 28,35 5.5,36 0.086,37 5,38 39,39 54.571,40 61.524,41 36.267,42 34.014,44 7.886}
{0 CHEMBL169648,1 6.769,2 42.6,3 50,4 0.992,5 1.121,6 0.653,7 0.611,8 365.51,9 1.9,10 12,11 54,13 13,14 30,16 57,17 23,20 13,21 10,22 1,24 27,25 4,28 1,29 3,32 27,35 5.6,36 0.088,37 5,38 37,39 53.571,40 60.524,41 35.267,42 33.014,44 5.481}
{0 CHEMBL170946,1 6.559,2 41.7,3 51.7,4 0.989,5 1.123,6 0.647,7 0.601,8 393.57,9 1.7,10 12,11 60,13 13,14 32,16 63,17 25,20 13,21 12,22 1,24 31,25 4,28 1,29 3,32 29,35 5,36 0.095,37 6,38 39,39 59.338,40 67.355,41 38.79,42 36.068,44 8.569}
{0 CHEMBL171048,1 7.196,2 40.7,3 47.5,4 1.006,5 1.126,6 0.647,7 0.618,8 424.54,9 3.4,10 12,11 59,13 15,14 34,16 62,17 24,20 13,21 11,22 3,24 28,25 7,28 2,29 5,32 31,35 8.5,36 0.113,37 7,38 43,39 59.327,40 66.441,41 38.182,42 36.465,44 7}
{0 CHEMBL171508,1 6.492,2 42.9,3 51.8,4 0.984,5 1.12,6 0.653,7 0.604,8 363.54,9 1.8,10 12,11 56,13 13,14 30,16 59,17 24,20 14,21 10,22 1,24 29,25 3,28 1,29 2,32 27,35 3.6,36 0.102,37 6,38 37,39 55.127,40 62.73,41 36.574,42 33.826,44 5.357}
{0 CHEMBL172409,1 6.559,2 41.7,3 51.7,4 0.989,5 1.123,6 0.647,7 0.601,8 393.57,9 1.7,10 12,11 60,13 13,14 32,16 63,17 25,20 13,21 12,22 1,24 31,25 4,28 1,29 3,32 29,35 5,36 0.111,37 7,38 39,39 59.338,40 67.355,41 38.79,42 36.068,44 7.523}
{0 CHEMBL2159415,1 7.163,2 46.2,3 46.2,4 0.992,5 1.115,6 0.679,7 0.64,8 372.5,9 3.8,10 18,11 52,13 19,14 31,16 55,17 24,20 19,21 5,22 1,24 24,25 4,28 2,29 2,32 28,35 3.8,36 0.091,37 5,38 41,39 51.578,40 57.983,41 35.296,42 33.267,44 4.845}
{0 CHEMBL2159416,1 7.163,2 46.2,3 46.2,4 0.992,5 1.115,6 0.679,7 0.64,8 372.5,9 3.8,10 18,11 52,13 19,14 31,16 55,17 24,20 19,21 5,22 1,24 24,25 4,28 2,29 2,32 28,35 3.8,36 0.091,37 5,38 41,39 51.578,40 57.983,41 35.296,42 33.267,44 4.22}
{0 CHEMBL2159420,1 8.63,2 45.3,3 41.5,4 1.01,5 1.115,6 0.707,7 0.672,8 457.38,9 3.8,10 18,11 53,13 19,14 34,16 56,17 24,18 2,20 19,21 5,22 1,24 22,25 7,26 2,28 2,29 3,32 31,34 2,35 5.7,36 0.107,37 6,38 44,39 53.553,40 59.08,41 37.466,42 35.637,43 3.8,44 4.86}
{0 CHEMBL2159421,1 9.089,2 46.9,3 38.8,4 1.017,5 1.118,6 0.718,7 0.689,8 445.34,9 4.1,10 18,11 49,13 19,14 33,16 52,17 23,18 2,20 19,21 4,22 1,23 1,24 19,25 7,26 2,28 2,29 2,32 30,34 3,35 4.1,36 0.096,37 5,38 43,39 49.854,40 54.795,41 35.188,42 33.779,43 6.1,44 5.592}
{0 CHEMBL2159422,1 9.089,2 46.9,3 38.8,4 1.017,5 1.118,6 0.718,7 0.689,8 445.34,9 4.1,10 18,11 49,13 19,14 33,16 52,17 23,18 2,20 19,21 4,22 1,23 1,24 19,25 7,26 2,28 2,29 2,32 30,34 3,35 4.1,36 0.096,37 5,38 43,39 49.854,40 54.795,41 35.188,42 33.779,43 6.1,44 4.049}
{0 CHEMBL2159423,1 7.639,2 40.4,3 49.1,4 0.998,5 1.125,6 0.672,7 0.623,8 435.43,9 3.5,10 12,11 57,13 13,14 31,16 59,17 23,18 2,20 13,21 10,22 1,24 28,25 6,26 2,28 2,29 2,32 29,34 2,35 3.5,36 0.153,37 9,38 38,39 56.876,40 64.116,41 38.296,42 35.503,43 3.5,44 4.851}
{0 CHEMBL2159425,1 8.488,2 46.2,3 42.3,4 1.004,5 1.113,6 0.712,7 0.672,8 441.38,9 3.8,10 18,11 52,13 19,14 33,16 55,17 24,18 2,20 19,21 5,22 1,24 22,25 6,26 2,28 2,29 2,32 30,34 2,35 3.8,36 0.091,37 5,38 43,39 52.225,40 57.871,41 37.012,42 34.922,43 3.8,44 5.59}
{0 CHEMBL2159426,1 8.488,2 46.2,3 42.3,4 1.004,5 1.113,6 0.712,7 0.672,8 441.38,9 3.8,10 18,11 52,13 19,14 33,16 55,17 24,18 2,20 19,21 5,22 1,24 22,25 6,26 2,28 2,29 2,32 30,34 2,35 3.8,36 0.091,37 5,38 43,39 52.225,40 57.871,41 37.012,42 34.922,43 3.8,44 6.155}
{0 CHEMBL2159428,1 9.424,2 46.9,3 38.8,4 1.014,5 1.11,6 0.737,7 0.698,8 461.79,9 4.1,10 18,11 49,13 19,14 33,16 52,17 23,18 3,20 19,21 4,22 1,24 19,25 7,26 3,28 2,29 2,32 30,34 3,35 4.1,36 0.096,37 5,38 43,39 49.665,40 54.399,41 36.108,42 34.223,43 6.1,44 4.926}
{0 CHEMBL23838,1 8.601,2 31.3,3 43.8,4 1.038,5 1.137,6 0.648,7 0.623,8 275.22,9 3.1,10 6,11 32,13 9,14 18,16 32,17 10,20 6,21 4,22 3,24 14,25 8,26 1,28 1,29 6,30 1,32 18,35 18.8,36 0.219,37 7,38 24,39 33.225,40 36.385,41 20.744,42 19.922,44 7.886}
{0 CHEMBL258468,1 5.911,2 38.3,3 56.8,4 0.979,5 1.13,6 0.626,7 0.569,8 478.79,9 2.5,10 12,11 81,13 12,14 38,16 84,17 31,20 12,21 19,24 46,25 4,28 2,29 2,32 35,35 2.5,36 0.095,37 8,38 44,39 79.297,40 91.55,41 50.671,42 46.062,44 4.377}
{0 CHEMBL258505,1 5.788,2 37.8,3 57.8,4 0.977,5 1.131,6 0.622,7 0.563,8 520.88,9 2.2,10 12,11 90,13 12,14 41,16 93,17 34,20 12,21 22,24 52,25 4,28 2,29 2,32 38,35 2.2,36 0.118,37 11,38 47,39 87.948,40 101.795,41 55.955,42 50.642,44 5.914}
{0 CHEMBL258935,1 5.752,2 37.6,3 58.1,4 0.977,5 1.131,6 0.621,7 0.561,8 534.91,9 2.2,10 12,11 93,13 12,14 42,16 96,17 35,20 12,21 23,24 54,25 4,28 2,29 2,32 39,35 2.2,36 0.125,37 12,38 48,39 90.832,40 105.211,41 57.717,42 52.169,44 6.569}
{0 CHEMBL259523,1 5.657,2 37.3,3 58.8,4 0.975,5 1.132,6 0.618,7 0.556,8 577,9 2,10 12,11 102,13 12,14 45,16 105,17 38,20 12,21 26,24 60,25 4,28 2,29 2,32 42,35 2,36 0.143,37 15,38 51,39 99.483,40 115.456,41 63.001,42 56.75,44 8.022}
{0 CHEMBL265214,1 5.602,2 37,3 59.3,4 0.975,5 1.132,6 0.616,7 0.554,8 605.06,9 1.9,10 12,11 108,13 12,14 47,16 111,17 40,20 12,21 28,24 64,25 4,28 2,29 2,32 44,35 1.9,36 0.153,37 17,38 53,39 105.25,40 122.287,41 66.524,42 59.803,44 7.377}
{0 CHEMBL291918,1 6.349,2 41.5,3 52.8,4 0.981,5 1.125,6 0.648,7 0.596,8 336.52,9 3.8,10 12,11 53,13 13,14 27,16 55,17 22,20 13,21 9,22 1,24 28,25 3,28 2,29 1,32 25,35 1.9,36 0.109,37 6,38 34,39 52.018,40 59.604,41 34.364,42 31.606,44 6}
{0 CHEMBL292421,1 6.045,2 36.8,3 56.1,4 0.984,5 1.134,6 0.62,7 0.568,8 344.55,9 3.5,10 6,11 57,13 7,14 27,16 59,17 21,20 7,21 14,22 1,24 32,25 4,28 2,29 2,32 25,35 3.5,36 0.153,37 9,38 31,39 56.112,40 64.643,41 35.341,42 32.374,44 6.815}
{0 CHEMBL292440,1 6.55,2 44.4,3 50.8,4 0.981,5 1.118,6 0.665,7 0.614,8 412.62,9 3.2,10 18,11 63,13 19,14 34,16 66,17 28,20 19,21 9,22 1,24 32,25 3,28 2,29 1,32 31,35 1.6,36 0.121,37 8,38 44,39 61.785,40 70.434,41 41.887,42 38.66,44 6.027}
{0 CHEMBL292518,1 6.788,2 48.1,3 48.1,4 0.978,5 1.111,6 0.688,7 0.636,8 183.27,9 3.7,10 11,11 27,13 11,14 16,16 29,17 13,20 9,21 4,24 13,25 1,28 1,32 14,38 21.5,39 26.403,40 29.99,41 18.574,42 17.182,44 6.866}
{0 CHEMBL294242,1 6.349,2 41.5,3 52.8,4 0.981,5 1.125,6 0.648,7 0.596,8 336.52,9 3.8,10 12,11 53,13 13,14 27,16 55,17 22,20 13,21 9,22 1,24 28,25 3,28 2,29 1,32 25,35 1.9,36 0.109,37 6,38 34,39 52.018,40 59.604,41 34.364,42 31.606,44 6.328}
{0 CHEMBL294413,1 6.049,2 41.2,3 54.9,4 0.974,5 1.125,6 0.645,7 0.586,8 308.51,9 3.9,10 12,11 51,13 12,14 25,16 53,17 21,20 12,21 9,24 28,25 2,28 2,32 23,36 0.132,37 7,38 31,39 49.69,40 57.394,41 32.91,42 29.891,44 4.337}
{0 CHEMBL298603,1 6.349,2 41.5,3 52.8,4 0.981,5 1.125,6 0.648,7 0.596,8 336.52,9 3.8,10 12,11 53,13 13,14 27,16 55,17 22,20 13,21 9,22 1,24 28,25 3,28 2,29 1,32 25,35 1.9,36 0.109,37 6,38 34,39 52.018,40 59.604,41 34.364,42 31.606,44 6.745}
{0 CHEMBL299313,1 6.602,2 40.8,3 51,4 0.987,5 1.128,6 0.65,7 0.604,8 323.48,9 6.1,10 12,11 49,13 13,14 26,16 51,17 20,20 12,21 8,22 1,24 25,25 4,28 3,29 1,32 24,35 2,36 0.118,37 6,38 33,39 48.352,40 55.272,41 31.847,42 29.574,44 7.161}
{0 CHEMBL299708,1 7.112,2 42,3 49.3,4 0.991,5 1.119,6 0.67,7 0.62,8 490.72,9 2.9,10 18,11 69,13 21,14 38,16 72,17 29,20 19,21 10,22 3,24 34,25 6,26 1,28 2,29 3,31 1,32 35,35 4.3,36 0.125,37 9,38 50,39 68.4,40 77.188,41 46.205,42 42.803,44 9.222}
{0 CHEMBL301243,1 5.867,2 37.5,3 57.1,4 0.978,5 1.133,6 0.623,7 0.565,8 328.55,9 3.6,10 6,11 56,13 7,14 26,16 58,17 21,20 7,21 14,22 1,24 32,25 3,28 2,29 1,32 24,35 1.8,36 0.103,37 6,38 30,39 54.785,40 63.434,41 34.887,42 31.66,44 5.796}
{0 CHEMBL314437,1 5.835,2 37.5,3 57.5,4 0.979,5 1.132,6 0.621,7 0.563,8 233.39,9 2.5,10 6,11 40,13 6,14 18,16 41,17 15,20 6,21 9,24 23,25 2,28 1,29 1,32 17,35 2.5,36 0.049,37 2,38 21,39 39.149,40 45.275,41 24.836,42 22.531,44 4.387}
{0 CHEMBL318026,1 7.143,2 43.3,3 46.7,4 0.994,5 1.123,6 0.668,7 0.631,8 214.29,9 6.7,10 11,11 30,13 11,14 18,16 32,17 13,20 9,21 4,24 14,25 3,28 2,29 1,32 16,35 3.3,38 23.5,39 29.833,40 33.697,41 20.034,42 18.918,44 5.317}
{0 CHEMBL319451,1 7.143,2 43.3,3 46.7,4 0.994,5 1.123,6 0.668,7 0.631,8 214.29,9 6.7,10 11,11 30,13 11,14 18,16 32,17 13,20 9,21 4,24 14,25 3,28 2,29 1,32 16,35 3.3,38 23.5,39 29.833,40 33.697,41 20.034,42 18.918,44 5.845}
{0 CHEMBL326868,1 7.744,2 42.9,3 42.9,4 1.012,5 1.124,6 0.667,7 0.646,8 379.45,9 6.1,10 12,11 49,13 16,14 31,16 52,17 21,20 14,21 7,22 4,24 21,25 7,28 3,29 4,32 28,35 8.2,36 0.096,37 5,38 41,39 49.567,40 55.069,41 32.688,42 31.665,44 5.523}
{0 CHEMBL333149,1 5.773,2 29.4,3 62.7,4 0.984,5 1.148,6 0.597,7 0.523,8 294.44,11 51,13 1,14 18,16 50,17 15,21 15,22 1,23 1,24 32,25 4,26 1,29 2,30 1,32 19,34 1,35 3.9,36 0.26,37 13,38 19,39 50.163,40 58.541,41 30.472,42 26.692,43 2,44 5.201}
{0 CHEMBL333909,1 6.559,2 43.1,3 51,4 0.983,5 1.121,6 0.659,7 0.609,8 334.5,9 3.9,10 12,11 51,13 13,14 28,16 54,17 22,20 13,21 9,22 1,24 26,25 3,28 2,29 1,32 25,35 2,36 0.093,37 5,38 35,39 50.134,40 57.188,41 33.603,42 31.079,44 7.009}
{0 CHEMBL336686,1 7.563,2 41.1,3 44.6,4 1.012,5 1.127,6 0.655,7 0.633,8 423.51,9 5.4,10 12,11 56,13 16,14 34,16 59,17 23,20 14,21 9,22 4,24 25,25 8,28 3,29 5,32 31,35 8.9,36 0.119,37 7,38 44,39 56.662,40 63.109,41 36.665,42 35.433,44 6.357}
{0 CHEMBL338596,1 6.349,2 41.5,3 52.8,4 0.981,5 1.125,6 0.648,7 0.596,8 336.52,9 3.8,10 12,11 53,13 13,14 27,16 55,17 22,20 13,21 9,22 1,24 28,25 3,28 2,29 1,32 25,35 1.9,36 0.127,37 7,38 34,39 52.018,40 59.604,41 34.364,42 31.606,44 4.886}
{0 CHEMBL339484,1 5.89,2 38.8,3 56.7,4 0.977,5 1.13,6 0.629,7 0.571,8 394.66,9 3,10 6,11 67,13 7,14 33,16 71,17 26,20 7,21 19,22 1,24 38,25 3,28 2,29 1,32 29,35 1.5,36 0.085,37 6,38 37,39 65.436,40 75.68,41 42.171,42 38.24,44 4.62}
{0 CHEMBL339630,1 6.577,2 38.6,3 52.3,4 0.996,5 1.129,6 0.631,7 0.59,8 289.41,9 2.3,10 6,11 44,13 7,14 23,16 46,17 17,20 7,21 10,22 1,24 23,25 4,28 1,29 3,32 21,35 6.8,36 0.087,37 4,38 27,39 43.803,40 49.694,41 27.745,42 25.961,44 5.268}
{0 CHEMBL340382,1 6.937,2 40,3 49.1,4 0.998,5 1.129,6 0.646,7 0.61,8 381.52,9 5.5,10 12,11 55,13 15,14 30,16 57,17 22,20 13,21 9,22 3,24 27,25 6,28 3,29 3,32 28,35 5.5,36 0.123,37 7,38 39,39 54.891,40 62.106,41 35.517,42 33.53,44 4.854}
{0 CHEMBL340609,1 6.689,2 41.5,3 50.9,4 0.991,5 1.131,6 0.647,7 0.604,8 354.51,9 3.8,10 12,11 53,13 13,14 28,16 55,17 22,20 13,21 9,22 1,23 1,24 27,25 4,28 2,29 1,32 26,34 1,35 1.9,36 0.109,37 6,38 35,39 52.53,40 59.943,41 34.302,42 31.989,43 1.9,44 6.688}
{0 CHEMBL340621,1 6.773,2 44.1,3 49.2,4 0.985,5 1.12,6 0.667,7 0.621,8 399.58,9 5.1,10 18,11 59,13 19,14 33,16 62,17 26,20 18,21 8,22 1,24 29,25 4,28 3,29 1,32 30,35 1.7,36 0.113,37 7,38 43,39 58.12,40 66.102,41 39.37,42 36.627,44 7.194}
{0 CHEMBL340672,1 6.349,2 41.5,3 52.8,4 0.981,5 1.125,6 0.648,7 0.596,8 336.52,9 3.8,10 12,11 53,13 13,14 27,16 55,17 22,20 13,21 9,22 1,24 28,25 3,28 2,29 1,32 25,35 1.9,36 0.109,37 6,38 34,39 52.018,40 59.604,41 34.364,42 31.606,44 7.284}
{0 CHEMBL342413,1 6.99,2 42.3,3 48.1,4 0.994,5 1.125,6 0.66,7 0.621,8 363.5,9 5.8,10 12,11 52,13 14,14 30,16 55,17 22,20 14,21 8,22 2,24 25,25 5,28 3,29 2,32 27,35 3.8,36 0.091,37 5,38 38,39 51.68,40 58.481,41 34.302,42 32.289,44 8.377}
{0 CHEMBL344317,1 6.319,2 43.6,3 52.7,4 0.978,5 1.119,6 0.657,7 0.602,8 347.54,9 1.8,10 12,11 55,13 13,14 29,16 58,17 24,20 13,21 11,22 1,24 29,25 2,28 1,29 1,32 26,35 1.8,36 0.069,37 4,38 36,39 53.8,40 61.521,41 36.12,42 33.111,44 4.824}
{0 CHEMBL344765,1 6.659,2 42.1,3 50.9,4 0.99,5 1.122,6 0.65,7 0.606,8 379.54,9 1.8,10 12,11 57,13 13,14 31,16 60,17 24,20 13,21 11,22 1,24 29,25 4,28 1,29 3,32 28,35 5.3,36 0.1,37 6,38 38,39 56.454,40 63.939,41 37.029,42 34.541,44 6.319}
{0 CHEMBL345124,1 6.379,2 41.5,3 52.3,4 0.979,5 1.126,6 0.653,7 0.6,8 414.65,9 6.2,10 22,11 65,13 22,14 34,16 68,17 27,20 19,21 8,24 34,25 4,28 4,32 31,36 0.103,37 7,38 45,39 63.661,40 73.221,41 42.444,42 38.988,44 5.806}
{0 CHEMBL352948,1 6.414,2 44.2,3 51.9,4 0.979,5 1.117,6 0.661,7 0.607,8 333.51,9 1.9,10 12,11 52,13 13,14 28,16 55,17 23,20 13,21 10,22 1,24 27,25 2,28 1,29 1,32 25,35 1.9,36 0.073,37 4,38 35,39 50.916,40 58.105,41 34.358,42 31.585,44 5.678}
{0 CHEMBL353468,1 6.559,2 41.7,3 51.7,4 0.989,5 1.123,6 0.647,7 0.601,8 393.57,9 1.7,10 12,11 60,13 13,14 32,16 63,17 25,20 13,21 12,22 1,24 31,25 4,28 1,29 3,32 29,35 5,36 0.095,37 6,38 39,39 59.338,40 67.355,41 38.79,42 36.068,44 8}
{0 CHEMBL354848,1 6.559,2 41.7,3 51.7,4 0.989,5 1.123,6 0.647,7 0.601,8 393.57,9 1.7,10 12,11 60,13 13,14 32,16 63,17 25,20 13,21 12,22 1,24 31,25 4,28 1,29 3,32 29,35 5,36 0.095,37 6,38 39,39 59.338,40 67.355,41 38.79,42 36.068,44 7.398}
{0 CHEMBL354850,1 6.751,2 43.1,3 50,4 0.991,5 1.12,6 0.656,7 0.613,8 391.55,9 1.7,10 12,11 58,13 14,14 32,16 61,17 25,20 15,21 10,22 2,24 29,25 4,28 1,29 3,32 29,35 5.2,36 0.098,37 6,38 40,39 57.454,40 64.939,41 38.029,42 35.541,44 6.824}
{0 CHEMBL355160,1 6.121,2 38.1,3 55.6,4 0.986,5 1.13,6 0.624,7 0.573,8 385.6,9 1.6,10 6,11 63,13 7,14 31,16 66,17 24,20 7,21 17,22 1,24 35,25 4,28 1,29 3,32 28,35 4.8,36 0.091,37 6,38 35,39 62.105,40 71.185,41 39.313,42 36.121,44 8.051}
{0 CHEMBL355583,1 6.559,2 41.7,3 51.7,4 0.989,5 1.123,6 0.647,7 0.601,8 393.57,9 1.7,10 12,11 60,13 13,14 32,16 63,17 25,20 13,21 12,22 1,24 31,25 4,28 1,29 3,32 29,35 5,36 0.111,37 7,38 39,39 59.338,40 67.355,41 38.79,42 36.068,44 6.745}
{0 CHEMBL355845,1 6.795,2 41.1,3 50,4 0.994,5 1.125,6 0.648,7 0.608,8 380.53,9 3.6,10 12,11 56,13 13,14 31,16 59,17 23,20 13,21 10,22 1,24 28,25 5,28 2,29 3,32 28,35 5.4,36 0.102,37 6,38 38,39 55.672,40 63.022,41 36.273,42 34.036,44 7.027}
{0 CHEMBL356333,1 6.659,2 42.1,3 50.9,4 0.99,5 1.122,6 0.65,7 0.606,8 379.54,9 1.8,10 12,11 57,13 13,14 31,16 60,17 24,20 13,21 11,22 1,24 29,25 4,28 1,29 3,32 28,35 5.3,36 0.1,37 6,38 38,39 56.454,40 63.939,41 37.029,42 34.541,44 7.602}
{0 CHEMBL358517,1 6.659,2 42.1,3 50.9,4 0.99,5 1.122,6 0.65,7 0.606,8 379.54,9 1.8,10 12,11 57,13 13,14 31,16 60,17 24,20 13,21 11,22 1,24 29,25 4,28 1,29 3,32 28,35 5.3,36 0.1,37 6,38 38,39 56.454,40 63.939,41 37.029,42 34.541,44 7.444}
{0 CHEMBL406645,1 5.687,2 37.4,3 58.6,4 0.976,5 1.132,6 0.619,7 0.558,8 562.97,9 2,10 12,11 99,13 12,14 44,16 102,17 37,20 12,21 25,24 58,25 4,28 2,29 2,32 41,35 2,36 0.137,37 14,38 50,39 96.599,40 112.041,41 61.24,42 55.223,44 8.409}
{0 CHEMBL406885,1 5.629,2 37.1,3 59,4 0.975,5 1.132,6 0.617,7 0.555,8 591.03,9 1.9,10 12,11 105,13 12,14 46,16 108,17 39,20 12,21 27,24 62,25 4,28 2,29 2,32 43,35 1.9,36 0.148,37 16,38 52,39 102.366,40 118.871,41 64.762,42 58.276,44 7.62}
{0 CHEMBL408463,1 5.826,2 37.9,3 57.5,4 0.978,5 1.131,6 0.623,7 0.565,8 506.85,9 2.3,10 12,11 87,13 12,14 40,16 90,17 33,20 12,21 21,24 50,25 4,28 2,29 2,32 37,35 2.3,36 0.111,37 10,38 46,39 85.065,40 98.38,41 54.194,42 49.116,44 6}
{0 CHEMBL409858,1 5.867,2 38.1,3 57.1,4 0.978,5 1.131,6 0.624,7 0.567,8 492.82,9 2.4,10 12,11 84,13 12,14 39,16 87,17 32,20 12,21 20,24 48,25 4,28 2,29 2,32 36,35 2.4,36 0.103,37 9,38 45,39 82.181,40 94.965,41 52.433,42 47.589,44 4.67}
{0 CHEMBL410915,1 5.718,2 37.5,3 58.3,4 0.976,5 1.132,6 0.62,7 0.559,8 548.94,9 2.1,10 12,11 96,13 12,14 43,16 99,17 36,20 12,21 24,24 56,25 4,28 2,29 2,32 40,35 2.1,36 0.131,37 13,38 49,39 93.715,40 108.626,41 59.478,42 53.696,44 7.102}
{0 CHEMBL411226,1 5.958,2 38.5,3 56.4,4 0.98,5 1.13,6 0.627,7 0.571,8 464.76,9 2.6,10 12,11 78,13 12,14 37,16 81,17 30,20 12,21 18,24 44,25 4,28 2,29 2,32 34,35 2.6,36 0.086,37 7,38 43,39 76.414,40 88.135,41 48.91,42 44.535,44 4.367}
{0 CHEMBL413549,1 6.121,2 37,3 55.6,4 0.986,5 1.134,6 0.622,7 0.571,8 330.52,9 3.7,10 6,11 54,13 7,14 26,16 56,17 20,20 7,21 13,22 1,24 30,25 4,28 2,29 2,32 24,35 3.7,36 0.143,37 8,38 30,39 53.229,40 61.228,41 33.58,42 30.848,44 6.807}
{0 CHEMBL413765,1 6.045,2 36.8,3 56.1,4 0.984,5 1.134,6 0.62,7 0.568,8 344.55,9 3.5,10 6,11 57,13 7,14 27,16 59,17 21,20 7,21 14,22 1,24 32,25 4,28 2,29 2,32 25,35 3.5,36 0.136,37 8,38 31,39 56.112,40 64.643,41 35.341,42 32.374,44 6.83}
{0 CHEMBL419184,1 7.944,2 43.5,3 41.3,4 1.015,5 1.123,6 0.672,7 0.655,8 365.42,9 6.5,10 12,11 46,13 16,14 30,16 49,17 20,20 14,21 6,22 4,24 19,25 7,28 3,29 4,32 27,35 8.7,36 0.082,37 4,38 40,39 46.683,40 51.654,41 30.926,42 30.138,44 4.569}
{0 CHEMBL419782,1 5.806,2 37.3,3 57.6,4 0.977,5 1.133,6 0.621,7 0.562,8 342.58,9 3.4,10 6,11 59,13 7,14 27,16 61,17 22,20 7,21 15,22 1,24 34,25 3,28 2,29 1,32 25,35 1.7,36 0.098,37 6,38 31,39 57.669,40 66.849,41 36.648,42 33.186,44 6.387}
{0 CHEMBL433041,1 6.094,2 35.6,3 55.9,4 0.987,5 1.138,6 0.616,7 0.566,8 359.57,9 5.1,10 6,11 59,13 7,14 28,16 61,17 21,20 7,21 14,22 1,24 33,25 5,28 3,29 2,32 26,35 3.4,36 0.131,37 8,38 32,39 58.214,40 67.142,41 36.347,42 33.396,44 6.83}
{0 CHEMBL433678,1 7.115,2 42.1,3 47.4,4 0.998,5 1.125,6 0.658,7 0.623,8 405.54,9 5.3,10 12,11 57,13 15,14 33,16 60,17 24,20 15,21 9,22 3,24 27,25 6,28 3,29 3,32 30,35 5.3,36 0.1,37 6,38 42,39 56.891,40 64.106,41 37.517,42 35.53,44 8.553}
{0 CHEMBL434811,1 6.467,2 40.7,3 52.5,4 0.989,5 1.125,6 0.641,7 0.594,8 381.56,9 1.7,10 12,11 59,13 12,14 31,16 62,17 24,20 12,21 12,24 31,25 4,28 1,29 3,32 28,35 5.1,36 0.097,37 6,38 37,39 58.338,40 66.355,41 37.79,42 35.068,44 6.523}
{0 CHEMBL435071,1 7.196,2 40.7,3 47.5,4 1.006,5 1.126,6 0.647,7 0.618,8 424.54,9 3.4,10 12,11 59,13 15,14 34,16 62,17 24,20 13,21 11,22 3,24 28,25 7,28 2,29 5,32 31,35 8.5,36 0.113,37 7,38 43,39 59.327,40 66.441,41 38.182,42 36.465,44 8.398}
{0 CHEMBL439626,1 7.027,2 42.9,3 48.2,4 0.998,5 1.12,6 0.656,7 0.62,8 393.52,9 1.8,10 12,11 56,13 14,14 32,16 59,17 24,20 14,21 10,22 2,24 27,25 5,28 1,29 4,32 29,35 7.1,36 0.085,37 5,38 40,39 55.898,40 62.734,41 36.722,42 34.729,44 5}
{0 CHEMBL444970,1 11.536,2 31,3 37.9,4 1.053,5 1.131,6 0.738,7 0.689,8 334.53,9 3.4,10 6,11 29,13 7,14 18,16 29,17 9,18 3,20 5,21 4,22 1,24 11,25 9,26 4,28 1,29 4,30 1,32 18,34 3,35 13.8,36 0.207,37 6,38 22,39 30.542,40 32.798,41 21.409,42 19.974,43 10.3,44 7.201}
{0 CHEMBL517712,1 6.577,2 38.6,3 52.3,4 0.996,5 1.129,6 0.631,7 0.59,8 289.41,9 2.3,10 6,11 44,13 7,14 23,16 46,17 17,20 7,21 10,22 1,24 23,25 4,28 1,29 3,32 21,35 6.8,36 0.109,37 5,38 27,39 43.803,40 49.694,41 27.745,42 25.961,44 9.306}
{0 CHEMBL51934,1 7.143,2 43.3,3 46.7,4 0.994,5 1.123,6 0.668,7 0.631,8 214.29,9 6.7,10 11,11 30,13 11,14 18,16 32,17 13,20 9,21 4,24 14,25 3,28 2,29 1,32 16,35 3.3,38 23.5,39 29.833,40 33.697,41 20.034,42 18.918,44 6}
{0 CHEMBL524365,1 6.715,2 37.3,3 51,4 0.996,5 1.137,6 0.633,7 0.594,8 342.49,9 7.8,10 12,11 51,13 14,14 26,16 52,17 19,20 12,21 7,22 2,24 26,25 6,28 4,29 2,32 25,35 3.9,36 0.192,37 10,38 34,39 50.781,40 57.979,41 32.307,42 30.31,44 5.886}
{0 CHEMBL538050,1 6.414,2 44.2,3 51.9,4 0.979,5 1.117,6 0.661,7 0.607,8 333.51,9 1.9,10 12,11 52,13 13,14 28,16 55,17 23,20 13,21 10,22 1,24 27,25 2,28 1,29 1,32 25,35 1.9,36 0.073,37 4,38 35,39 50.916,40 58.105,41 34.358,42 31.585,44 5.678}
{0 CHEMBL538069,1 6.559,2 41.7,3 51.7,4 0.989,5 1.123,6 0.647,7 0.601,8 393.57,9 1.7,10 12,11 60,13 13,14 32,16 63,17 25,20 13,21 12,22 1,24 31,25 4,28 1,29 3,32 29,35 5,36 0.095,37 6,38 39,39 59.338,40 67.355,41 38.79,42 36.068,44 8}
{0 CHEMBL538296,1 6.769,2 42.6,3 50,4 0.992,5 1.121,6 0.653,7 0.611,8 365.51,9 1.9,10 12,11 54,13 13,14 30,16 57,17 23,20 13,21 10,22 1,24 27,25 4,28 1,29 3,32 27,35 5.6,36 0.088,37 5,38 37,39 53.571,40 60.524,41 35.267,42 33.014,44 5.481}
{0 CHEMBL538358,1 6.06,2 40,3 55,4 0.976,5 1.129,6 0.641,7 0.583,8 484.8,9 5,10 22,11 80,13 22,14 39,16 83,17 32,20 19,21 13,24 44,25 4,28 4,32 36,36 0.145,37 12,38 50,39 78.079,40 90.297,41 51.251,42 46.622,44 4.102}
{0 CHEMBL538796,1 6.349,2 41.5,3 52.8,4 0.981,5 1.125,6 0.648,7 0.596,8 336.52,9 3.8,10 12,11 53,13 13,14 27,16 55,17 22,20 13,21 9,22 1,24 28,25 3,28 2,29 1,32 25,35 1.9,36 0.109,37 6,38 34,39 52.018,40 59.604,41 34.364,42 31.606,44 6.77}
{0 CHEMBL539073,1 6.559,2 41.7,3 51.7,4 0.989,5 1.123,6 0.647,7 0.601,8 393.57,9 1.7,10 12,11 60,13 13,14 32,16 63,17 25,20 13,21 12,22 1,24 31,25 4,28 1,29 3,32 29,35 5,36 0.095,37 6,38 39,39 59.338,40 67.355,41 38.79,42 36.068,44 7.398}
{0 CHEMBL54058,1 7.274,2 44.7,3 47.4,4 0.991,5 1.113,6 0.684,7 0.636,8 552.79,9 2.6,10 24,11 76,13 27,14 44,16 80,17 34,20 25,21 9,22 3,24 36,25 6,26 1,28 2,29 3,31 1,32 40,35 3.9,36 0.125,37 10,38 59,39 75.283,40 84.603,41 51.966,42 48.33,44 9.222}
{0 CHEMBL540607,1 6.121,2 38.1,3 55.6,4 0.986,5 1.13,6 0.624,7 0.573,8 385.6,9 1.6,10 6,11 63,13 7,14 31,16 66,17 24,20 7,21 17,22 1,24 35,25 4,28 1,29 3,32 28,35 4.8,36 0.091,37 6,38 35,39 62.105,40 71.185,41 39.313,42 36.121,44 8.051}
{0 CHEMBL540657,1 6.968,2 44.2,3 47.4,4 0.986,5 1.123,6 0.675,7 0.631,8 661.95,9 8.4,10 38,11 95,13 38,14 57,16 102,17 42,20 30,21 12,24 45,25 8,28 8,32 50,36 0.118,37 12,38 76,39 93.661,40 106.668,41 64.131,42 59.917,44 8.051}
{0 CHEMBL541625,1 6.97,2 44,3 48,4 0.992,5 1.12,6 0.666,7 0.625,8 348.48,9 4,10 12,11 50,13 14,14 29,16 53,17 22,20 14,21 8,22 2,24 24,25 4,28 2,29 2,32 26,35 4,36 0.094,37 5,38 37,39 49.578,40 55.983,41 33.296,42 31.267,44 7.523}
{0 CHEMBL542253,1 6.414,2 44.2,3 51.9,4 0.979,5 1.117,6 0.661,7 0.607,8 333.51,9 1.9,10 12,11 52,13 13,14 28,16 55,17 23,20 13,21 10,22 1,24 27,25 2,28 1,29 1,32 25,35 1.9,36 0.091,37 5,38 35,39 50.916,40 58.105,41 34.358,42 31.585,44 6.638}
{0 CHEMBL542744,1 7.112,2 42,3 49.3,4 0.991,5 1.119,6 0.67,7 0.62,8 490.72,9 2.9,10 18,11 69,13 21,14 38,16 72,17 29,20 19,21 10,22 3,24 34,25 6,26 1,28 2,29 3,31 1,32 35,35 4.3,36 0.125,37 9,38 50,39 68.4,40 77.188,41 46.205,42 42.803,44 9.237}
{0 CHEMBL543923,1 6.492,2 42.9,3 51.8,4 0.984,5 1.12,6 0.653,7 0.604,8 363.54,9 1.8,10 12,11 56,13 13,14 30,16 59,17 24,20 14,21 10,22 1,24 29,25 3,28 1,29 2,32 27,35 3.6,36 0.102,37 6,38 37,39 55.127,40 62.73,41 36.574,42 33.826,44 5.357}
{0 CHEMBL543924,1 7.196,2 40.7,3 47.5,4 1.006,5 1.126,6 0.647,7 0.618,8 424.54,9 3.4,10 12,11 59,13 15,14 34,16 62,17 24,20 13,21 11,22 3,24 28,25 7,28 2,29 5,32 31,35 8.5,36 0.113,37 7,38 43,39 59.327,40 66.441,41 38.182,42 36.465,44 7}
{0 CHEMBL544159,1 7.306,2 45.3,3 45.3,4 0.996,5 1.118,6 0.676,7 0.642,8 467.61,9 4.7,10 18,11 64,13 21,14 39,16 68,17 29,20 21,21 8,22 3,24 29,25 6,28 3,29 3,32 35,35 4.7,36 0.103,37 7,38 51,39 63.774,40 71.521,41 43.279,42 41.057,44 8.921}
{0 CHEMBL544161,1 6.595,2 43.4,3 50.9,4 0.986,5 1.119,6 0.657,7 0.609,8 349.51,9 1.9,10 12,11 53,13 13,14 29,16 56,17 23,20 13,21 10,22 1,24 27,25 3,28 1,29 2,32 26,35 3.8,36 0.089,37 5,38 36,39 52.243,40 59.315,41 34.813,42 32.299,44 8.194}
{0 CHEMBL544385,1 6.659,2 42.1,3 50.9,4 0.99,5 1.122,6 0.65,7 0.606,8 379.54,9 1.8,10 12,11 57,13 13,14 31,16 60,17 24,20 13,21 11,22 1,24 29,25 4,28 1,29 3,32 28,35 5.3,36 0.1,37 6,38 38,39 56.454,40 63.939,41 37.029,42 34.541,44 7.071}
{0 CHEMBL544389,1 6.795,2 41.1,3 50,4 0.994,5 1.125,6 0.648,7 0.608,8 380.53,9 3.6,10 12,11 56,13 13,14 31,16 59,17 23,20 13,21 10,22 1,24 28,25 5,28 2,29 3,32 28,35 5.4,36 0.102,37 6,38 38,39 55.672,40 63.022,41 36.273,42 34.036,44 7.027}
{0 CHEMBL544629,1 6.643,2 45,3 50,4 0.982,5 1.117,6 0.669,7 0.619,8 398.59,9 3.3,10 18,11 60,13 19,14 33,16 63,17 27,20 19,21 8,22 1,24 30,25 3,28 2,29 1,32 30,35 1.7,36 0.111,37 7,38 43,39 58.901,40 67.019,41 40.125,42 37.133,44 7.456}
{0 CHEMBL544860,1 6.559,2 41.7,3 51.7,4 0.989,5 1.123,6 0.647,7 0.601,8 393.57,9 1.7,10 12,11 60,13 13,14 32,16 63,17 25,20 13,21 12,22 1,24 31,25 4,28 1,29 3,32 29,35 5,36 0.095,37 6,38 39,39 59.338,40 67.355,41 38.79,42 36.068,44 8.699}
{0 CHEMBL545317,1 6.559,2 41.7,3 51.7,4 0.989,5 1.123,6 0.647,7 0.601,8 393.57,9 1.7,10 12,11 60,13 13,14 32,16 63,17 25,20 13,21 12,22 1,24 31,25 4,28 1,29 3,32 29,35 5,36 0.111,37 7,38 39,39 59.338,40 67.355,41 38.79,42 36.068,44 7.523}
{0 CHEMBL545560,1 6.52,2 44.9,3 51,4 0.98,5 1.116,6 0.665,7 0.613,8 319.48,9 2,10 12,11 49,13 13,14 27,16 52,17 22,20 13,21 9,22 1,24 25,25 2,28 1,29 1,32 24,35 2,36 0.077,37 4,38 34,39 48.032,40 54.69,41 32.597,42 30.058,44 6.824}
{0 CHEMBL545791,1 6.559,2 41.7,3 51.7,4 0.989,5 1.123,6 0.647,7 0.601,8 393.57,9 1.7,10 12,11 60,13 13,14 32,16 63,17 25,20 13,21 12,22 1,24 31,25 4,28 1,29 3,32 29,35 5,36 0.111,37 7,38 39,39 59.338,40 67.355,41 38.79,42 36.068,44 6.745}
{0 CHEMBL54835,1 6.528,2 40.7,3 51.9,4 0.988,5 1.126,6 0.645,7 0.599,8 352.52,9 3.7,10 12,11 54,13 13,14 28,16 56,17 22,20 13,21 9,22 1,24 28,25 4,28 2,29 2,32 26,35 3.7,36 0.125,37 7,38 35,39 53.345,40 60.813,41 34.819,42 32.321,44 7.056}
{0 CHEMBL55014,1 6.45,2 42,3 52,4 0.983,5 1.124,6 0.652,7 0.602,8 322.49,9 4,10 12,11 50,13 13,14 26,16 52,17 21,20 13,21 8,22 1,24 26,25 3,28 2,29 1,32 24,35 2,36 0.115,37 6,38 33,39 49.134,40 56.188,41 32.603,42 30.079,44 6.252}
{0 CHEMBL55131,1 6.304,2 43.1,3 52.9,4 0.979,5 1.12,6 0.654,7 0.6,8 321.5,9 2,10 12,11 51,13 13,14 26,16 53,17 22,20 13,21 9,22 1,24 27,25 2,28 1,29 1,32 24,35 2,36 0.132,37 7,38 33,39 49.916,40 57.105,41 33.358,42 30.585,44 6.276}
{0 CHEMBL55253,1 7.139,2 42,3 50,4 0.989,5 1.123,6 0.669,7 0.618,8 356.93,9 4,10 12,11 50,13 13,14 27,16 52,17 21,18 1,20 13,21 8,22 1,24 25,25 4,26 1,28 2,29 1,32 25,34 1,35 2,36 0.115,37 6,38 34,39 49.458,40 56.132,41 33.461,42 30.907,43 2,44 6.745}
{0 CHEMBL552871,1 6.714,2 41,3 50.8,4 0.995,5 1.124,6 0.643,7 0.603,8 409.57,9 1.6,10 12,11 61,13 13,14 33,16 64,17 25,20 13,21 12,22 1,24 31,25 5,28 1,29 4,32 30,35 6.6,36 0.109,37 7,38 40,39 60.665,40 68.564,41 39.245,42 36.783,44 7.886}
{0 CHEMBL55312,1 6.643,2 45,3 50,4 0.982,5 1.117,6 0.669,7 0.619,8 398.59,9 3.3,10 18,11 60,13 19,14 33,16 63,17 27,20 19,21 8,22 1,24 30,25 3,28 2,29 1,32 30,35 1.7,36 0.111,37 7,38 43,39 58.901,40 67.019,41 40.125,42 37.133,44 7.456}
{0 CHEMBL55323,1 7.067,2 40.4,3 48.1,4 1,5 1.129,6 0.649,7 0.615,8 367.49,9 5.8,10 12,11 52,13 15,14 29,16 54,17 21,20 13,21 8,22 3,24 25,25 6,28 3,29 3,32 27,35 5.8,36 0.13,37 7,38 38,39 52.007,40 58.69,41 33.756,42 32.003,44 7.26}
{0 CHEMBL553263,1 6.559,2 43.1,3 51,4 0.983,5 1.121,6 0.659,7 0.609,8 334.5,9 3.9,10 12,11 51,13 13,14 28,16 54,17 22,20 13,21 9,22 1,24 26,25 3,28 2,29 1,32 25,35 2,36 0.093,37 5,38 35,39 50.134,40 57.188,41 33.603,42 31.079,44 7.009}
{0 CHEMBL55466,1 7.067,2 40.4,3 48.1,4 1,5 1.129,6 0.649,7 0.615,8 367.49,9 5.8,10 12,11 52,13 15,14 29,16 54,17 21,20 13,21 8,22 3,24 25,25 6,28 3,29 3,32 27,35 5.8,36 0.13,37 7,38 38,39 52.007,40 58.69,41 33.756,42 32.003,44 6.638}
{0 CHEMBL554887,1 6.577,2 38.6,3 52.3,4 0.996,5 1.129,6 0.631,7 0.59,8 289.41,9 2.3,10 6,11 44,13 7,14 23,16 46,17 17,20 7,21 10,22 1,24 23,25 4,28 1,29 3,32 21,35 6.8,36 0.087,37 4,38 27,39 43.803,40 49.694,41 27.745,42 25.961,44 5.268}
{0 CHEMBL555107,1 6.864,2 43.6,3 49.1,4 0.992,5 1.119,6 0.659,7 0.618,8 377.52,9 1.8,10 12,11 55,13 14,14 31,16 58,17 24,20 15,21 9,22 2,24 27,25 4,28 1,29 3,32 28,35 5.5,36 0.086,37 5,38 39,39 54.571,40 61.524,41 36.267,42 34.014,44 7.886}
{0 CHEMBL555358,1 6.45,2 42,3 52,4 0.983,5 1.124,6 0.652,7 0.602,8 322.49,9 4,10 12,11 50,13 13,14 26,16 52,17 21,20 13,21 8,22 1,24 26,25 3,28 2,29 1,32 24,35 2,36 0.115,37 6,38 33,39 49.134,40 56.188,41 32.603,42 30.079,44 6.252}
{0 CHEMBL555827,1 6.659,2 42.1,3 50.9,4 0.99,5 1.122,6 0.65,7 0.606,8 379.54,9 1.8,10 12,11 57,13 13,14 31,16 60,17 24,20 13,21 11,22 1,24 29,25 4,28 1,29 3,32 28,35 5.3,36 0.1,37 6,38 38,39 56.454,40 63.939,41 37.029,42 34.541,44 7.699}
{0 CHEMBL557839,1 7.196,2 40.7,3 47.5,4 1.006,5 1.126,6 0.647,7 0.618,8 424.54,9 3.4,10 12,11 59,13 15,14 34,16 62,17 24,20 13,21 11,22 3,24 28,25 7,28 2,29 5,32 31,35 8.5,36 0.113,37 7,38 43,39 59.327,40 66.441,41 38.182,42 36.465,44 8.398}
{0 CHEMBL55968,1 6.602,2 40.8,3 51,4 0.987,5 1.128,6 0.65,7 0.604,8 323.48,9 6.1,10 12,11 49,13 13,14 26,16 51,17 20,20 12,21 8,22 1,24 25,25 4,28 3,29 1,32 24,35 2,36 0.118,37 6,38 33,39 48.352,40 55.272,41 31.847,42 29.574,44 7.409}
{0 CHEMBL56001,1 6.628,2 41.8,3 50.9,4 0.988,5 1.124,6 0.651,7 0.606,8 364.53,9 3.6,10 12,11 55,13 14,14 29,16 57,17 23,20 14,21 9,22 2,24 28,25 4,28 2,29 2,32 27,35 3.6,36 0.123,37 7,38 37,39 54.345,40 61.813,41 35.819,42 33.321,44 7.292}
{0 CHEMBL56079,1 6.602,2 40.8,3 51,4 0.987,5 1.128,6 0.65,7 0.604,8 323.48,9 6.1,10 12,11 49,13 13,14 26,16 51,17 20,20 12,21 8,22 1,24 25,25 4,28 3,29 1,32 24,35 2,36 0.118,37 6,38 33,39 48.352,40 55.272,41 31.847,42 29.574,44 6.097}
{0 CHEMBL56368,1 7.067,2 40.4,3 48.1,4 1,5 1.129,6 0.649,7 0.615,8 367.49,9 5.8,10 12,11 52,13 15,14 29,16 54,17 21,20 13,21 8,22 3,24 25,25 6,28 3,29 3,32 27,35 5.8,36 0.13,37 7,38 38,39 52.007,40 58.69,41 33.756,42 32.003,44 6.056}
{0 CHEMBL56470,1 6.349,2 41.5,3 52.8,4 0.981,5 1.125,6 0.648,7 0.596,8 336.52,9 3.8,10 12,11 53,13 13,14 27,16 55,17 22,20 13,21 9,22 1,24 28,25 3,28 2,29 1,32 25,35 1.9,36 0.109,37 6,38 34,39 52.018,40 59.604,41 34.364,42 31.606,44 6.77}
{0 CHEMBL56586,1 6.74,2 42.3,3 50,4 0.99,5 1.123,6 0.655,7 0.611,8 350.5,9 3.8,10 12,11 52,13 14,14 28,16 54,17 22,20 14,21 8,22 2,24 26,25 4,28 2,29 2,32 26,35 3.8,36 0.13,37 7,38 36,39 51.461,40 58.398,41 34.057,42 31.794,44 6.921}
{0 CHEMBL56706,1 6.81,2 42,3 50,4 0.993,5 1.131,6 0.651,7 0.609,8 340.48,9 4,10 12,11 50,13 13,14 27,16 52,17 21,20 13,21 8,22 1,23 1,24 25,25 4,28 2,29 1,32 25,34 1,35 2,36 0.115,37 6,38 34,39 49.647,40 56.528,41 32.54,42 30.463,43 2,44 7.071}
{0 CHEMBL56818,1 6.79,2 40,3 50,4 0.994,5 1.13,6 0.646,7 0.606,8 339.48,9 6,10 12,11 50,13 14,14 27,16 52,17 20,20 12,21 8,22 2,24 25,25 5,28 3,29 2,32 25,35 4,36 0.115,37 6,38 35,39 49.68,40 56.481,41 32.302,42 30.289,44 6.81}
{0 CHEMBL56960,1 7.01,2 41.7,3 50,4 0.99,5 1.119,6 0.666,7 0.616,8 504.75,9 2.8,10 18,11 72,13 21,14 39,16 75,17 30,20 19,21 11,22 3,24 36,25 6,26 1,28 2,29 3,31 1,32 36,35 4.2,36 0.133,37 10,38 51,39 71.283,40 80.603,41 47.966,42 44.33,44 9.523}
{0 CHEMBL57696,1 6.26,2 41.1,3 53.6,4 0.98,5 1.125,6 0.645,7 0.592,8 350.55,9 3.6,10 12,11 56,13 13,14 28,16 58,17 23,20 13,21 10,22 1,24 30,25 3,28 2,29 1,32 26,35 1.8,36 0.121,37 7,38 35,39 54.901,40 63.019,41 36.126,42 33.133,44 6.886}
{0 CHEMBL59583,1 7.223,2 42.4,3 48.5,4 0.993,5 1.118,6 0.673,7 0.625,8 476.69,9 3,10 18,11 66,13 21,14 37,16 69,17 28,20 19,21 9,22 3,24 32,25 6,26 1,28 2,29 3,31 1,32 34,35 4.5,36 0.13,37 9,38 49,39 65.516,40 73.773,41 44.444,42 41.276,44 7.538}
{0 CHEMBL61274,1 6.206,2 37.3,3 54.9,4 0.987,5 1.134,6 0.624,7 0.575,8 316.49,9 3.9,10 6,11 51,13 7,14 25,16 53,17 19,20 7,21 12,22 1,24 28,25 4,28 2,29 2,32 23,35 3.9,36 0.132,37 7,38 29,39 50.345,40 57.813,41 31.819,42 29.321,44 6.872}
{0 CHEMBL636,1 6.259,2 35,3 55,4 0.992,5 1.139,6 0.613,7 0.569,8 250.38,9 5,10 6,11 40,13 7,14 18,16 40,17 14,20 7,21 7,22 1,24 22,25 4,28 2,29 2,32 18,35 5,36 0.125,37 5,38 22,39 39.694,40 45.567,41 24.534,42 22.74,44 5.608}
{0 CHEMBL64529,1 6.121,2 37,3 55.6,4 0.986,5 1.134,6 0.622,7 0.571,8 330.52,9 3.7,10 6,11 54,13 7,14 26,16 56,17 20,20 7,21 13,22 1,24 30,25 4,28 2,29 2,32 24,35 3.7,36 0.143,37 8,38 30,39 53.229,40 61.228,41 33.58,42 30.848,44 6.799}
{0 CHEMBL703,1 5.809,2 28,3 60,4 0.998,5 1.153,6 0.57,7 0.526,8 290.46,9 4,11 50,13 2,14 19,16 49,17 14,20 2,21 12,22 2,24 30,25 6,28 2,29 4,32 20,35 8,36 0.224,37 11,38 21,39 49.883,40 57.647,41 28.489,42 26.277,44 4.678}
{0 CHEMBL75729,1 6.769,2 40.7,3 50,4 0.992,5 1.128,6 0.649,7 0.608,8 365.52,9 5.6,10 12,11 54,13 13,14 30,16 57,17 22,20 13,21 9,22 1,24 27,25 5,28 3,29 2,32 27,35 3.7,36 0.088,37 5,38 37,39 53.563,40 60.896,41 35.063,42 32.815,44 6.77}
{0 CHEMBL7634,1 6.252,2 36.4,3 54.5,4 0.988,5 1.137,6 0.623,7 0.575,8 206.32,9 6.1,11 33,13 2,14 16,16 34,17 12,19 2,20 1,21 9,22 1,24 18,25 3,28 2,29 1,32 15,33 1,35 3,36 0.059,37 2,38 19,39 32.6,40 37.528,41 20.557,42 18.972,44 5.824}
{0 CHEMBL93241,1 6.559,2 43.1,3 51,4 0.983,5 1.121,6 0.659,7 0.609,8 334.5,9 3.9,10 16,11 51,13 16,14 28,16 54,17 22,20 13,21 9,24 26,25 3,28 2,29 1,32 25,35 2,36 0.111,37 6,38 36,39 50.134,40 57.188,41 33.603,42 31.079,44 6.046}
{0 CHEMBL94,1 6.717,2 36.6,3 51.2,4 0.998,5 1.138,6 0.629,7 0.591,8 275.39,9 7.3,10 6,11 41,13 7,14 22,16 43,17 15,20 7,21 8,22 1,24 21,25 5,28 3,29 2,32 20,35 4.9,36 0.047,37 2,38 26,39 40.912,40 46.651,41 25.779,42 24.235,44 7.398}
{0 CHEMBL95,1 6.838,2 44.8,3 48.3,4 0.983,5 1.12,6 0.675,7 0.628,8 198.29,9 6.9,10 11,11 29,13 11,14 17,16 31,17 13,20 9,21 4,24 14,25 2,28 2,32 15,38 22.5,39 28.505,40 32.488,41 19.58,42 18.204,44 7.095}
