{
  "data_set_description": {
    "collection_date": "November 2013",
    "creator": "Dr Jeremy Besnard, Dr Ivan Olier, Dr Noureddin Sadawi, Dr Larisa Soldatova, Dr Crina Grosan, Prof Ross King, Dr Richard Bickerton, Prof Andrew Hopkins and Dr Willem van Hoorn",
    "default_target_attribute": "pXC50",
    "description": "This dataset contains QSAR data (from ChEMBL version 17) showing activity values (unit is pseudo-pCI50) of several compounds on drug target ChEMBL_ID: CHEMBL1923 (TID: 311), and it has 91 rows and 1189 features (not including molecule IDs and class feature: molecule_id and pXC50). The features represent Molecular Descriptors which were generated from SMILES strings. Missing value imputation was applied to this dataset (By choosing the Median).",
    "description_version": "1",
    "file_id": "3330120",
    "format": "ARFF",
    "id": "27435",
    "licence": "Public",
    "md5_checksum": "2793d21a56adbeed20b9f8ef5cd34c49",
    "minio_url": "https://data.openml.org/datasets/0002/27435/dataset_27435.pq",
    "name": "QSAR-DATASET-FOR-DRUG-TARGET-CHEMBL1923",
    "original_data_url": "https://www.ebi.ac.uk/chembl/target/inspect/CHEMBL1923",
    "parquet_url": "https://data.openml.org/datasets/0002/27435/dataset_27435.pq",
    "processing_date": "2018-10-04 00:22:10",
    "row_id_attribute": "molecule_id",
    "status": "deactivated",
    "tag": [
      "MetaQSAR",
      "study_13"
    ],
    "upload_date": "2016-07-14T21:34:12",
    "url": "https://api.openml.org/data/v1/download/3330120/QSAR-DATASET-FOR-DRUG-TARGET-CHEMBL1923.arff",
    "version": "9",
    "visibility": "public"
  }
}