{
  "data_features": {
    "feature": [
      {
        "data_type": "nominal",
        "index": "0",
        "is_ignore": "false",
        "is_row_identifier": "true",
        "is_target": "false",
        "name": "molecule_id",
        "nominal_value": [
          "CHEMBL103",
          "CHEMBL1036",
          "CHEMBL1094236",
          "CHEMBL1094237",
          "CHEMBL1094860",
          "CHEMBL1094880",
          "CHEMBL1095183",
          "CHEMBL1095184",
          "CHEMBL1095520",
          "CHEMBL1095521",
          "CHEMBL1096473",
          "CHEMBL1096474",
          "CHEMBL1096475",
          "CHEMBL1096675",
          "CHEMBL1163697",
          "CHEMBL1163765",
          "CHEMBL1163832",
          "CHEMBL1163915",
          "CHEMBL1163916",
          "CHEMBL1163919",
          "CHEMBL1163967",
          "CHEMBL1163968",
          "CHEMBL1164041",
          "CHEMBL1164056",
          "CHEMBL1164167",
          "CHEMBL1165436",
          "CHEMBL1165644",
          "CHEMBL1165772",
          "CHEMBL1169728",
          "CHEMBL1169739",
          "CHEMBL1169777",
          "CHEMBL1169778",
          "CHEMBL1169779",
          "CHEMBL1169780",
          "CHEMBL1169895",
          "CHEMBL1169896",
          "CHEMBL1169904",
          "CHEMBL1169950",
          "CHEMBL1169951",
          "CHEMBL1169952",
          "CHEMBL1169953",
          "CHEMBL1169962",
          "CHEMBL1169963",
          "CHEMBL1170085",
          "CHEMBL1170094",
          "CHEMBL1170095",
          "CHEMBL1170096",
          "CHEMBL1170149",
          "CHEMBL1170333",
          "CHEMBL1170334",
          "CHEMBL1170456",
          "CHEMBL1170544",
          "CHEMBL1170545",
          "CHEMBL1170546",
          "CHEMBL1170547",
          "CHEMBL1170683",
          "CHEMBL1170754",
          "CHEMBL1170769",
          "CHEMBL1170773",
          "CHEMBL1170879",
          "CHEMBL1170963",
          "CHEMBL1170964",
          "CHEMBL1170965",
          "CHEMBL1170968",
          "CHEMBL1170969",
          "CHEMBL1170982",
          "CHEMBL1171232",
          "CHEMBL1171249",
          "CHEMBL1171366",
          "CHEMBL1171418",
          "CHEMBL1171419",
          "CHEMBL1171554",
          "CHEMBL1171555",
          "CHEMBL1171630",
          "CHEMBL1171689",
          "CHEMBL1171724",
          "CHEMBL1171725",
          "CHEMBL1171726",
          "CHEMBL1171727",
          "CHEMBL1171736",
          "CHEMBL1171737",
          "CHEMBL1171738",
          "CHEMBL1171781",
          "CHEMBL1171865",
          "CHEMBL1171872",
          "CHEMBL1171905",
          "CHEMBL1171916",
          "CHEMBL1171917",
          "CHEMBL1172059",
          "CHEMBL1172094",
          "CHEMBL1172208",
          "CHEMBL1172209",
          "CHEMBL1172210",
          "CHEMBL1172212",
          "CHEMBL1172213",
          "CHEMBL1172214",
          "CHEMBL1172290",
          "CHEMBL1172291",
          "CHEMBL1172292",
          "CHEMBL1172492",
          "CHEMBL1172685",
          "CHEMBL1172686",
          "CHEMBL1172687",
          "CHEMBL1172688",
          "CHEMBL1172689",
          "CHEMBL1173285",
          "CHEMBL1173287",
          "CHEMBL1173288",
          "CHEMBL1173363",
          "CHEMBL1173366",
          "CHEMBL1173436",
          "CHEMBL1173711",
          "CHEMBL1173778",
          "CHEMBL1188789",
          "CHEMBL1189111",
          "CHEMBL1189234",
          "CHEMBL1189714",
          "CHEMBL1189823",
          "CHEMBL1190213",
          "CHEMBL1190672",
          "CHEMBL1194508",
          "CHEMBL1195399",
          "CHEMBL1204030",
          "CHEMBL1204031",
          "CHEMBL1204032",
          "CHEMBL1204034",
          "CHEMBL1204035",
          "CHEMBL1204037",
          "CHEMBL1204038",
          "CHEMBL1204039",
          "CHEMBL1204040",
          "CHEMBL1204041",
          "CHEMBL1204042",
          "CHEMBL1204043",
          "CHEMBL1204044",
          "CHEMBL1204045",
          "CHEMBL1204046",
          "CHEMBL1204047",
          "CHEMBL1204048",
          "CHEMBL1204049",
          "CHEMBL1204050",
          "CHEMBL1214830",
          "CHEMBL1214831",
          "CHEMBL1214892",
          "CHEMBL1214893",
          "CHEMBL1215856",
          "CHEMBL1215857",
          "CHEMBL12420",
          "CHEMBL128358",
          "CHEMBL1289057",
          "CHEMBL1289058",
          "CHEMBL1289173",
          "CHEMBL1289174",
          "CHEMBL1289287",
          "CHEMBL1289288",
          "CHEMBL128930",
          "CHEMBL1289403",
          "CHEMBL1289626",
          "CHEMBL1289627",
          "CHEMBL1289628",
          "CHEMBL1289731",
          "CHEMBL1289732",
          "CHEMBL1289733",
          "CHEMBL1289836",
          "CHEMBL1289837",
          "CHEMBL1289954",
          "CHEMBL1289955",
          "CHEMBL1290051",
          "CHEMBL1290052",
          "CHEMBL1290159",
          "CHEMBL1290160",
          "CHEMBL1290270",
          "CHEMBL1290386",
          "CHEMBL1290496",
          "CHEMBL1290497",
          "CHEMBL1290606",
          "CHEMBL1290607",
          "CHEMBL1290725",
          "CHEMBL1290726",
          "CHEMBL129530",
          "CHEMBL134607",
          "CHEMBL138286",
          "CHEMBL138809",
          "CHEMBL138900",
          "CHEMBL140287",
          "CHEMBL141209",
          "CHEMBL1469",
          "CHEMBL163876",
          "CHEMBL1645202",
          "CHEMBL1645203",
          "CHEMBL1645204",
          "CHEMBL1645205",
          "CHEMBL1645206",
          "CHEMBL1645207",
          "CHEMBL1645208",
          "CHEMBL1645209",
          "CHEMBL1645210",
          "CHEMBL1645211",
          "CHEMBL1645212",
          "CHEMBL1645213",
          "CHEMBL1645214",
          "CHEMBL1645215",
          "CHEMBL1645216",
          "CHEMBL1645217",
          "CHEMBL1649601",
          "CHEMBL1672030",
          "CHEMBL1672031",
          "CHEMBL1672032",
          "CHEMBL1672033",
          "CHEMBL1672034",
          "CHEMBL1672035",
          "CHEMBL1672036",
          "CHEMBL1672037",
          "CHEMBL1672038",
          "CHEMBL1672039",
          "CHEMBL1672040",
          "CHEMBL1672041",
          "CHEMBL1672042",
          "CHEMBL1682080",
          "CHEMBL1682081",
          "CHEMBL1682082",
          "CHEMBL1682083",
          "CHEMBL1682084",
          "CHEMBL1682085",
          "CHEMBL1682086",
          "CHEMBL1688990",
          "CHEMBL1688991",
          "CHEMBL1688992",
          "CHEMBL1688994",
          "CHEMBL1689002",
          "CHEMBL1689004",
          "CHEMBL1689006",
          "CHEMBL1689009",
          "CHEMBL1689012",
          "CHEMBL1774575",
          "CHEMBL1774576",
          "CHEMBL1774577",
          "CHEMBL1774578",
          "CHEMBL1774579",
          "CHEMBL1774580",
          "CHEMBL1774581",
          "CHEMBL1774582",
          "CHEMBL1779993",
          "CHEMBL1779994",
          "CHEMBL1779995",
          "CHEMBL1779996",
          "CHEMBL1779997",
          "CHEMBL1779998",
          "CHEMBL1779999",
          "CHEMBL1780000",
          "CHEMBL1780001",
          "CHEMBL1780002",
          "CHEMBL1780003",
          "CHEMBL1782985",
          "CHEMBL1782986",
          "CHEMBL1782987",
          "CHEMBL1783426",
          "CHEMBL1783448",
          "CHEMBL1783449",
          "CHEMBL1783450",
          "CHEMBL1783451",
          "CHEMBL1783452",
          "CHEMBL1783453",
          "CHEMBL1783454",
          "CHEMBL1783455",
          "CHEMBL1783456",
          "CHEMBL1783457",
          "CHEMBL1783458",
          "CHEMBL1783459",
          "CHEMBL1783460",
          "CHEMBL1783461",
          "CHEMBL1783462",
          "CHEMBL1783463",
          "CHEMBL1783464",
          "CHEMBL1783465",
          "CHEMBL1813585",
          "CHEMBL1813586",
          "CHEMBL1813587",
          "CHEMBL1813588",
          "CHEMBL1813589",
          "CHEMBL1813590",
          "CHEMBL1813591",
          "CHEMBL1813592",
          "CHEMBL1813593",
          "CHEMBL1813594",
          "CHEMBL1813595",
          "CHEMBL1813596",
          "CHEMBL1813597",
          "CHEMBL1813598",
          "CHEMBL1813599",
          "CHEMBL1822239",
          "CHEMBL1822240",
          "CHEMBL1822386",
          "CHEMBL1822387",
          "CHEMBL1822388",
          "CHEMBL1822389",
          "CHEMBL1822390",
          "CHEMBL1822391",
          "CHEMBL1822392",
          "CHEMBL1822393",
          "CHEMBL1822394",
          "CHEMBL1822395",
          "CHEMBL1822396",
          "CHEMBL1822397",
          "CHEMBL1822398",
          "CHEMBL1822399",
          "CHEMBL1822400",
          "CHEMBL1822401",
          "CHEMBL1822402",
          "CHEMBL1822403",
          "CHEMBL1822404",
          "CHEMBL1822405",
          "CHEMBL1822406",
          "CHEMBL1822407",
          "CHEMBL1822408",
          "CHEMBL1822595",
          "CHEMBL1822596",
          "CHEMBL1822597",
          "CHEMBL1822598",
          "CHEMBL1822599",
          "CHEMBL1822600",
          "CHEMBL1824777",
          "CHEMBL1824778",
          "CHEMBL1824779",
          "CHEMBL1824780",
          "CHEMBL1824781",
          "CHEMBL1824782",
          "CHEMBL1824783",
          "CHEMBL1824784",
          "CHEMBL1824785",
          "CHEMBL1824786",
          "CHEMBL1824787",
          "CHEMBL1824788",
          "CHEMBL1824789",
          "CHEMBL1824790",
          "CHEMBL1828651",
          "CHEMBL1829565",
          "CHEMBL1829566",
          "CHEMBL1829567",
          "CHEMBL1829568",
          "CHEMBL1829569",
          "CHEMBL1829570",
          "CHEMBL1829571",
          "CHEMBL1829572",
          "CHEMBL1829573",
          "CHEMBL1829574",
          "CHEMBL1829575",
          "CHEMBL1829576",
          "CHEMBL1829577",
          "CHEMBL1829578",
          "CHEMBL1829579",
          "CHEMBL1829580",
          "CHEMBL1829581",
          "CHEMBL1829659",
          "CHEMBL1829660",
          "CHEMBL1829661",
          "CHEMBL1829662",
          "CHEMBL1829663",
          "CHEMBL1829664",
          "CHEMBL1829665",
          "CHEMBL1829666",
          "CHEMBL1829667",
          "CHEMBL1829668",
          "CHEMBL1829669",
          "CHEMBL1829670",
          "CHEMBL1829671",
          "CHEMBL1829672",
          "CHEMBL1829673",
          "CHEMBL1829674",
          "CHEMBL1830682",
          "CHEMBL1830683",
          "CHEMBL1830684",
          "CHEMBL1830685",
          "CHEMBL1830686",
          "CHEMBL1830687",
          "CHEMBL1830688",
          "CHEMBL1830689",
          "CHEMBL1830690",
          "CHEMBL1830691",
          "CHEMBL1830692",
          "CHEMBL1877016",
          "CHEMBL190883",
          "CHEMBL1917286",
          "CHEMBL1917694",
          "CHEMBL1917695",
          "CHEMBL1917696",
          "CHEMBL1917697",
          "CHEMBL1917698",
          "CHEMBL1917699",
          "CHEMBL1917700",
          "CHEMBL1917701",
          "CHEMBL1917702",
          "CHEMBL1917703",
          "CHEMBL1917704",
          "CHEMBL1917705",
          "CHEMBL1917706",
          "CHEMBL1917707",
          "CHEMBL1917708",
          "CHEMBL1917709",
          "CHEMBL1917710",
          "CHEMBL1917711",
          "CHEMBL1917712",
          "CHEMBL1917713",
          "CHEMBL1917714",
          "CHEMBL1917715",
          "CHEMBL1917716",
          "CHEMBL1917717",
          "CHEMBL1917718",
          "CHEMBL1917719",
          "CHEMBL1929275",
          "CHEMBL1929276",
          "CHEMBL1929277",
          "CHEMBL1929278",
          "CHEMBL1929279",
          "CHEMBL1929281",
          "CHEMBL1929282",
          "CHEMBL1929283",
          "CHEMBL1929284",
          "CHEMBL1929285",
          "CHEMBL1929286",
          "CHEMBL1929287",
          "CHEMBL1929288",
          "CHEMBL1929289",
          "CHEMBL1929428",
          "CHEMBL1929429",
          "CHEMBL1929430",
          "CHEMBL1939698",
          "CHEMBL1939699",
          "CHEMBL1939700",
          "CHEMBL1939701",
          "CHEMBL1939702",
          "CHEMBL1939703",
          "CHEMBL1939704",
          "CHEMBL1940482",
          "CHEMBL1940484",
          "CHEMBL1940599",
          "CHEMBL2021503",
          "CHEMBL2021504",
          "CHEMBL2021505",
          "CHEMBL2021509",
          "CHEMBL2021510",
          "CHEMBL2034985",
          "CHEMBL2035258",
          "CHEMBL2035273",
          "CHEMBL2035274",
          "CHEMBL2035275",
          "CHEMBL2035276",
          "CHEMBL2035277",
          "CHEMBL2035278",
          "CHEMBL2035279",
          "CHEMBL2035280",
          "CHEMBL2035281",
          "CHEMBL2035282",
          "CHEMBL2035283",
          "CHEMBL2047120",
          "CHEMBL2047121",
          "CHEMBL2047122",
          "CHEMBL2047123",
          "CHEMBL2047124",
          "CHEMBL2047125",
          "CHEMBL2047126",
          "CHEMBL2047127",
          "CHEMBL2047128",
          "CHEMBL2047232",
          "CHEMBL2047233",
          "CHEMBL2047234",
          "CHEMBL2047235",
          "CHEMBL2047236",
          "CHEMBL2047237",
          "CHEMBL2047238",
          "CHEMBL2047239",
          "CHEMBL2047240",
          "CHEMBL2062543",
          "CHEMBL2064180",
          "CHEMBL2064181",
          "CHEMBL2064182",
          "CHEMBL2064183",
          "CHEMBL2064184",
          "CHEMBL2064185",
          "CHEMBL2064186",
          "CHEMBL2064187",
          "CHEMBL2064188",
          "CHEMBL2064189",
          "CHEMBL2064190",
          "CHEMBL2064191",
          "CHEMBL2064192",
          "CHEMBL2064193",
          "CHEMBL2064194",
          "CHEMBL2064195",
          "CHEMBL2064196",
          "CHEMBL2064197",
          "CHEMBL2064198",
          "CHEMBL2064199",
          "CHEMBL2064200",
          "CHEMBL2064201",
          "CHEMBL2064202",
          "CHEMBL2064203",
          "CHEMBL2064204",
          "CHEMBL2064205",
          "CHEMBL2064206",
          "CHEMBL2064207",
          "CHEMBL2069861",
          "CHEMBL2069862",
          "CHEMBL2069863",
          "CHEMBL2069864",
          "CHEMBL2069865",
          "CHEMBL2069962",
          "CHEMBL2069963",
          "CHEMBL2069964",
          "CHEMBL2069965",
          "CHEMBL2069966",
          "CHEMBL20730",
          "CHEMBL2170178",
          "CHEMBL2170179",
          "CHEMBL2170180",
          "CHEMBL2170301",
          "CHEMBL2170302",
          "CHEMBL2170303",
          "CHEMBL2170304",
          "CHEMBL2170305",
          "CHEMBL2170306",
          "CHEMBL2170307",
          "CHEMBL2170308",
          "CHEMBL2170309",
          "CHEMBL2170310",
          "CHEMBL2170311",
          "CHEMBL2170312",
          "CHEMBL2170313",
          "CHEMBL2170314",
          "CHEMBL2170315",
          "CHEMBL2170496",
          "CHEMBL2170497",
          "CHEMBL2170498",
          "CHEMBL2170499",
          "CHEMBL2170500",
          "CHEMBL2170501",
          "CHEMBL2170502",
          "CHEMBL2170652",
          "CHEMBL2170653",
          "CHEMBL2170654",
          "CHEMBL2170655",
          "CHEMBL2170656",
          "CHEMBL2170657",
          "CHEMBL2170658",
          "CHEMBL2170659",
          "CHEMBL2170660",
          "CHEMBL2170661",
          "CHEMBL2170662",
          "CHEMBL2170663",
          "CHEMBL2170664",
          "CHEMBL2170665",
          "CHEMBL2170666",
          "CHEMBL2170667",
          "CHEMBL2170668",
          "CHEMBL2170669",
          "CHEMBL2170670",
          "CHEMBL2170671",
          "CHEMBL2170672",
          "CHEMBL2170673",
          "CHEMBL2170674",
          "CHEMBL2170675",
          "CHEMBL2170676",
          "CHEMBL2170677",
          "CHEMBL2170678",
          "CHEMBL2170679",
          "CHEMBL2170680",
          "CHEMBL2170681",
          "CHEMBL2170682",
          "CHEMBL2170683",
          "CHEMBL2170684",
          "CHEMBL2170685",
          "CHEMBL2205819",
          "CHEMBL2205821",
          "CHEMBL2205825",
          "CHEMBL2205835",
          "CHEMBL221347",
          "CHEMBL221348",
          "CHEMBL221370",
          "CHEMBL222235",
          "CHEMBL222236",
          "CHEMBL222287",
          "CHEMBL222301",
          "CHEMBL222307",
          "CHEMBL222394",
          "CHEMBL222444",
          "CHEMBL222445",
          "CHEMBL222736",
          "CHEMBL223337",
          "CHEMBL223969",
          "CHEMBL224021",
          "CHEMBL224085",
          "CHEMBL224095",
          "CHEMBL224099",
          "CHEMBL224138",
          "CHEMBL224151",
          "CHEMBL224588",
          "CHEMBL224855",
          "CHEMBL225516",
          "CHEMBL225653",
          "CHEMBL226538",
          "CHEMBL226539",
          "CHEMBL226540",
          "CHEMBL227071",
          "CHEMBL229857",
          "CHEMBL230692",
          "CHEMBL230693",
          "CHEMBL230903",
          "CHEMBL230904",
          "CHEMBL231119",
          "CHEMBL2311194",
          "CHEMBL231120",
          "CHEMBL2324611",
          "CHEMBL2324613",
          "CHEMBL2324616",
          "CHEMBL2324617",
          "CHEMBL2324618",
          "CHEMBL2324619",
          "CHEMBL2324620",
          "CHEMBL2324621",
          "CHEMBL2332492",
          "CHEMBL2332493",
          "CHEMBL2332494",
          "CHEMBL2332495",
          "CHEMBL2332496",
          "CHEMBL2332497",
          "CHEMBL2332498",
          "CHEMBL2332499",
          "CHEMBL2332500",
          "CHEMBL2332501",
          "CHEMBL2332502",
          "CHEMBL2332503",
          "CHEMBL2332504",
          "CHEMBL2346692",
          "CHEMBL2349066",
          "CHEMBL2349067",
          "CHEMBL2349068",
          "CHEMBL2349069",
          "CHEMBL2349070",
          "CHEMBL2349071",
          "CHEMBL2349072",
          "CHEMBL2349073",
          "CHEMBL2349441",
          "CHEMBL2349442",
          "CHEMBL2349443",
          "CHEMBL2349444",
          "CHEMBL2349445",
          "CHEMBL2349446",
          "CHEMBL2349447",
          "CHEMBL2349448",
          "CHEMBL2349449",
          "CHEMBL2349450",
          "CHEMBL2349451",
          "CHEMBL2349452",
          "CHEMBL2349453",
          "CHEMBL2349454",
          "CHEMBL2349455",
          "CHEMBL2349456",
          "CHEMBL2349457",
          "CHEMBL2349458",
          "CHEMBL2349459",
          "CHEMBL2349460",
          "CHEMBL2349461",
          "CHEMBL2349554",
          "CHEMBL2349555",
          "CHEMBL236242",
          "CHEMBL236866",
          "CHEMBL236867",
          "CHEMBL238176",
          "CHEMBL238384",
          "CHEMBL242077",
          "CHEMBL242297",
          "CHEMBL244449",
          "CHEMBL244450",
          "CHEMBL244650",
          "CHEMBL244652",
          "CHEMBL246662",
          "CHEMBL246664",
          "CHEMBL259732",
          "CHEMBL259941",
          "CHEMBL26479",
          "CHEMBL269870",
          "CHEMBL270474",
          "CHEMBL271395",
          "CHEMBL271396",
          "CHEMBL272050",
          "CHEMBL272650",
          "CHEMBL272819",
          "CHEMBL273041",
          "CHEMBL275707",
          "CHEMBL282433",
          "CHEMBL291439",
          "CHEMBL305187",
          "CHEMBL314424",
          "CHEMBL343793",
          "CHEMBL348313",
          "CHEMBL357179",
          "CHEMBL358579",
          "CHEMBL365754",
          "CHEMBL372700",
          "CHEMBL373686",
          "CHEMBL374686",
          "CHEMBL374814",
          "CHEMBL375499",
          "CHEMBL376808",
          "CHEMBL385795",
          "CHEMBL386002",
          "CHEMBL386931",
          "CHEMBL387519",
          "CHEMBL387647",
          "CHEMBL387741",
          "CHEMBL387955",
          "CHEMBL389261",
          "CHEMBL390022",
          "CHEMBL391007",
          "CHEMBL391153",
          "CHEMBL393734",
          "CHEMBL393735",
          "CHEMBL394280",
          "CHEMBL394352",
          "CHEMBL395005",
          "CHEMBL395027",
          "CHEMBL395069",
          "CHEMBL395304",
          "CHEMBL396978",
          "CHEMBL397705",
          "CHEMBL406018",
          "CHEMBL408821",
          "CHEMBL408867",
          "CHEMBL410832",
          "CHEMBL414138",
          "CHEMBL415546",
          "CHEMBL419822",
          "CHEMBL426724",
          "CHEMBL427246",
          "CHEMBL429103",
          "CHEMBL434385",
          "CHEMBL441909",
          "CHEMBL443649",
          "CHEMBL444690",
          "CHEMBL445102",
          "CHEMBL447904",
          "CHEMBL448782",
          "CHEMBL449942",
          "CHEMBL454978",
          "CHEMBL456435",
          "CHEMBL456437",
          "CHEMBL456451",
          "CHEMBL456452",
          "CHEMBL457508",
          "CHEMBL457720",
          "CHEMBL457721",
          "CHEMBL457722",
          "CHEMBL457731",
          "CHEMBL457898",
          "CHEMBL458155",
          "CHEMBL458361",
          "CHEMBL458553",
          "CHEMBL458608",
          "CHEMBL458802",
          "CHEMBL458970",
          "CHEMBL459144",
          "CHEMBL459145",
          "CHEMBL461956",
          "CHEMBL466096",
          "CHEMBL466289",
          "CHEMBL468929",
          "CHEMBL468930",
          "CHEMBL471013",
          "CHEMBL471014",
          "CHEMBL472049",
          "CHEMBL473129",
          "CHEMBL473546",
          "CHEMBL473547",
          "CHEMBL477036",
          "CHEMBL477037",
          "CHEMBL479259",
          "CHEMBL479260",
          "CHEMBL479453",
          "CHEMBL479648",
          "CHEMBL480046",
          "CHEMBL480047",
          "CHEMBL480252",
          "CHEMBL480433",
          "CHEMBL480625",
          "CHEMBL481418",
          "CHEMBL481425",
          "CHEMBL485729",
          "CHEMBL485929",
          "CHEMBL486136",
          "CHEMBL486142",
          "CHEMBL486759",
          "CHEMBL486761",
          "CHEMBL487088",
          "CHEMBL487359",
          "CHEMBL487360",
          "CHEMBL489601",
          "CHEMBL490424",
          "CHEMBL492247",
          "CHEMBL492249",
          "CHEMBL492446",
          "CHEMBL492565",
          "CHEMBL492566",
          "CHEMBL492576",
          "CHEMBL492777",
          "CHEMBL493259",
          "CHEMBL493260",
          "CHEMBL494192",
          "CHEMBL494782",
          "CHEMBL494868",
          "CHEMBL494869",
          "CHEMBL494870",
          "CHEMBL495071",
          "CHEMBL495167",
          "CHEMBL495168",
          "CHEMBL495309",
          "CHEMBL495310",
          "CHEMBL495311",
          "CHEMBL495519",
          "CHEMBL495520",
          "CHEMBL495726",
          "CHEMBL496753",
          "CHEMBL497586",
          "CHEMBL498600",
          "CHEMBL50079",
          "CHEMBL502487",
          "CHEMBL502790",
          "CHEMBL505059",
          "CHEMBL507255",
          "CHEMBL507875",
          "CHEMBL507980",
          "CHEMBL508251",
          "CHEMBL50880",
          "CHEMBL511507",
          "CHEMBL511587",
          "CHEMBL511680",
          "CHEMBL511857",
          "CHEMBL512850",
          "CHEMBL513224",
          "CHEMBL513470",
          "CHEMBL513736",
          "CHEMBL513936",
          "CHEMBL514129",
          "CHEMBL514130",
          "CHEMBL515840",
          "CHEMBL516442",
          "CHEMBL516814",
          "CHEMBL517541",
          "CHEMBL518434",
          "CHEMBL518480",
          "CHEMBL519216",
          "CHEMBL520707",
          "CHEMBL520708",
          "CHEMBL521031",
          "CHEMBL521350",
          "CHEMBL521582",
          "CHEMBL521657",
          "CHEMBL521691",
          "CHEMBL521812",
          "CHEMBL522703",
          "CHEMBL523038",
          "CHEMBL523045",
          "CHEMBL523331",
          "CHEMBL523495",
          "CHEMBL52440",
          "CHEMBL525082",
          "CHEMBL53325",
          "CHEMBL534695",
          "CHEMBL535363",
          "CHEMBL535366",
          "CHEMBL535410",
          "CHEMBL535634",
          "CHEMBL535636",
          "CHEMBL535856",
          "CHEMBL535857",
          "CHEMBL536305",
          "CHEMBL536483",
          "CHEMBL536759",
          "CHEMBL537177",
          "CHEMBL537399",
          "CHEMBL537696",
          "CHEMBL537842",
          "CHEMBL538089",
          "CHEMBL538091",
          "CHEMBL538566",
          "CHEMBL538772",
          "CHEMBL539333",
          "CHEMBL539545",
          "CHEMBL54",
          "CHEMBL540361",
          "CHEMBL540563",
          "CHEMBL540573",
          "CHEMBL540818",
          "CHEMBL541390",
          "CHEMBL542701",
          "CHEMBL544343",
          "CHEMBL545278",
          "CHEMBL545508",
          "CHEMBL552542",
          "CHEMBL553091",
          "CHEMBL554450",
          "CHEMBL554663",
          "CHEMBL555969",
          "CHEMBL558572",
          "CHEMBL558980",
          "CHEMBL559178",
          "CHEMBL559377",
          "CHEMBL568255",
          "CHEMBL568983",
          "CHEMBL569109",
          "CHEMBL569110",
          "CHEMBL569123",
          "CHEMBL569344",
          "CHEMBL569823",
          "CHEMBL570039",
          "CHEMBL570040",
          "CHEMBL570269",
          "CHEMBL570272",
          "CHEMBL570925",
          "CHEMBL571152",
          "CHEMBL572254",
          "CHEMBL573163",
          "CHEMBL573234",
          "CHEMBL573248",
          "CHEMBL573461",
          "CHEMBL573695",
          "CHEMBL573703",
          "CHEMBL573704",
          "CHEMBL573932",
          "CHEMBL574124",
          "CHEMBL574155",
          "CHEMBL574165",
          "CHEMBL574182",
          "CHEMBL574235",
          "CHEMBL574598",
          "CHEMBL574821",
          "CHEMBL575127",
          "CHEMBL575238",
          "CHEMBL575239",
          "CHEMBL575253",
          "CHEMBL575262",
          "CHEMBL575994",
          "CHEMBL576193",
          "CHEMBL576497",
          "CHEMBL576879",
          "CHEMBL576904",
          "CHEMBL577956",
          "CHEMBL578041",
          "CHEMBL582865",
          "CHEMBL582875",
          "CHEMBL582996",
          "CHEMBL583002",
          "CHEMBL583266",
          "CHEMBL583580",
          "CHEMBL583945",
          "CHEMBL583994",
          "CHEMBL584199",
          "CHEMBL584767",
          "CHEMBL602850",
          "CHEMBL60542",
          "CHEMBL608560",
          "CHEMBL60859",
          "CHEMBL62023",
          "CHEMBL73854",
          "CHEMBL75228"
        ],
        "number_of_missing_values": "0"
      },
      {
        "data_type": "numeric",
        "index": "1",
        "is_ignore": "false",
        "is_row_identifier": "false",
        "is_target": "false",
        "name": "AMW",
        "number_of_missing_values": "0"
      },
      {
        "data_type": "numeric",
        "index": "2",
        "is_ignore": "false",
        "is_row_identifier": "false",
        "is_target": "false",
        "name": "C.",
        "number_of_missing_values": "0"
      },
      {
        "data_type": "numeric",
        "index": "3",
        "is_ignore": "false",
        "is_row_identifier": "false",
        "is_target": "false",
        "name": "H.",
        "number_of_missing_values": "0"
      },
      {
        "data_type": "numeric",
        "index": "4",
        "is_ignore": "false",
        "is_row_identifier": "false",
        "is_target": "false",
        "name": "Me",
        "number_of_missing_values": "0"
      },
      {
        "data_type": "numeric",
        "index": "5",
        "is_ignore": "false",
        "is_row_identifier": "false",
        "is_target": "false",
        "name": "Mi",
        "number_of_missing_values": "0"
      },
      {
        "data_type": "numeric",
        "index": "6",
        "is_ignore": "false",
        "is_row_identifier": "false",
        "is_target": "false",
        "name": "Mp",
        "number_of_missing_values": "0"
      },
      {
        "data_type": "numeric",
        "index": "7",
        "is_ignore": "false",
        "is_row_identifier": "false",
        "is_target": "false",
        "name": "Mv",
        "number_of_missing_values": "0"
      },
      {
        "data_type": "numeric",
        "index": "8",
        "is_ignore": "false",
        "is_row_identifier": "false",
        "is_target": "false",
        "name": "MW",
        "number_of_missing_values": "0"
      },
      {
        "data_type": "numeric",
        "index": "9",
        "is_ignore": "false",
        "is_row_identifier": "false",
        "is_target": "false",
        "name": "N.",
        "number_of_missing_values": "0"
      },
      {
        "data_type": "numeric",
        "index": "10",
        "is_ignore": "false",
        "is_row_identifier": "false",
        "is_target": "false",
        "name": "nAB",
        "number_of_missing_values": "0"
      },
      {
        "data_type": "numeric",
        "index": "11",
        "is_ignore": "false",
        "is_row_identifier": "false",
        "is_target": "false",
        "name": "nAT",
        "number_of_missing_values": "0"
      },
      {
        "data_type": "numeric",
        "index": "12",
        "is_ignore": "false",
        "is_row_identifier": "false",
        "is_target": "false",
        "name": "nB",
        "number_of_missing_values": "0"
      },
      {
        "data_type": "numeric",
        "index": "13",
        "is_ignore": "false",
        "is_row_identifier": "false",
        "is_target": "false",
        "name": "nBM",
        "number_of_missing_values": "0"
      },
      {
        "data_type": "numeric",
        "index": "14",
        "is_ignore": "false",
        "is_row_identifier": "false",
        "is_target": "false",
        "name": "nBO",
        "number_of_missing_values": "0"
      },
      {
        "data_type": "numeric",
        "index": "15",
        "is_ignore": "false",
        "is_row_identifier": "false",
        "is_target": "false",
        "name": "nBR",
        "number_of_missing_values": "0"
      },
      {
        "data_type": "numeric",
        "index": "16",
        "is_ignore": "false",
        "is_row_identifier": "false",
        "is_target": "false",
        "name": "nBT",
        "number_of_missing_values": "0"
      },
      {
        "data_type": "numeric",
        "index": "17",
        "is_ignore": "false",
        "is_row_identifier": "false",
        "is_target": "false",
        "name": "nC",
        "number_of_missing_values": "0"
      },
      {
        "data_type": "numeric",
        "index": "18",
        "is_ignore": "false",
        "is_row_identifier": "false",
        "is_target": "false",
        "name": "nCL",
        "number_of_missing_values": "0"
      },
      {
        "data_type": "numeric",
        "index": "19",
        "is_ignore": "false",
        "is_row_identifier": "false",
        "is_target": "false",
        "name": "nCsp",
        "number_of_missing_values": "0"
      },
      {
        "data_type": "numeric",
        "index": "20",
        "is_ignore": "false",
        "is_row_identifier": "false",
        "is_target": "false",
        "name": "nCsp2",
        "number_of_missing_values": "0"
      },
      {
        "data_type": "numeric",
        "index": "21",
        "is_ignore": "false",
        "is_row_identifier": "false",
        "is_target": "false",
        "name": "nCsp3",
        "number_of_missing_values": "0"
      },
      {
        "data_type": "numeric",
        "index": "22",
        "is_ignore": "false",
        "is_row_identifier": "false",
        "is_target": "false",
        "name": "nDB",
        "number_of_missing_values": "0"
      },
      {
        "data_type": "numeric",
        "index": "23",
        "is_ignore": "false",
        "is_row_identifier": "false",
        "is_target": "false",
        "name": "nF",
        "number_of_missing_values": "0"
      },
      {
        "data_type": "numeric",
        "index": "24",
        "is_ignore": "false",
        "is_row_identifier": "false",
        "is_target": "false",
        "name": "nH",
        "number_of_missing_values": "0"
      },
      {
        "data_type": "numeric",
        "index": "25",
        "is_ignore": "false",
        "is_row_identifier": "false",
        "is_target": "false",
        "name": "nHet",
        "number_of_missing_values": "0"
      },
      {
        "data_type": "numeric",
        "index": "26",
        "is_ignore": "false",
        "is_row_identifier": "false",
        "is_target": "false",
        "name": "nHM",
        "number_of_missing_values": "0"
      },
      {
        "data_type": "numeric",
        "index": "27",
        "is_ignore": "false",
        "is_row_identifier": "false",
        "is_target": "false",
        "name": "nI",
        "number_of_missing_values": "0"
      },
      {
        "data_type": "numeric",
        "index": "28",
        "is_ignore": "false",
        "is_row_identifier": "false",
        "is_target": "false",
        "name": "nN",
        "number_of_missing_values": "0"
      },
      {
        "data_type": "numeric",
        "index": "29",
        "is_ignore": "false",
        "is_row_identifier": "false",
        "is_target": "false",
        "name": "nO",
        "number_of_missing_values": "0"
      },
      {
        "data_type": "numeric",
        "index": "30",
        "is_ignore": "false",
        "is_row_identifier": "false",
        "is_target": "false",
        "name": "nP",
        "number_of_missing_values": "0"
      },
      {
        "data_type": "numeric",
        "index": "31",
        "is_ignore": "false",
        "is_row_identifier": "false",
        "is_target": "false",
        "name": "nS",
        "number_of_missing_values": "0"
      },
      {
        "data_type": "numeric",
        "index": "32",
        "is_ignore": "false",
        "is_row_identifier": "false",
        "is_target": "false",
        "name": "nSK",
        "number_of_missing_values": "0"
      },
      {
        "data_type": "numeric",
        "index": "33",
        "is_ignore": "false",
        "is_row_identifier": "false",
        "is_target": "false",
        "name": "nTB",
        "number_of_missing_values": "0"
      },
      {
        "data_type": "numeric",
        "index": "34",
        "is_ignore": "false",
        "is_row_identifier": "false",
        "is_target": "false",
        "name": "nX",
        "number_of_missing_values": "0"
      },
      {
        "data_type": "numeric",
        "index": "35",
        "is_ignore": "false",
        "is_row_identifier": "false",
        "is_target": "false",
        "name": "O.",
        "number_of_missing_values": "0"
      },
      {
        "data_type": "numeric",
        "index": "36",
        "is_ignore": "false",
        "is_row_identifier": "false",
        "is_target": "false",
        "name": "RBF",
        "number_of_missing_values": "0"
      },
      {
        "data_type": "numeric",
        "index": "37",
        "is_ignore": "false",
        "is_row_identifier": "false",
        "is_target": "false",
        "name": "RBN",
        "number_of_missing_values": "0"
      },
      {
        "data_type": "numeric",
        "index": "38",
        "is_ignore": "false",
        "is_row_identifier": "false",
        "is_target": "false",
        "name": "SCBO",
        "number_of_missing_values": "0"
      },
      {
        "data_type": "numeric",
        "index": "39",
        "is_ignore": "false",
        "is_row_identifier": "false",
        "is_target": "false",
        "name": "Se",
        "number_of_missing_values": "0"
      },
      {
        "data_type": "numeric",
        "index": "40",
        "is_ignore": "false",
        "is_row_identifier": "false",
        "is_target": "false",
        "name": "Si",
        "number_of_missing_values": "0"
      },
      {
        "data_type": "numeric",
        "index": "41",
        "is_ignore": "false",
        "is_row_identifier": "false",
        "is_target": "false",
        "name": "Sp",
        "number_of_missing_values": "0"
      },
      {
        "data_type": "numeric",
        "index": "42",
        "is_ignore": "false",
        "is_row_identifier": "false",
        "is_target": "false",
        "name": "Sv",
        "number_of_missing_values": "0"
      },
      {
        "data_type": "numeric",
        "index": "43",
        "is_ignore": "false",
        "is_row_identifier": "false",
        "is_target": "false",
        "name": "X.",
        "number_of_missing_values": "0"
      },
      {
        "data_type": "numeric",
        "index": "44",
        "is_ignore": "false",
        "is_row_identifier": "false",
        "is_target": "true",
        "name": "pXC50",
        "number_of_missing_values": "0"
      }
    ]
  }
}