"molecule_id","SpMin3_Bh.i.","SpMin4_Bh.e.","SpMin4_Bh.i.","TIC3","TIC4","TIC5","SpMax8_Bh.i.","ATS2i","ATS4i","ATSC2m","ATSC8v","Eig08_AEA.ri.","Eig08_EA","Eig08_EA.ed.","Eig08_EA.ri.","MPC07","MPC08","MPC09","SM02_AEA.dm.","SM03_AEA.ri.","SpMax6_Bh.i.","SpMax6_Bh.p.","SpMax6_Bh.v.","SpMin4_Bh.p.","SpMin4_Bh.s.","SpMin4_Bh.v.","SpMin6_Bh.v.","SpMin6_Bh.i.","SpMin6_Bh.p.","SpMax8_Bh.p.","ATS3p","ATS4e","ATS5e","ATS5i","ATSC1v","ATSC2p","ATSC2v","ATSC3p","ATSC3v","ATSC4m","ATSC4p","ATSC4v","ATSC5v","Eta_L","nCs","PW5","SpDiam_AEA.bo.","SpMax1_Bh.v.","SpMax4_Bh.i.","SpMin1_Bh.s.","SpMin2_Bh.s.","SpMin6_Bh.s.","X3v","X4v","X5v","CATS2D_02_LL","CATS2D_03_LL","SpMax2_Bh.v.","SpMin1_Bh.e.","SpMin1_Bh.i.","SpMin1_Bh.m.","SpMin1_Bh.v.","SssCH2","ATS5p","ATS6p","ATSC7p","ATSC7v","ON1V","SpMin3_Bh.e.","SpMin7_Bh.m.","SpMin8_Bh.e.","SpMin8_Bh.m.","SpMin8_Bh.p.","SpMin8_Bh.v.","X3A","Mv","SpMin3_Bh.m.","SpMin3_Bh.v.","X2A","ATS7p","ATSC6v","SpDiam_AEA.ed.","ATS1e","ATS1i","ATS1p","ATS1v","ATS2e","ATS2p","ATS2v","ATS3v","ATS4v","ATS7i","ATS7v","ATS8i","ATSC1p","CIC0","Eig01_EA.ri.","Eig13_AEA.ri.","ISIZ","nAT","nBT","nC","nCIC","nCIR","nH","ON0V","piID","Psi_i_1","P_VSA_e_1","P_VSA_m_1","P_VSA_s_2","P_VSA_v_1","Rperim","Se","Si","SM02_EA.ri.","SM06_EA.ri.","Sp","SpDiam_EA.ri.","SpMax6_Bh.e.","SpMax7_Bh.i.","SpMax8_Bh.e.","SpMax8_Bh.v.","pXC50"
{1 1.746,2 1.672,3 1.611,4 324.97,5 343.99,6 351.99,7 3.335,8 5.12,9 5.583,10 31.183,11 20.636,12 2.67,13 1.674,14 3.516,15 1.666,16 4.663,17 4.654,18 4.663,19 1.674,20 3.516,21 3.575,22 3.411,23 3.398,24 1.83,25 1.214,26 1.863,27 1.705,28 1.479,29 1.677,30 3.061,31 4.495,32 5.322,33 5.393,34 5.678,35 10.498,36 12.107,37 18.019,38 15.415,39 23.404,40 46.452,41 18.072,42 26.783,43 28.281,44 9.442,45 8,46 0.106,47 5.602,48 4.066,49 3.717,50 1.443,51 1.375,52 0.861,53 7.426,54 5.545,55 3.919,56 18,57 11,58 4.028,59 2.08,60 2.051,61 2.165,62 2.186,63 12.476,64 4.544,65 4.432,66 16.298,67 24.105,68 5,69 1.806,70 1.69,71 1.219,72 1.502,73 1.47,74 1.478,75 0.18,76 0.589,77 2.046,78 1.99,79 0.287,80 4.272,81 28.089,82 6.712,83 4.351,84 4.5,85 3.905,86 3.836,87 4.911,88 4.31,89 4.205,90 4.366,91 4.392,92 5.548,93 4.028,94 5.384,95 7.111,96 4.974,97 3.085,98 2,99 459.5,100 74,101 77,102 30,103 4,104 6,105 40,106 13.5,107 12.255,108 20.997,109 423.76,110 423.76,111 423.76,112 423.76,113 20,114 72.312,115 83.467,116 4.564,117 7.898,118 47.728,119 5.085,120 3.517,121 3.469,122 3.248,123 3.063,124 5.793}
{0 CHEMBL1909928,1 1.637,2 1.646,3 1.585,4 291.899,5 291.899,6 291.899,7 3.142,8 5.029,9 5.49,10 28.243,11 22.374,12 2.618,13 1.646,14 4.455,15 1.597,16 4.86,17 4.949,18 5.081,19 1.646,20 4.455,21 3.528,22 3.316,23 3.307,24 1.826,25 1.065,26 1.85,27 1.674,28 1.396,29 1.647,30 2.962,31 4.496,32 5.256,33 5.373,34 5.624,35 9.777,36 11.358,37 16.593,38 15.389,39 22.212,40 43.212,41 18.297,42 26.402,43 29,44 8.35,45 3,46 0.12,47 5.557,48 4.101,49 3.717,50 1.445,51 1.384,52 0.788,53 6.937,54 5.226,55 4.01,56 29,57 28,58 4.042,59 2.112,60 2.088,61 2.198,62 2.202,63 3.3,64 4.638,65 4.596,66 20.764,67 30.139,68 4.583,69 1.694,70 1.674,71 1.1,72 1.417,73 1.285,74 1.333,75 0.169,76 0.597,77 1.924,78 1.881,79 0.28,80 4.427,81 30.607,82 6.48,83 4.247,84 4.385,85 3.838,86 3.762,87 4.817,88 4.262,89 4.163,90 4.371,91 4.444,92 5.755,93 4.164,94 5.511,95 6.786,96 4.91,97 3.215,98 1.771,99 406.428,100 67,101 70,102 29,103 4,104 6,105 36,106 14,107 12.725,108 19.371,109 423.76,110 423.76,111 423.76,112 423.76,113 20,114 65.225,115 75.055,116 4.559,117 8.115,118 43.955,119 5.215,120 3.457,121 3.479,122 3.073,123 2.945,124 6.077}
{0 CHEMBL1909929,1 1.657,2 1.651,3 1.59,4 306.52,5 306.52,6 306.52,7 3.228,8 5.076,9 5.537,10 29.638,11 24.359,12 2.635,13 1.665,14 4.479,15 1.611,16 4.828,17 4.875,18 4.977,19 1.665,20 4.479,21 3.532,22 3.328,23 3.318,24 1.83,25 1.078,26 1.853,27 1.678,28 1.407,29 1.65,30 3.039,31 4.53,32 5.298,33 5.411,34 5.665,35 10.299,36 11.961,37 17.487,38 16.216,39 23.432,40 45.104,41 19.099,42 27.588,43 30.154,44 8.85,45 4,46 0.12,47 5.578,48 4.098,49 3.722,50 1.447,51 1.394,52 0.832,53 7.187,54 5.387,55 4.146,56 30,57 29,58 4.047,59 2.108,60 2.084,61 2.195,62 2.198,63 4.616,64 4.668,65 4.626,66 22.182,67 31.866,68 4.833,69 1.714,70 1.689,71 1.186,72 1.494,73 1.37,74 1.417,75 0.171,76 0.593,77 1.947,78 1.897,79 0.281,80 4.471,81 31.446,82 6.612,83 4.287,84 4.426,85 3.876,86 3.797,87 4.861,88 4.299,89 4.195,90 4.4,91 4.471,92 5.8,93 4.183,94 5.597,95 7.139,96 4.98,97 3.212,98 1.85,99 429.05,100 70,101 73,102 30,103 4,104 6,105 38,106 14.5,107 12.729,108 20.038,109 447.302,110 447.302,111 447.302,112 447.302,113 20,114 68.108,115 78.47,116 4.58,117 8.121,118 45.717,119 5.212,120 3.463,121 3.507,122 3.156,123 3.02,124 6.67}
{0 CHEMBL1909930,1 1.679,2 1.656,3 1.596,4 327.328,5 327.328,6 327.328,7 3.34,8 5.12,9 5.582,10 31.02,11 26.087,12 2.65,13 1.682,14 4.492,15 1.624,16 4.828,17 4.844,18 4.905,19 1.682,20 4.492,21 3.538,22 3.344,23 3.331,24 1.833,25 1.097,26 1.857,27 1.685,28 1.422,29 1.656,30 3.123,31 4.563,32 5.339,33 5.447,34 5.705,35 10.819,36 12.561,37 18.374,38 17.032,39 24.631,40 46.961,41 19.891,42 28.755,43 31.292,44 9.35,45 5,46 0.12,47 5.595,48 4.096,49 3.726,50 1.45,51 1.402,52 0.912,53 7.437,54 5.564,55 4.26,56 31,57 30,58 4.05,59 2.105,60 2.081,61 2.193,62 2.195,63 5.975,64 4.697,65 4.656,66 22.568,67 32.556,68 5.083,69 1.737,70 1.694,71 1.288,72 1.599,73 1.486,74 1.53,75 0.172,76 0.59,77 1.973,78 1.918,79 0.283,80 4.506,81 32.529,82 6.706,83 4.326,84 4.466,85 3.912,86 3.83,87 4.904,88 4.335,89 4.227,90 4.428,91 4.498,92 5.831,93 4.217,94 5.648,95 7.492,96 5.047,97 3.211,98 1.907,99 451.857,100 73,101 76,102 31,103 4,104 6,105 40,106 15,107 12.732,108 20.704,109 470.844,110 470.844,111 470.844,112 470.844,113 20,114 70.992,115 81.885,116 4.6,117 8.127,118 47.478,119 5.211,120 3.471,121 3.518,122 3.261,123 3.103,124 6.24}
{0 CHEMBL1909931,1 1.88,2 1.655,3 1.594,4 334.215,5 340.97,6 340.97,7 3.297,8 5.107,9 5.594,10 30.281,11 29.341,12 2.952,13 1.979,14 5.766,15 1.92,16 5.176,17 5.288,18 5.425,19 1.979,20 5.766,21 3.535,22 3.342,23 3.33,24 1.831,25 1.081,26 1.855,27 1.68,28 1.418,29 1.653,30 3.124,31 4.628,32 5.362,33 5.449,34 5.69,35 10.508,36 12.464,37 17.946,38 16.821,39 24.026,40 47.506,41 20.635,42 29.471,43 31.158,44 8.835,45 2,46 0.122,47 5.486,48 4.111,49 3.724,50 1.419,51 1.395,52 0.842,53 7.836,54 5.853,55 4.517,56 38,57 35,58 4.049,59 2.115,60 2.092,61 2.197,62 2.2,63 1.842,64 4.769,65 4.781,66 24.542,67 35.148,68 4.889,69 1.905,70 1.699,71 1.257,72 1.522,73 1.418,74 1.457,75 0.169,76 0.615,77 2.025,78 1.993,79 0.279,80 4.7,81 32.998,82 6.504,83 4.353,84 4.485,85 3.974,86 3.903,87 4.908,88 4.399,89 4.307,90 4.509,91 4.574,92 5.829,93 4.484,94 5.64,95 7.384,96 5.059,97 3.22,98 2.213,99 459.5,100 74,101 78,102 34,103 5,104 7,105 38,106 15.333,107 14.71,108 22.494,109 447.302,110 447.302,111 447.302,112 447.302,113 26,114 72.108,115 82.47,116 4.732,117 8.266,118 49.717,119 5.22,120 3.468,121 3.527,122 3.234,123 3.108,124 5.527}
{0 CHEMBL1909932,1 1.88,2 1.656,3 1.596,4 323.46,5 328.97,6 328.97,7 3.318,8 5.107,9 5.594,10 30.281,11 26.768,12 3.022,13 2.051,14 6.11,15 1.985,16 5.153,17 5.273,18 5.398,19 2.051,20 6.11,21 3.537,22 3.348,23 3.336,24 1.832,25 1.083,26 1.855,27 1.681,28 1.423,29 1.653,30 3.144,31 4.628,32 5.362,33 5.447,34 5.695,35 10.508,36 12.464,37 17.946,38 16.821,39 24.026,40 47.505,41 20.633,42 29.47,43 31.087,44 8.835,45 2,46 0.122,47 5.48,48 4.11,49 3.725,50 1.417,51 1.397,52 0.853,53 7.868,54 5.778,55 4.535,56 38,57 35,58 4.05,59 2.114,60 2.091,61 2.196,62 2.199,63 1.856,64 4.754,65 4.756,66 24.619,67 35.117,68 4.889,69 1.905,70 1.7,71 1.276,72 1.536,73 1.435,74 1.473,75 0.17,76 0.615,77 2.025,78 1.993,79 0.278,80 4.648,81 31.851,82 6.482,83 4.353,84 4.485,85 3.974,86 3.903,87 4.908,88 4.399,89 4.307,90 4.509,91 4.569,92 5.819,93 4.41,94 5.586,95 7.384,96 5.059,97 3.219,98 2,99 459.5,100 74,101 78,102 34,103 5,104 7,105 38,106 15.333,107 14.632,108 22.494,109 447.302,110 447.302,111 447.302,112 447.302,113 26,114 72.108,115 82.47,116 4.732,117 8.265,118 49.717,119 5.219,120 3.471,121 3.527,122 3.256,123 3.129,124 5.897}
{0 CHEMBL2324346,1 1.513,2 1.482,3 1.398,4 181.911,5 181.911,6 181.911,7 2.925,8 4.461,9 4.66,10 12.047,11 7.298,12 2.213,13 1.288,14 3.773,15 1.188,16 4.787,17 4.97,18 5.03,19 1.288,20 3.773,21 3.069,22 2.761,23 2.764,24 1.711,25 0.692,26 1.735,27 1.187,28 0.864,29 1.199,30 2.651,31 3.662,32 4.423,33 4.267,34 4.473,35 3.332,36 4.403,37 5.599,38 4.918,39 6.1,40 16.929,41 4.831,42 6.463,43 5.733,44 4.398,46 0.102,47 5.421,48 3.964,49 3.463,50 1.061,51 0.934,52 0.218,53 3.582,54 2.381,55 1.529,56 3,57 2,58 3.8,59 1.9,60 1.867,61 1.99,62 2.029,64 3.566,65 3.628,66 5.104,67 6.753,68 2.126,69 1.562,70 1.181,71 0.872,72 1.095,73 1.062,74 1.107,75 0.177,76 0.675,77 1.776,78 1.741,79 0.28,80 3.665,81 4.637,82 6.139,83 3.793,84 3.923,85 3.283,86 3.313,87 4.279,88 3.641,89 3.668,90 3.67,91 3.588,92 4.586,93 3.621,94 4.573,95 2.74,96 3.604,97 2.993,98 0.629,99 199.421,100 38,101 41,102 16,103 4,104 5,105 14,106 7.676,107 11.009,108 13.335,109 153.024,110 153.024,111 153.024,112 153.024,113 20,114 38.76,115 43.489,116 4.244,117 7.487,118 26.023,119 4.993,120 2.979,121 2.988,122 2.854,123 2.65,124 7.699}
{0 CHEMBL257156,1 1.605,2 1.527,3 1.474,4 298.103,5 306.103,6 310.103,7 3.299,8 5.145,9 5.6,10 33.128,11 23.54,12 2.79,13 1.834,14 5.18,15 1.748,16 5.056,17 5.13,18 5.165,19 1.834,20 5.18,21 3.33,22 3.079,23 3.067,24 1.765,25 0.885,26 1.757,27 1.544,28 1.178,29 1.528,30 2.949,31 4.477,32 5.373,33 5.507,34 5.77,35 9.77,36 11.007,37 15.842,38 15.252,39 21.621,40 49.452,41 19.125,42 27.44,43 29.388,44 8.957,45 7,46 0.115,47 5.435,48 3.978,49 3.64,50 1.459,51 1.372,52 0.846,53 7.496,54 5.563,55 4.271,56 11,57 10,58 3.916,59 2.001,60 1.975,61 2.123,62 2.119,63 7.599,64 4.585,65 4.491,66 17.144,67 25.752,68 4.233,69 1.651,70 1.576,71 1.181,72 1.564,73 1.475,74 1.508,75 0.175,76 0.583,77 1.859,78 1.832,79 0.271,80 4.414,81 27.156,82 6.253,83 4.336,84 4.458,85 3.803,86 3.768,87 4.94,88 4.214,89 4.161,90 4.389,91 4.462,92 5.698,93 4.242,94 5.609,95 7.069,96 4.758,97 3.11,98 1.47,99 436.632,100 71,101 74,102 27,103 4,104 6,105 38,106 14.567,107 10.479,108 20.017,109 447.302,110 447.302,111 447.302,112 447.302,113 20,114 70.418,115 80.308,116 4.537,117 7.993,118 44.535,119 5.11,120 3.266,121 3.317,122 3.218,123 2.954,124 5.523}
{0 CHEMBL443165,1 1.355,2 1.211,3 1.142,4 157.71,5 159.71,6 159.71,7 2.556,8 4.273,9 4.465,10 11.157,11 4.163,12 1.867,13 0.906,14 2.22,15 0.865,16 4.143,17 4.205,18 4.159,19 0.906,20 2.22,21 2.894,22 2.663,23 2.662,24 1.515,25 0.574,26 1.534,27 1.105,28 0.844,29 1.112,30 2.234,31 3.574,32 4.275,33 4.301,34 4.531,35 3.163,36 4.187,37 5.067,38 4.994,39 6.231,40 15.111,41 5.23,42 6.553,43 8.058,44 3.892,46 0.095,47 5.385,48 3.94,49 3.315,50 1.162,51 0.951,52 0.166,53 3.174,54 2.233,55 1.381,56 5,57 2,58 3.831,59 1.915,60 1.888,61 2.024,62 2.043,63 0.61,64 3.521,65 3.352,66 4.051,67 5.276,68 1.787,69 1.409,70 1.008,71 0.62,72 0.85,73 0.858,74 0.864,75 0.181,76 0.675,77 1.581,78 1.593,79 0.283,80 3.243,81 7.756,82 6.234,83 3.632,84 3.745,85 3.166,86 3.168,87 4.115,88 3.504,89 3.496,90 3.536,91 3.483,92 4.146,93 3.198,94 4.032,95 2.628,96 3.315,97 2.866,98 0.158,99 166.465,100 33,101 35,102 14,103 3,104 4,105 13,106 6.243,107 9.796,108 10.958,109 141.253,110 141.253,111 141.253,112 141.253,113 15,114 33.476,115 37.223,116 3.972,117 7.17,118 23.142,119 4.866,120 2.827,121 2.833,122 2.463,123 2.236,124 4.799}
{0 CHEMBL445782,1 1.355,2 1.2,3 1.137,4 130.881,5 130.881,6 130.881,7 2.482,8 4.125,9 4.321,10 6.088,11 3.325,12 1.891,13 0.942,14 2.263,15 0.884,16 4.043,17 4.111,18 4.078,19 0.942,20 2.263,21 2.885,22 2.658,23 2.672,24 1.434,25 0.526,26 1.44,27 1.105,28 0.821,29 1.062,30 2.205,31 3.545,32 4.11,33 4.024,34 4.254,35 2.327,36 3.421,37 3.906,38 4.834,39 5.511,40 14.185,41 4.743,42 5.633,43 5.859,44 3.764,46 0.097,47 5.373,48 3.94,49 3.289,50 1.16,51 0.951,52 0.041,53 3.161,54 2.119,55 1.455,56 7,57 4,58 3.836,59 1.916,60 1.888,61 2.015,62 2.04,63 0.659,64 3.315,65 3.189,66 3.191,67 3.846,68 1.607,69 1.409,70 0.827,71 0.355,72 0.633,73 0.609,74 0.644,75 0.184,76 0.719,77 1.573,78 1.59,79 0.289,80 3.133,81 4.713,82 6.027,83 3.513,84 3.623,85 3.131,86 3.119,87 3.984,88 3.492,89 3.465,90 3.47,91 3.322,92 3.879,93 3.054,94 3.771,95 2.036,96 3.149,97 2.862,99 140.881,100 29,101 31,102 13,103 3,104 4,105 10,106 5.219,107 9.604,108 10.543,109 105.94,110 105.94,111 105.94,112 105.94,113 15,114 29.589,115 32.542,116 3.916,117 7.035,118 21.784,119 4.862,120 2.834,121 2.59,122 2.401,123 2.209,124 4.523}
{0 CHEMBL452406,1 1.355,2 1.208,3 1.136,4 128.127,5 130.881,6 130.881,7 2.482,8 4.126,9 4.323,10 8.301,11 3.588,12 1.86,13 0.901,14 2.136,15 0.858,16 4.007,17 4.043,18 3.97,19 0.901,20 2.136,21 2.887,22 2.632,23 2.65,24 1.449,25 0.53,26 1.456,27 1.105,28 0.821,29 1.062,30 2.203,31 3.474,32 4.095,33 4.018,34 4.255,35 2.681,36 3.507,37 4.397,38 4.647,39 5.955,40 13.563,41 4.503,42 5.944,43 6.026,44 3.443,46 0.096,47 5.371,48 3.939,49 3.29,50 1.16,51 0.952,52 0.042,53 2.838,54 1.987,55 1.258,56 7,57 3,58 3.824,59 1.92,60 1.887,61 2.044,62 2.046,63 0.718,64 3.283,65 3.139,66 3.109,67 4.062,68 1.627,69 1.409,70 0.944,71 0.363,72 0.648,73 0.637,74 0.667,75 0.183,76 0.69,77 1.58,78 1.593,79 0.288,80 3.08,81 4.926,82 6.339,83 3.504,84 3.624,85 3.093,86 3.082,87 3.972,88 3.438,89 3.412,90 3.403,91 3.275,92 3.881,93 3.003,94 3.774,95 2.176,96 3.247,97 2.861,99 140.881,100 29,101 31,102 13,103 3,104 4,105 11,106 5.16,107 9.469,108 10.066,109 117.711,110 117.711,111 117.711,112 117.711,113 15,114 29.265,115 32.598,116 3.884,117 7,118 20.926,119 4.861,120 2.822,121 2.593,122 2.4,123 2.205,124 5.878}
{0 CHEMBL452409,1 1.299,2 1.233,3 1.175,4 123.851,5 126.606,6 126.606,7 2.465,8 4.021,9 4.107,10 8.638,11 2.921,12 1.958,13 1,14 2.136,15 0.955,16 3.932,17 3.97,18 3.97,19 1,20 2.136,21 2.857,22 2.597,23 2.592,24 1.343,25 0.335,26 1.393,27 1.047,28 0.777,29 1.008,30 2.139,31 3.41,32 3.907,33 3.821,34 4.024,35 2.428,36 3.529,37 3.829,38 4.338,39 4.852,40 10.289,41 4.111,42 4.664,43 4.908,44 3.326,46 0.092,47 5.062,48 3.887,49 3.075,50 1.005,51 0.94,52 0.127,53 3.138,54 2.259,55 1.397,56 2,57 1,58 3.736,59 1.85,60 1.818,61 1.949,62 1.969,64 3.279,65 3.055,66 2.474,67 3.009,68 1.524,69 1.297,70 0.817,71 0.461,72 0.737,73 0.722,74 0.735,75 0.191,76 0.709,77 1.346,78 1.452,79 0.291,80 2.81,81 3.443,82 5.986,83 3.466,84 3.572,85 3.134,86 3.091,87 3.887,88 3.443,89 3.387,90 3.321,91 3.214,92 3.603,93 2.715,94 3.574,95 2.212,96 3.19,97 2.789,98 -0.028,99 134.606,100 28,101 30,102 13,103 3,104 3,105 10,106 5.017,107 9.386,108 9.931,109 105.94,110 105.94,111 105.94,112 105.94,113 17,114 28.134,115 31.159,116 3.833,117 6.84,118 20.955,119 4.73,120 2.774,121 2.699,122 2.366,123 2.147,124 4.523}
{0 CHEMBL469539,1 1.358,2 1.246,3 1.189,4 151.245,5 153.245,6 153.245,7 2.564,8 4.295,9 4.557,10 7.192,11 3.33,12 2.043,13 1.113,14 2.54,15 1.015,16 4.248,17 4.248,18 4.277,19 1.113,20 2.54,21 2.891,22 2.639,23 2.655,24 1.517,25 0.533,26 1.483,27 1.105,28 0.844,29 1.111,30 2.223,31 3.58,32 4.346,33 4.229,34 4.435,35 2.47,36 4.361,37 4.078,38 5.274,39 5.622,40 15.147,41 5.829,42 5.921,43 5.909,44 4.369,46 0.092,47 5.381,48 3.944,49 3.371,50 1.183,51 0.957,52 0.042,53 3.25,54 2.248,55 1.446,56 7,57 3,58 3.855,59 1.933,60 1.905,61 2.036,62 2.05,63 0.208,64 3.402,65 3.243,66 3.814,67 4.043,68 1.741,69 1.412,70 0.95,71 0.44,72 0.648,73 0.783,74 0.775,75 0.179,76 0.709,77 1.579,78 1.596,79 0.296,80 3.181,81 4.983,82 6.666,83 3.629,84 3.736,85 3.162,86 3.198,87 4.157,88 3.516,89 3.555,90 3.578,91 3.497,92 4.065,93 3.174,94 3.975,95 2.614,96 3.102,97 2.907,98 0.216,99 160,100 32,101 34,102 14,103 3,104 4,105 10,106 5.755,107 9.955,108 11.803,109 105.94,110 105.94,111 113.699,112 105.94,113 15,114 33.687,115 37.032,116 4.09,117 7.403,118 22.5,119 4.907,120 2.825,121 2.692,122 2.467,123 2.235,124 4.836}
{0 CHEMBL469540,1 1.356,2 1.217,3 1.16,4 159.71,5 159.71,6 159.71,7 2.589,8 4.328,9 4.49,10 7.545,11 3.195,12 2.043,13 1.122,14 2.597,15 1.015,16 4.263,17 4.331,18 4.29,19 1.122,20 2.597,21 2.893,22 2.65,23 2.663,24 1.552,25 0.529,26 1.474,27 1.105,28 0.844,29 1.112,30 2.255,31 3.567,32 4.301,33 4.344,34 4.545,35 2.386,36 4.368,37 3.94,38 5.048,39 5.314,40 12.04,41 5.386,42 5.887,43 5.895,44 4.48,46 0.09,47 5.389,48 3.94,49 3.416,50 1.161,51 0.951,52 0.042,53 3.127,54 2.243,55 1.402,56 5,57 2,58 3.832,59 1.915,60 1.887,61 2.022,62 2.043,63 0.268,64 3.46,65 3.304,66 4.42,67 4.283,68 1.762,69 1.409,70 0.954,71 0.638,72 0.842,73 0.885,74 0.895,75 0.178,76 0.709,77 1.577,78 1.594,79 0.304,80 3.217,81 5.108,82 6.092,83 3.672,84 3.769,85 3.158,86 3.215,87 4.205,88 3.497,89 3.551,90 3.559,91 3.523,92 4.297,93 3.227,94 4.027,95 2.716,96 3.008,97 2.862,98 0.297,99 166.465,100 33,101 35,102 14,103 3,104 4,105 10,106 5.921,107 10.047,108 12.002,109 105.94,110 105.94,111 115.757,112 105.94,113 15,114 35.014,115 38.242,116 4.084,117 7.227,118 22.955,119 4.862,120 2.828,121 2.849,122 2.489,123 2.253,124 4.959}
{0 CHEMBL469732,1 1.388,2 1.359,3 1.295,4 144.49,5 147.245,6 147.245,7 2.501,8 4.237,9 4.492,10 10.471,11 4.731,12 2,13 1,14 2.136,15 1,16 4.111,17 4.143,18 4.025,19 1,20 2.136,21 2.925,22 2.644,23 2.668,24 1.564,25 0.553,26 1.564,27 1.107,28 0.821,29 1.062,30 2.21,31 3.601,32 4.27,33 4.292,34 4.534,35 3.259,36 4.147,37 5.504,38 5.277,39 7.041,40 16.056,41 5.571,42 7.622,43 8.237,44 3.897,45 1,46 0.098,47 5.379,48 3.944,49 3.365,50 1.203,51 0.954,52 0.218,53 3.186,54 2.222,55 1.377,56 8,57 5,58 3.834,59 1.933,60 1.901,61 2.057,62 2.058,64 3.545,65 3.439,66 4.585,67 6.017,68 1.877,69 1.45,70 1.009,71 0.64,72 0.9,73 0.899,74 0.919,75 0.181,76 0.673,77 1.699,78 1.661,79 0.286,80 3.299,81 7.699,82 6.351,83 3.587,84 3.711,85 3.17,86 3.15,87 4.073,88 3.525,89 3.491,90 3.528,91 3.471,92 4.226,93 3.169,94 3.957,95 2.523,96 3.419,97 2.889,98 0.009,99 160,100 32,101 34,102 14,103 3,104 4,105 13,106 5.993,107 9.493,108 10.748,109 141.253,110 141.253,111 141.253,112 141.253,113 15,114 32.149,115 36.013,116 3.959,117 7.173,118 22.688,119 4.889,120 2.854,121 2.817,122 2.408,123 2.217,124 6}
{0 CHEMBL469756,1 1.355,2 1.204,3 1.136,4 138.881,5 138.881,6 138.881,7 2.482,8 4.125,9 4.321,10 6.088,11 3.264,12 1.862,13 0.903,14 2.224,15 0.86,16 4.06,17 4.111,18 4.094,19 0.903,20 2.224,21 2.886,22 2.635,23 2.652,24 1.441,25 0.528,26 1.448,27 1.056,28 0.824,29 1.013,30 2.203,31 3.545,32 4.11,33 4.041,34 4.251,35 2.327,36 3.421,37 3.906,38 4.834,39 5.511,40 13.374,41 4.729,42 5.647,43 5.765,44 3.764,46 0.094,47 5.374,48 3.94,49 3.289,50 1.16,51 0.951,52 0.042,53 3.119,54 2.251,55 1.38,56 7,57 4,58 3.837,59 1.916,60 1.888,61 2.014,62 2.039,63 0.635,64 3.339,65 3.189,66 3.162,67 3.881,68 1.607,69 1.409,70 0.926,71 0.362,72 0.648,73 0.636,74 0.667,75 0.182,76 0.719,77 1.576,78 1.591,79 0.29,80 3.142,81 4.731,82 6.098,83 3.513,84 3.623,85 3.131,86 3.119,87 3.984,88 3.492,89 3.465,90 3.47,91 3.343,92 3.879,93 3.073,94 3.769,95 2.036,96 3.149,97 2.862,98 0.101,99 140.881,100 29,101 31,102 13,103 3,104 4,105 10,106 5.219,107 9.614,108 10.543,109 105.94,110 105.94,111 105.94,112 105.94,113 15,114 29.589,115 32.542,116 3.916,117 7.037,118 21.784,119 4.862,120 2.823,121 2.593,122 2.4,123 2.205,124 5.284}
{0 CHEMBL470804,1 1.355,2 1.219,3 1.147,4 147.245,5 151.245,6 153.245,7 2.484,8 4.242,9 4.491,10 10.737,11 5.038,12 1.866,13 0.905,14 2.22,15 0.864,16 4.078,17 4.143,18 4.06,19 0.905,20 2.22,21 2.892,22 2.646,23 2.657,24 1.45,25 0.599,26 1.471,27 1.105,28 0.844,29 1.112,30 2.209,31 3.601,32 4.27,33 4.284,34 4.56,35 3.259,36 4.152,37 5.518,38 5.157,39 6.835,40 15.831,41 5.568,42 7.608,43 8.537,44 3.797,46 0.092,47 5.378,48 3.944,49 3.29,50 1.213,51 0.96,52 0.124,53 3.243,54 2.192,55 1.359,56 9,57 5,58 3.852,59 1.943,60 1.912,61 2.065,62 2.058,63 0.724,64 3.445,65 3.262,66 3.44,67 4.57,68 1.828,69 1.41,70 1.007,71 0.507,72 0.77,73 0.767,74 0.783,75 0.182,76 0.673,77 1.582,78 1.594,79 0.286,80 3.238,81 6.383,82 6.227,83 3.587,84 3.711,85 3.17,86 3.15,87 4.072,88 3.525,89 3.49,90 3.528,91 3.437,92 4.023,93 3.168,94 4.077,95 2.523,96 3.419,97 2.869,98 0.095,99 160,100 32,101 34,102 14,103 3,104 4,105 13,106 6.076,107 9.646,108 10.713,109 141.253,110 141.253,111 141.253,112 141.253,113 15,114 32.149,115 36.013,116 3.963,117 7.196,118 22.688,119 4.869,120 2.826,121 2.73,122 2.403,123 2.215,124 4.836}
{0 CHEMBL471192,1 1.356,2 1.225,3 1.178,4 151.71,5 151.71,6 151.71,7 2.555,8 4.328,9 4.49,10 7.545,11 3.673,12 2,13 1,14 2.275,15 1,16 4.29,17 4.317,18 4.234,19 1,20 2.275,21 2.925,22 2.735,23 2.715,24 1.558,25 0.527,26 1.485,27 1.107,28 0.844,29 1.111,30 2.227,31 3.567,32 4.301,33 4.328,34 4.547,35 2.386,36 4.368,37 3.94,38 5.048,39 5.314,40 11.838,41 5.386,42 5.818,43 6.423,44 4.48,46 0.09,47 5.384,48 3.94,49 3.409,50 1.161,51 0.951,52 0.041,53 3.152,54 2.2,55 1.411,56 5,57 2,58 3.831,59 1.915,60 1.887,61 2.023,62 2.043,63 0.377,64 3.438,65 3.253,66 3.622,67 3.96,68 1.762,69 1.41,70 0.996,71 0.583,72 0.763,73 0.843,74 0.833,75 0.18,76 0.709,77 1.575,78 1.594,79 0.303,80 3.186,81 4.729,82 6.027,83 3.672,84 3.769,85 3.158,86 3.215,87 4.205,88 3.497,89 3.551,90 3.559,91 3.513,92 4.04,93 3.176,94 4.143,95 2.716,96 3.008,97 2.862,98 0.242,99 166.465,100 33,101 35,102 14,103 3,104 4,105 10,106 5.921,107 10.013,108 12.002,109 105.94,110 105.94,111 115.757,112 105.94,113 15,114 35.014,115 38.242,116 4.084,117 7.223,118 22.955,119 4.862,120 2.854,121 2.86,122 2.472,123 2.238,124 4.812}
{0 CHEMBL471193,1 1.764,2 1.408,3 1.355,4 186.122,5 194.877,6 194.877,7 2.925,8 4.424,9 4.647,10 11.198,11 6.641,12 2.047,13 1.128,14 2.73,15 1.018,16 4.419,17 4.511,18 4.511,19 1.128,20 2.73,21 2.972,22 2.744,23 2.759,24 1.594,25 0.651,26 1.591,27 1.107,28 0.845,29 1.115,30 2.735,31 3.809,32 4.442,33 4.386,34 4.598,35 3.728,36 5.098,37 6.059,38 6.844,39 8.043,40 18.463,41 6.631,42 8.129,43 8.771,44 4.671,46 0.098,47 5.381,48 3.945,49 3.466,50 1.163,51 1.037,52 0.218,53 3.898,54 2.691,55 1.768,56 9,57 4,58 3.86,59 1.931,60 1.907,61 2.039,62 2.05,63 0.64,64 3.732,65 3.669,66 6.005,67 7.908,68 2.266,69 1.803,70 1.181,71 0.886,72 1.088,73 1.062,74 1.106,75 0.184,76 0.695,77 1.852,78 1.923,79 0.287,80 3.576,81 8.346,82 6.339,83 3.821,84 3.927,85 3.417,86 3.411,87 4.289,88 3.761,89 3.744,90 3.759,91 3.66,92 4.463,93 3.474,94 4.312,95 3.16,96 3.683,97 2.862,98 0.998,99 212.877,100 40,101 43,102 19,103 4,104 5,105 15,106 7.16,107 11.417,108 14.085,109 164.795,110 164.795,111 164.795,112 164.795,113 21,114 40.36,115 44.638,116 4.224,117 7.313,118 28.904,119 4.862,120 2.936,121 2.925,122 2.854,123 2.715,124 4.523}
{0 CHEMBL471194,1 1.355,2 1.201,3 1.137,4 130.881,5 130.881,6 130.881,7 2.482,8 4.123,9 4.318,10 3.41,11 2.821,12 1.87,13 0.914,14 2.245,15 0.866,16 4.111,17 4.174,18 4.205,19 0.914,20 2.245,21 2.886,22 2.641,23 2.659,24 1.431,25 0.526,26 1.438,27 1.004,28 0.827,29 0.962,30 2.203,31 3.611,32 4.128,33 4.063,34 4.247,35 1.964,36 3.251,37 3.377,38 4.872,39 4.9,40 13.865,41 4.845,42 5.263,43 5.324,44 4.086,46 0.093,47 5.377,48 3.942,49 3.289,50 1.16,51 0.95,52 0.041,53 3.354,54 2.675,55 1.478,56 8,57 3,58 3.848,59 1.911,60 1.889,61 1.982,62 2.034,63 0.551,64 3.391,65 3.237,66 3.182,67 3.692,68 1.587,69 1.409,70 0.92,71 0.362,72 0.648,73 0.635,74 0.666,75 0.178,76 0.747,77 1.57,78 1.59,79 0.292,80 3.2,81 4.455,82 6.027,83 3.523,84 3.621,85 3.168,86 3.155,87 3.996,88 3.543,89 3.515,90 3.533,91 3.43,92 3.876,93 3.138,94 3.763,95 1.857,96 3.082,97 2.862,98 0.17,99 140.881,100 29,101 31,102 13,103 3,104 4,105 9,106 5.279,107 9.741,108 11.021,109 94.169,110 94.169,111 94.169,112 94.169,113 15,114 29.913,115 32.486,116 3.948,117 7.074,118 22.642,119 4.862,120 2.827,121 2.593,122 2.4,123 2.206,124 4.523}
{0 CHEMBL471826,1 1.361,2 1.282,3 1.236,4 149.58,5 149.58,6 149.58,7 2.565,8 4.19,9 4.459,10 6.658,11 3.024,12 2,13 1,14 2.324,15 1,16 4.19,17 4.205,18 4.22,19 1,20 2.324,21 2.891,22 2.639,23 2.656,24 1.584,25 0.531,26 1.562,27 1.105,28 0.844,29 1.111,30 2.236,31 3.548,32 4.262,33 4.163,34 4.365,35 2.362,36 3.624,37 3.897,38 4.628,39 5.184,40 13.825,41 4.879,42 5.428,43 5.406,44 3.721,46 0.095,47 5.377,48 3.945,49 3.419,50 1.173,51 0.954,52 0.042,53 3.117,54 2.171,55 1.382,56 5,57 2,58 3.859,59 1.94,60 1.911,61 2.041,62 2.073,63 0.414,64 3.376,65 3.22,66 3.336,67 3.84,68 1.688,69 1.414,70 0.961,71 0.512,72 0.764,73 0.804,74 0.819,75 0.182,76 0.708,77 1.581,78 1.63,79 0.291,80 3.153,81 4.572,82 6.09,83 3.598,84 3.706,85 3.129,86 3.152,87 4.059,88 3.489,89 3.504,90 3.531,91 3.44,92 3.989,93 3.128,94 3.902,95 2.203,96 3.062,97 2.863,98 0.215,99 153.58,100 31,101 33,102 13,103 3,104 4,105 10,106 5.61,107 10.047,108 11.243,109 105.94,110 105.94,111 105.94,112 105.94,113 15,114 32.138,115 35.1,116 4.057,117 7.264,118 22.08,119 4.863,120 2.825,121 2.699,122 2.471,123 2.241,124 5.102}
{0 CHEMBL471852,1 1.363,2 1.312,3 1.245,4 141.245,5 145.245,6 145.245,7 2.484,8 4.242,9 4.508,10 10.737,11 4.594,12 1.898,13 0.942,14 2.263,15 0.896,16 4.043,17 4.111,18 4.078,19 0.942,20 2.263,21 2.925,22 2.735,23 2.715,24 1.523,25 0.556,26 1.537,27 1.107,28 0.842,29 1.109,30 2.209,31 3.591,32 4.265,33 4.156,34 4.414,35 3.259,36 4.152,37 5.518,38 5.156,39 6.828,40 17.034,41 5.633,42 7.786,43 7.493,44 3.796,46 0.097,47 5.373,48 3.943,49 3.342,50 1.197,51 0.968,52 0.218,53 3.116,54 2.097,55 1.426,56 9,57 5,58 3.85,59 1.94,60 1.909,61 2.063,62 2.055,63 0.718,64 3.378,65 3.222,66 3.815,67 5.211,68 1.822,69 1.419,70 1.007,71 0.504,72 0.763,73 0.765,74 0.778,75 0.184,76 0.673,77 1.628,78 1.611,79 0.289,80 3.186,81 5.334,82 6.027,83 3.587,84 3.711,85 3.17,86 3.15,87 4.072,88 3.525,89 3.49,90 3.511,91 3.387,92 4.118,93 3.096,94 3.934,95 2.523,96 3.419,97 2.862,99 160,100 32,101 34,102 14,103 3,104 4,105 13,106 6.076,107 9.604,108 10.709,109 141.253,110 141.253,111 141.253,112 141.253,113 15,114 32.149,115 36.013,116 3.963,117 7.127,118 22.688,119 4.862,120 2.854,121 2.79,122 2.403,123 2.215,124 4.523}
{0 CHEMBL472028,1 1.36,2 1.269,3 1.217,4 141.245,5 145.245,6 145.245,7 2.485,8 4.295,9 4.556,10 7.192,11 3.518,12 2,13 1,14 2.275,15 1,16 4.234,17 4.205,18 4.263,19 1,20 2.275,21 2.925,22 2.735,23 2.715,24 1.532,25 0.535,26 1.496,27 1.107,28 0.821,29 1.109,30 2.209,31 3.58,32 4.346,33 4.223,34 4.456,35 2.47,36 4.361,37 4.078,38 5.274,39 5.622,40 14.767,41 5.828,42 5.897,43 6.108,44 4.369,46 0.086,47 5.379,48 3.944,49 3.374,50 1.181,51 0.958,52 0.064,53 3.277,54 2.202,55 1.414,56 7,57 3,58 3.855,59 1.933,60 1.905,61 2.036,62 2.05,63 0.341,64 3.366,65 3.214,66 3.928,67 4.02,68 1.741,69 1.414,70 1.001,71 0.472,72 0.668,73 0.768,74 0.761,75 0.18,76 0.709,77 1.579,78 1.598,79 0.296,80 3.175,81 4.746,82 6.601,83 3.629,84 3.736,85 3.162,86 3.198,87 4.157,88 3.516,89 3.555,90 3.578,91 3.48,92 4.178,93 3.16,94 3.977,95 2.614,96 3.102,97 2.885,98 0.157,99 160,100 32,101 34,102 14,103 3,104 4,105 10,106 5.755,107 9.925,108 11.803,109 105.94,110 105.94,111 113.699,112 105.94,113 15,114 33.687,115 37.032,116 4.09,117 7.4,118 22.5,119 4.885,120 2.854,121 2.807,122 2.404,123 2.216,124 4.523}
{0 CHEMBL472452,1 1.387,2 1.366,3 1.328,4 120.211,5 120.211,6 120.211,7 2.286,8 4.022,9 4.084,10 7.05,11 2.638,12 1.465,13 0.618,14 1.372,15 0.507,16 3.97,17 4.007,18 3.892,19 0.618,20 1.372,21 2.485,22 2.376,23 2.232,24 1.472,25 0.55,26 1.52,27 1.076,28 0.774,29 1.022,30 1.998,31 3.349,32 3.89,33 3.875,34 4.091,35 2.125,36 3.595,37 3.611,38 4.866,39 4.694,40 9.585,41 3.783,42 4.1,43 4.799,44 3.673,46 0.085,47 5.383,48 3.937,49 3.251,50 1.035,51 0.871,52 0.041,53 3.422,54 2.434,55 1.283,56 3,58 3.805,59 1.838,60 1.792,61 1.885,62 2.008,63 0.757,64 3.224,65 3.113,66 3.126,67 3.185,68 1.419,69 1.416,70 0.654,72 0.339,73 0.34,74 0.376,75 0.181,76 0.718,77 1.567,78 1.579,79 0.285,80 3.043,81 4.207,82 6.167,83 3.418,84 3.524,85 3.072,86 3.028,87 3.884,88 3.428,89 3.363,90 3.256,91 3.17,92 3.631,93 2.89,94 3.426,95 2.013,96 2.869,97 2.86,98 -0.517,99 122.211,100 26,101 28,102 11,103 3,104 4,105 9,106 4.66,107 9.079,108 9.612,109 94.169,110 94.169,111 94.169,112 94.169,113 14,114 26.458,115 29.103,116 3.78,117 6.839,118 19.813,119 4.75,120 2.404,121 2.469,122 2.184,123 1.95,124 6.347}
{0 CHEMBL476338,1 1.326,2 1.292,3 1.243,4 148.825,5 148.825,6 148.825,7 2.693,8 4.205,9 4.383,10 4.713,11 2.527,12 2.013,13 1.069,14 2.6,15 1.001,16 4.304,17 4.317,18 4.344,19 1.069,20 2.6,21 2.86,22 2.603,23 2.607,24 1.4,25 0.402,26 1.425,27 1.036,28 0.721,29 1.003,30 2.392,31 3.557,32 4.208,33 3.983,34 4.113,35 1.901,36 4.397,37 3.099,38 4.939,39 4.121,40 10.702,41 5.286,42 3.767,43 4.108,44 4.575,46 0.089,47 5.265,48 3.884,49 3.359,50 0.98,51 0.974,52 0.054,53 3.871,54 2.666,55 1.733,56 2,57 1,58 3.786,59 1.843,60 1.811,61 1.948,62 1.965,64 3.427,65 3.234,66 3.523,67 2.927,68 1.636,69 1.325,70 0.858,71 0.538,72 0.777,73 0.794,74 0.821,75 0.184,76 0.753,77 1.403,78 1.495,79 0.297,80 3.033,81 3.063,82 6.92,83 3.604,84 3.688,85 3.234,86 3.239,87 4.098,88 3.563,89 3.576,90 3.553,91 3.467,92 3.866,93 3.001,94 3.795,95 2.488,96 2.905,97 2.879,98 0.236,99 153.58,100 31,101 33,102 14,103 3,104 3,105 8,106 5.671,107 9.969,108 12.142,109 82.398,110 82.398,111 90.157,112 82.398,113 17,114 32.88,115 35.537,116 4.073,117 7.306,118 23.387,119 4.825,120 2.789,121 2.846,122 2.626,123 2.418,124 4.523}
{0 CHEMBL476339,1 1.325,2 1.293,3 1.238,4 146.825,5 148.825,6 148.825,7 2.592,8 4.148,9 4.306,10 11.068,11 3.508,12 1.956,13 1,14 2.136,15 0.953,16 3.989,17 4.06,18 4.094,19 1,20 2.136,21 2.873,22 2.711,23 2.674,24 1.395,25 0.505,26 1.427,27 1.041,28 0.784,29 1.003,30 2.258,31 3.509,32 4.083,33 3.952,34 4.172,35 3.022,36 4.23,37 5.042,38 4.765,39 5.667,40 14.027,41 4.999,42 6.194,43 5.144,44 3.679,46 0.091,47 5.069,48 3.88,49 3.243,50 1.051,51 0.974,52 0.16,53 3.34,54 2.388,55 1.445,56 4,58 3.77,59 1.858,60 1.819,61 1.979,62 1.99,64 3.357,65 3.227,66 3.798,67 3.906,68 1.729,69 1.326,70 0.978,71 0.514,72 0.794,73 0.766,74 0.793,75 0.189,76 0.69,77 1.491,78 1.519,79 0.293,80 3.03,81 4.724,82 5.986,83 3.552,84 3.664,85 3.208,86 3.158,87 3.996,88 3.523,89 3.461,90 3.418,91 3.307,92 3.822,93 2.901,94 3.727,95 2.578,96 3.365,97 2.747,98 -0.009,99 153.58,100 31,101 33,102 14,103 3,104 3,105 12,106 5.933,107 9.534,108 10.566,109 129.482,110 129.482,111 129.482,112 129.482,113 17,114 31.018,115 34.574,116 3.912,117 6.949,118 22.716,119 4.693,120 2.801,121 2.751,122 2.487,123 2.247,124 7.241}
{0 CHEMBL489282,1 1.319,2 1.268,3 1.224,4 134.606,5 134.606,6 134.606,7 2.452,8 4.01,9 4.066,10 6.778,11 2.696,12 1.956,13 1,14 2.136,15 0.953,16 4.007,17 4.043,18 4.078,19 1,20 2.136,21 2.854,22 2.57,23 2.575,24 1.344,25 0.386,26 1.413,27 1.028,28 0.718,29 0.996,30 2.418,31 3.577,32 3.877,33 3.756,34 3.936,35 1.972,36 3.515,37 3.303,38 6.741,39 4.758,40 18.346,41 4.991,42 3.958,43 4.047,44 3.986,46 0.094,47 5.067,48 3.878,49 3.075,50 0.974,51 0.957,52 0.088,53 3.79,54 2.553,55 1.717,56 2,57 1,58 3.764,59 1.842,60 1.806,61 1.948,62 1.963,64 3.32,65 3.254,66 4.582,67 3.039,68 1.515,69 1.319,70 0.808,71 0.486,72 0.668,73 0.721,74 0.731,75 0.191,76 0.756,77 1.399,78 1.447,79 0.293,80 3.131,81 3.538,82 5.986,83 3.468,84 3.564,85 3.243,86 3.15,87 3.89,88 3.594,89 3.466,90 3.404,91 3.245,92 3.624,93 2.876,94 3.532,95 1.796,96 3.023,97 2.745,98 -0.025,99 134.606,100 28,101 30,102 13,103 3,104 3,105 9,106 5.076,107 9.524,108 10.55,109 94.169,110 94.169,111 94.169,112 94.169,113 17,114 28.204,115 30.879,116 3.838,117 6.8,118 23.614,119 4.691,120 2.769,121 2.725,122 2.37,123 2.204,124 4.523}
{0 CHEMBL489770,1 1.318,2 1.269,3 1.221,4 126.606,5 132.606,6 134.606,7 2.466,8 4.02,9 4.077,10 8.567,11 2.721,12 1.956,13 1,14 2.136,15 0.953,16 3.932,17 3.97,18 3.97,19 1,20 2.136,21 2.855,22 2.569,23 2.575,24 1.358,25 0.39,26 1.419,27 1.035,28 0.717,29 1.003,30 2.14,31 3.382,32 3.875,33 3.754,34 3.943,35 2.428,36 3.544,37 3.866,38 4.333,39 4.839,40 10.392,41 3.764,42 4.181,43 4.368,44 3.326,46 0.092,47 5.062,48 3.874,49 3.085,50 0.974,51 0.94,52 0.091,53 3.089,54 2.221,55 1.373,56 2,58 3.734,59 1.842,60 1.806,61 1.949,62 1.968,64 3.258,65 3.101,66 2.772,67 3.151,68 1.535,69 1.319,70 0.826,71 0.486,72 0.741,73 0.744,74 0.752,75 0.191,76 0.709,77 1.403,78 1.46,79 0.291,80 2.825,81 3.688,82 5.986,83 3.466,84 3.572,85 3.134,86 3.091,87 3.887,88 3.436,89 3.381,90 3.298,91 3.178,92 3.64,93 2.72,94 3.548,95 2.212,96 3.19,97 2.745,98 -0.025,99 134.606,100 28,101 30,102 13,103 3,104 3,105 10,106 5.017,107 9.386,108 9.923,109 105.94,110 105.94,111 105.94,112 105.94,113 17,114 28.134,115 31.159,116 3.829,117 6.792,118 20.955,119 4.691,120 2.769,121 2.729,122 2.367,123 2.149,124 6.402}
{0 CHEMBL490592,1 1.318,2 1.269,3 1.221,4 126.881,5 132.881,6 132.881,7 2.513,8 4.04,9 4.17,10 9.421,11 3.155,12 1.956,13 1,14 2.136,15 0.953,16 3.932,17 3.97,18 3.97,19 1,20 2.136,21 2.873,22 2.709,23 2.672,24 1.358,25 0.392,26 1.419,27 1.04,28 0.778,29 1.003,30 2.196,31 3.458,32 3.955,33 3.815,34 4.01,35 2.786,36 3.855,37 4.502,38 4.904,39 5.854,40 12.036,41 4.533,42 5.327,43 4.993,44 3.406,46 0.092,47 5.062,48 3.889,49 3.088,50 1.063,51 0.974,52 0.153,53 3.214,54 2.333,55 1.459,56 5,57 2,58 3.787,59 1.887,60 1.855,61 2.009,62 1.996,64 3.323,65 3.157,66 3.048,67 3.598,68 1.613,69 1.319,70 0.925,71 0.502,72 0.782,73 0.754,74 0.772,75 0.191,76 0.702,77 1.403,78 1.46,79 0.291,80 2.89,81 4.186,82 5.986,83 3.485,84 3.59,85 3.182,86 3.125,87 3.912,88 3.495,89 3.423,90 3.351,91 3.229,92 3.691,93 2.769,94 3.6,95 2.367,96 3.314,97 2.746,99 140.881,100 29,101 31,102 14,103 3,104 3,105 11,106 5.15,107 9.386,108 10.115,109 117.711,110 117.711,111 117.711,112 117.711,113 17,114 28.916,115 32.076,116 3.85,117 6.849,118 21.71,119 4.746,120 2.8,121 2.742,122 2.413,123 2.196,124 4.523}
{0 CHEMBL491603,1 1.312,2 1.24,3 1.198,4 123.851,5 126.606,6 126.606,7 2.458,8 4.02,9 4.111,10 8.611,11 2.684,12 1.956,13 1,14 2.136,15 0.953,16 3.932,17 3.97,18 3.97,19 1,20 2.136,21 2.87,22 2.621,23 2.623,24 1.347,25 0.335,26 1.409,27 1.038,28 0.727,29 1.003,30 2.133,31 3.402,32 3.905,33 3.797,34 3.993,35 2.428,36 3.513,37 3.77,38 4.323,39 4.84,40 10.577,41 4.154,42 4.733,43 4.742,44 3.324,46 0.092,47 5.062,48 3.877,49 3.045,50 0.974,51 0.954,52 0.111,53 3.121,54 2.246,55 1.392,56 2,58 3.737,59 1.842,60 1.806,61 1.949,62 1.969,64 3.296,65 3.096,66 2.607,67 3.186,68 1.524,69 1.316,70 0.82,71 0.481,72 0.737,73 0.74,74 0.747,75 0.191,76 0.709,77 1.399,78 1.443,79 0.291,80 2.796,81 3.67,82 5.986,83 3.466,84 3.572,85 3.134,86 3.091,87 3.886,88 3.439,89 3.385,90 3.314,91 3.206,92 3.638,93 2.704,94 3.55,95 2.212,96 3.19,97 2.746,98 -0.025,99 134.606,100 28,101 30,102 13,103 3,104 3,105 10,106 5.017,107 9.386,108 9.931,109 105.94,110 105.94,111 105.94,112 105.94,113 17,114 28.134,115 31.159,116 3.833,117 6.823,118 20.955,119 4.692,120 2.792,121 2.723,122 2.359,123 2.141,124 4.523}
{0 CHEMBL492010,1 1.306,2 1.256,3 1.203,4 130.606,5 134.606,6 134.606,7 2.471,8 4.021,9 4.123,10 8.638,11 2.711,12 1.954,13 1,14 2.136,15 0.951,16 3.932,17 3.97,18 3.97,19 1,20 2.136,21 2.851,22 2.555,23 2.564,24 1.352,25 0.378,26 1.409,27 1.014,28 0.684,29 0.988,30 2.154,31 3.403,32 3.912,33 3.78,34 3.973,35 2.428,36 3.529,37 3.829,38 4.353,39 4.89,40 10.758,41 4.091,42 4.613,43 4.476,44 3.326,46 0.092,47 5.062,48 3.884,49 3.083,50 0.997,51 0.94,52 0.047,53 3.119,54 2.251,55 1.391,56 2,57 1,58 3.735,59 1.848,60 1.815,61 1.949,62 1.969,64 3.244,65 3.072,66 2.923,67 3.362,68 1.524,69 1.305,70 0.917,71 0.572,72 0.771,73 0.803,74 0.822,75 0.191,76 0.709,77 1.384,78 1.455,79 0.291,80 2.847,81 3.335,82 5.986,83 3.466,84 3.572,85 3.134,86 3.091,87 3.887,88 3.443,89 3.387,90 3.315,91 3.196,92 3.668,93 2.736,94 3.543,95 2.212,96 3.19,97 2.784,98 -0.025,99 134.606,100 28,101 30,102 13,103 3,104 3,105 10,106 5.017,107 9.386,108 9.931,109 105.94,110 105.94,111 105.94,112 105.94,113 17,114 28.134,115 31.159,116 3.833,117 6.834,118 20.955,119 4.725,120 2.764,121 2.759,122 2.373,123 2.161,124 4.523}
{0 CHEMBL502413,1 1.355,2 1.209,3 1.139,4 147.245,5 151.245,6 153.245,7 2.486,8 4.295,9 4.538,10 7.192,11 3.478,12 2.043,13 1.122,14 2.671,15 1.015,16 4.263,17 4.317,18 4.331,19 1.122,20 2.671,21 2.892,22 2.645,23 2.658,24 1.454,25 0.53,26 1.456,27 1.105,28 0.844,29 1.112,30 2.208,31 3.591,32 4.351,33 4.402,34 4.633,35 2.47,36 4.361,37 4.078,38 5.275,39 5.646,40 12.275,41 5.78,42 5.721,43 6.146,44 4.37,46 0.092,47 5.401,48 3.946,49 3.363,50 1.191,51 0.955,52 0.045,53 3.304,54 2.335,55 1.437,56 7,57 3,58 3.857,59 1.935,60 1.907,61 2.035,62 2.051,63 -0.009,64 3.426,65 3.249,66 3.516,67 3.855,68 1.748,69 1.409,70 0.981,71 0.468,72 0.667,73 0.77,74 0.762,75 0.174,76 0.709,77 1.58,78 1.593,79 0.294,80 3.226,81 5.006,82 6.929,83 3.629,84 3.736,85 3.162,86 3.198,87 4.157,88 3.516,89 3.555,90 3.593,91 3.551,92 4.064,93 3.25,94 4.152,95 2.614,96 3.102,97 3.026,98 0.181,99 160,100 32,101 34,102 14,103 3,104 4,105 10,106 5.755,107 10.043,108 11.807,109 105.94,110 105.94,111 113.699,112 105.94,113 15,114 33.687,115 37.032,116 4.09,117 7.46,118 22.5,119 5.026,120 2.826,121 2.751,122 2.405,123 2.216,124 4.523}
{0 CHEMBL503704,1 1.318,2 1.269,3 1.221,4 119.627,5 122.382,6 122.382,7 2.427,8 4.002,9 4,10 7.727,11 2.297,12 1.917,13 1,14 2.136,15 0.916,16 3.932,17 3.97,18 3.97,19 1,20 2.136,21 2.776,22 2.511,23 2.501,24 1.358,25 0.383,26 1.419,27 0.918,28 0.635,29 0.912,30 2.101,31 3.31,32 3.807,33 3.689,34 3.872,35 2.073,36 3.249,37 3.293,38 3.855,39 4.032,40 9.005,41 3.129,42 3.204,43 3.74,44 3.248,46 0.092,47 5.062,48 3.867,49 3.08,50 0.974,51 0.783,53 2.974,54 2.12,55 1.297,56 1,58 3.667,59 1.841,60 1.806,61 1.948,62 1.962,64 3.188,65 3.042,66 2.496,67 2.699,68 1.457,69 1.319,70 0.813,71 0.477,72 0.658,73 0.736,74 0.737,75 0.191,76 0.717,77 1.402,78 1.46,79 0.291,80 2.755,81 3.19,82 5.986,83 3.446,84 3.554,85 3.083,86 3.057,87 3.862,88 3.378,89 3.339,90 3.247,91 3.126,92 3.586,93 2.669,94 3.494,95 2.056,96 3.08,97 2.745,98 -0.027,99 128.382,100 27,101 29,102 12,103 3,104 3,105 9,106 4.883,107 9.386,108 9.73,109 94.169,110 94.169,111 94.169,112 94.169,113 17,114 27.353,115 30.242,116 3.808,117 6.738,118 20.199,119 4.69,120 2.679,121 2.726,122 2.331,123 2.116,124 4.523}
{0 CHEMBL509297,1 1.355,2 1.208,3 1.137,4 157.71,5 159.71,6 159.71,7 2.565,8 4.328,9 4.488,10 7.545,11 3.362,12 2.043,13 1.123,14 2.671,15 1.015,16 4.277,17 4.369,18 4.331,19 1.123,20 2.671,21 2.895,22 2.66,23 2.667,24 1.538,25 0.53,26 1.456,27 1.105,28 0.844,29 1.112,30 2.233,31 3.569,32 4.317,33 4.38,34 4.576,35 2.386,36 4.368,37 3.94,38 5.048,39 5.382,40 11.167,41 5.331,42 5.359,43 6.274,44 4.481,46 0.097,47 5.406,48 3.94,49 3.433,50 1.161,51 0.951,52 0.041,53 3.18,54 2.258,55 1.439,56 5,57 2,58 3.832,59 1.914,60 1.887,61 2.021,62 2.042,63 0.099,64 3.502,65 3.331,66 4.208,67 3.804,68 1.769,69 1.409,70 0.982,71 0.601,72 0.768,73 0.86,74 0.851,75 0.176,76 0.709,77 1.579,78 1.593,79 0.301,80 3.23,81 5.43,82 6.225,83 3.672,84 3.769,85 3.158,86 3.215,87 4.205,88 3.497,89 3.551,90 3.569,91 3.551,92 4.199,93 3.267,94 4.073,95 2.716,96 3.008,97 2.867,98 0.272,99 166.465,100 33,101 35,102 14,103 3,104 4,105 10,106 5.921,107 10.146,108 12.007,109 105.94,110 105.94,111 115.757,112 105.94,113 15,114 35.014,115 38.242,116 4.084,117 7.275,118 22.955,119 4.867,120 2.829,121 2.851,122 2.478,123 2.242,124 5}
{0 CHEMBL510166,1 1.319,2 1.269,3 1.221,4 117.697,5 129.207,6 131.207,7 2.521,8 4.061,9 4.254,10 10.278,11 3.806,12 2,13 1,14 2.136,15 1,16 3.932,17 3.97,18 3.97,19 1,20 2.136,21 2.925,22 2.735,23 2.715,24 1.358,25 0.393,26 1.419,27 1.107,28 0.821,29 1.062,30 2.215,31 3.535,32 4.031,33 3.89,34 4.094,35 3.148,36 4.181,37 5.199,38 5.491,39 6.873,40 13.303,41 5.275,42 6.444,43 5.773,44 3.487,46 0.092,47 5.062,48 3.921,49 3.089,50 1.095,51 1.063,52 0.218,53 3.357,54 2.457,55 1.562,56 10,57 6,58 3.806,59 1.907,60 1.881,61 2.021,62 2.001,64 3.377,65 3.189,66 3.34,67 4.096,68 1.69,69 1.319,70 0.967,71 0.635,72 0.899,73 0.832,74 0.868,75 0.191,76 0.695,77 1.404,78 1.46,79 0.291,80 2.958,81 4.447,82 5.986,83 3.504,84 3.607,85 3.228,86 3.157,87 3.936,88 3.555,89 3.465,90 3.408,91 3.288,92 3.742,93 2.819,94 3.63,95 2.521,96 3.454,97 2.795,99 147.207,100 30,101 32,102 15,103 3,104 3,105 12,106 5.283,107 9.386,108 10.307,109 129.482,110 129.482,111 129.482,112 129.482,113 17,114 29.698,115 32.993,116 3.87,117 6.92,118 22.466,119 4.795,120 2.854,121 2.8,122 2.422,123 2.213,124 4.523}
{0 CHEMBL510479,1 1.355,2 1.196,3 1.138,4 136.881,5 138.881,6 138.881,7 2.482,8 4.123,9 4.318,10 3.41,11 2.925,12 1.891,13 0.942,14 2.266,15 0.884,16 4.111,17 4.174,18 4.19,19 0.942,20 2.266,21 2.884,22 2.659,23 2.673,24 1.425,25 0.523,26 1.431,27 1.056,28 0.824,29 1.013,30 2.205,31 3.631,32 4.126,33 4.047,34 4.25,35 1.964,36 3.251,37 3.377,38 4.876,39 4.92,40 13.453,41 4.852,42 5.21,43 5.494,44 4.087,46 0.093,47 5.376,48 3.942,49 3.289,50 1.16,51 0.95,52 0.041,53 3.718,54 2.361,55 1.559,56 5,57 6,58 3.849,59 1.912,60 1.889,61 1.987,62 2.034,63 0.576,64 3.369,65 3.237,66 3.196,67 3.626,68 1.594,69 1.408,70 0.769,71 0.354,72 0.624,73 0.603,74 0.638,75 0.185,76 0.747,77 1.57,78 1.589,79 0.287,80 3.192,81 4.421,82 6.027,83 3.523,84 3.621,85 3.168,86 3.155,87 3.996,88 3.543,89 3.515,90 3.553,91 3.387,92 3.876,93 3.12,94 3.766,95 1.857,96 3.082,97 2.862,98 0.147,99 140.881,100 29,101 31,102 13,103 3,104 4,105 9,106 5.279,107 9.732,108 11.025,109 94.169,110 94.169,111 94.169,112 94.169,113 15,114 29.913,115 32.486,116 3.948,117 7.081,118 22.642,119 4.862,120 2.835,121 2.589,122 2.401,123 2.209,124 4.523}
{0 CHEMBL510780,1 1.5,2 1.401,3 1.325,4 174.75,5 184.75,6 186.75,7 2.793,8 4.428,9 4.779,10 14.317,11 7.246,12 2.266,13 1.267,14 2.817,15 1.265,16 4.466,17 4.615,18 4.635,19 1.267,20 2.817,21 2.979,22 2.776,23 2.77,24 1.645,25 0.772,26 1.646,27 1.14,28 0.893,29 1.135,30 2.554,31 3.839,32 4.524,33 4.424,34 4.702,35 4.55,36 5.961,37 8.321,38 7.648,39 11.102,40 20.659,41 7.359,42 10.783,43 9.515,44 4.728,45 4,46 0.107,47 5.414,48 4.002,49 3.473,50 1.432,51 1.097,52 0.301,53 4.07,54 3.09,55 2.199,56 13,57 10,58 3.914,59 1.998,60 1.968,61 2.128,62 2.104,63 3.581,64 3.571,65 3.463,66 4.991,67 7.187,68 2.371,69 1.559,70 1.122,71 0.759,72 1.075,73 0.951,74 0.998,75 0.175,76 0.642,77 1.777,78 1.745,79 0.274,80 3.41,81 8.43,82 6.206,83 3.72,84 3.85,85 3.33,86 3.292,87 4.259,88 3.75,89 3.68,90 3.729,91 3.601,92 4.332,93 3.286,94 4.215,95 3.274,96 3.885,97 3.013,98 0.376,99 192.75,100 37,101 40,102 17,103 4,104 6,105 17,106 6.45,107 10.303,108 12.646,109 176.567,110 176.567,111 176.567,112 176.567,113 19,114 36.491,115 41.401,116 4.119,117 7.449,118 25.347,119 5.013,120 2.911,121 2.872,122 2.711,123 2.539,124 5.658}
{0 CHEMBL511710,1 1.502,2 1.4,3 1.325,4 178.75,5 184.75,6 186.75,7 2.789,8 4.425,9 4.776,10 11.471,11 7.05,12 2.349,13 1.364,14 2.958,15 1.341,16 4.615,17 4.762,18 4.804,19 1.364,20 2.958,21 2.979,22 2.777,23 2.77,24 1.621,25 0.772,26 1.636,27 1.138,28 0.893,29 1.134,30 2.597,31 3.95,32 4.544,33 4.454,34 4.697,35 3.841,36 5.642,37 7.46,38 8.255,39 10.648,40 22.776,41 8.007,42 10.502,43 9.421,44 5.372,45 4,46 0.108,47 5.422,48 4.006,49 3.473,50 1.434,51 1.097,52 0.246,53 4.919,54 3.491,55 2.646,56 11,57 12,58 3.927,59 1.992,60 1.969,61 2.102,62 2.091,63 3.232,64 3.702,65 3.628,66 5.408,67 6.876,68 2.338,69 1.546,70 1.078,71 0.743,72 1.007,73 0.905,74 0.954,75 0.176,76 0.687,77 1.684,78 1.711,79 0.276,80 3.521,81 8.364,82 6.248,83 3.736,84 3.847,85 3.39,86 3.352,87 4.278,88 3.828,89 3.76,90 3.84,91 3.698,92 4.325,93 3.398,94 4.211,95 2.969,96 3.644,97 3.031,98 0.465,99 192.75,100 37,101 40,102 17,103 4,104 6,105 15,106 6.569,107 10.521,108 13.606,109 153.024,110 153.024,111 153.024,112 153.024,113 19,114 37.138,115 41.289,116 4.17,117 7.503,118 27.063,119 5.031,120 2.911,121 2.868,122 2.732,123 2.577,124 5.742}
{0 CHEMBL511783,1 1.36,2 1.288,3 1.217,4 151.245,5 153.245,6 153.245,7 2.546,8 4.242,9 4.508,10 10.737,11 4.133,12 1.863,13 0.903,14 2.224,15 0.861,16 4.06,17 4.111,18 4.094,19 0.903,20 2.224,21 2.891,22 2.639,23 2.655,24 1.507,25 0.562,26 1.526,27 1.105,28 0.844,29 1.111,30 2.227,31 3.591,32 4.265,33 4.161,34 4.395,35 3.259,36 4.152,37 5.518,38 5.156,39 6.828,40 17.146,41 5.634,42 7.793,43 7.308,44 3.796,46 0.094,47 5.374,48 3.943,49 3.33,50 1.2,51 0.965,52 0.077,53 3.078,54 2.213,55 1.36,56 9,57 5,58 3.851,59 1.94,60 1.91,61 2.063,62 2.056,63 0.719,64 3.417,65 3.256,66 3.704,67 5.031,68 1.822,69 1.415,70 1.002,71 0.528,72 0.888,73 0.776,74 0.823,75 0.182,76 0.673,77 1.615,78 1.604,79 0.29,80 3.192,81 6.563,82 6.098,83 3.587,84 3.711,85 3.17,86 3.15,87 4.072,88 3.525,89 3.49,90 3.511,91 3.405,92 4.025,93 3.111,94 3.931,95 2.523,96 3.419,97 2.862,98 0.103,99 160,100 32,101 34,102 14,103 3,104 4,105 13,106 6.076,107 9.614,108 10.709,109 141.253,110 141.253,111 141.253,112 141.253,113 15,114 32.149,115 36.013,116 3.963,117 7.131,118 22.688,119 4.862,120 2.825,121 2.657,122 2.441,123 2.22,124 4.971}
{0 CHEMBL512698,1 1.365,2 1.307,3 1.262,4 141.58,5 141.58,6 141.58,7 2.485,8 4.19,9 4.459,10 6.658,11 3.32,12 2,13 1,14 2.275,15 1,16 4.174,17 4.174,18 4.205,19 1,20 2.275,21 2.925,22 2.735,23 2.715,24 1.581,25 0.531,26 1.563,27 1.107,28 0.843,29 1.11,30 2.209,31 3.548,32 4.262,33 4.151,34 4.367,35 2.362,36 3.624,37 3.897,38 4.628,39 5.184,40 13.616,41 4.869,42 5.368,43 5.839,44 3.721,46 0.09,47 5.375,48 3.944,49 3.409,50 1.171,51 0.955,52 0.042,53 3.143,54 2.126,55 1.369,56 5,57 2,58 3.859,59 1.939,60 1.91,61 2.041,62 2.072,63 0.493,64 3.35,65 3.191,66 3.344,67 3.688,68 1.688,69 1.418,70 1.007,71 0.498,72 0.699,73 0.776,74 0.776,75 0.183,76 0.708,77 1.582,78 1.644,79 0.29,80 3.151,81 4.477,82 6.027,83 3.598,84 3.706,85 3.129,86 3.152,87 4.059,88 3.489,89 3.504,90 3.531,91 3.428,92 4.054,93 3.119,94 3.894,95 2.203,96 3.062,97 2.862,98 0.157,99 153.58,100 31,101 33,102 13,103 3,104 4,105 10,106 5.61,107 10.013,108 11.243,109 105.94,110 105.94,111 105.94,112 105.94,113 15,114 32.138,115 35.1,116 4.057,117 7.261,118 22.08,119 4.862,120 2.854,121 2.812,122 2.405,123 2.216,124 4.523}
{0 CHEMBL513544,1 1.77,2 1.427,3 1.373,4 186.968,5 200.477,6 206.477,7 2.925,8 4.484,9 4.834,10 13.149,11 11.712,12 2.072,13 1.131,14 2.732,15 1.057,16 4.585,17 4.71,18 4.718,19 1.131,20 2.732,21 3.016,22 2.783,23 2.78,24 1.602,25 0.784,26 1.606,27 1.127,28 0.847,29 1.127,30 2.735,31 3.943,32 4.608,33 4.648,34 4.878,35 4.406,36 5.631,37 7.42,38 7.79,39 10.406,40 22.497,41 8.321,42 11.367,43 11.894,44 4.983,45 2,46 0.103,47 5.418,48 3.962,49 3.502,50 1.295,51 1.065,52 0.286,53 4.328,54 3.141,55 2.116,56 16,57 11,58 3.868,59 1.97,60 1.939,61 2.091,62 2.081,63 0.855,64 3.978,65 4.033,66 8.987,67 11.952,68 2.447,69 1.812,70 1.181,71 0.886,72 1.148,73 1.062,74 1.107,75 0.18,76 0.681,77 1.856,78 1.951,79 0.285,80 4.062,81 12.097,82 6.356,83 3.848,84 3.965,85 3.476,86 3.446,87 4.335,88 3.847,89 3.797,90 3.851,91 3.82,92 4.878,93 3.956,94 4.837,95 3.39,96 3.903,97 2.916,98 0.935,99 226.477,100 42,101 45,102 20,103 4,104 5,105 17,106 7.41,107 10.169,108 14.57,109 188.338,110 188.338,111 188.338,112 188.338,113 21,114 41.916,115 46.844,116 4.254,117 7.455,118 30.211,119 4.916,120 2.945,121 2.925,122 2.854,123 2.715,124 5.125}
{0 CHEMBL513561,1 1.355,2 1.208,3 1.136,4 136.881,5 138.881,6 138.881,7 2.482,8 4.125,9 4.318,10 6.088,11 3.271,12 1.866,13 0.905,14 2.22,15 0.863,16 4.078,17 4.143,18 4.06,19 0.905,20 2.22,21 2.886,22 2.638,23 2.654,24 1.449,25 0.53,26 1.456,27 1.063,28 0.824,29 1.02,30 2.205,31 3.56,32 4.126,33 4.035,34 4.252,35 2.327,36 3.421,37 3.906,38 4.82,39 5.525,40 16.673,41 4.845,42 5.553,43 5.782,44 3.766,46 0.092,47 5.378,48 3.941,49 3.29,50 1.16,51 0.951,52 0.041,53 3.308,54 2.228,55 1.379,56 7,57 4,58 3.837,59 1.915,60 1.888,61 2.011,62 2.038,63 0.592,64 3.339,65 3.197,66 3.235,67 3.819,68 1.614,69 1.409,70 0.843,71 0.355,72 0.633,73 0.612,74 0.645,75 0.182,76 0.719,77 1.579,78 1.592,79 0.286,80 3.192,81 4.766,82 6.227,83 3.513,84 3.623,85 3.131,86 3.119,87 3.984,88 3.492,89 3.465,90 3.489,91 3.359,92 3.876,93 3.12,94 3.769,95 2.036,96 3.149,97 2.862,98 0.092,99 140.881,100 29,101 31,102 13,103 3,104 4,105 10,106 5.219,107 9.646,108 10.548,109 105.94,110 105.94,111 105.94,112 105.94,113 15,114 29.589,115 32.542,116 3.916,117 7.064,118 21.784,119 4.862,120 2.824,121 2.591,122 2.401,123 2.209,124 4.719}
{0 CHEMBL523462,1 1.386,2 1.309,3 1.275,4 130.881,5 136.881,6 138.881,7 2.509,8 4.065,9 4.153,10 9.59,11 3.371,12 1.956,13 1,14 2.136,15 0.953,16 3.932,17 3.97,18 3.97,19 1,20 2.136,21 2.858,22 2.599,23 2.593,24 1.379,25 0.536,26 1.426,27 1.035,28 0.719,29 1.003,30 2.209,31 3.483,32 3.952,33 3.845,34 4.049,35 2.892,36 4.042,37 4.647,38 5.023,39 5.7,40 11.651,41 4.475,42 5.429,43 5.449,44 3.549,45 1,46 0.092,47 5.062,48 3.897,49 3.16,50 1.083,51 0.974,52 0.118,53 3.386,54 2.485,55 1.606,56 4,57 1,58 3.751,59 1.855,60 1.818,61 1.972,62 1.982,63 0.776,64 3.33,65 3.173,66 3.219,67 3.927,68 1.66,69 1.402,70 0.828,71 0.488,72 0.754,73 0.745,74 0.755,75 0.191,76 0.702,77 1.539,78 1.547,79 0.291,80 2.914,81 4.344,82 5.986,83 3.48,84 3.58,85 3.188,86 3.128,87 3.928,88 3.51,89 3.43,90 3.37,91 3.25,92 3.713,93 2.782,94 3.651,95 2.414,96 3.314,97 2.754,98 -0.025,99 140.881,100 29,101 31,102 14,103 3,104 3,105 11,106 5.267,107 9.386,108 10.208,109 129.482,110 129.482,111 129.482,112 129.482,113 17,114 28.916,115 32.076,116 3.852,117 6.864,118 21.71,119 4.703,120 2.775,121 2.729,122 2.415,123 2.21,124 4.523}
{0 CHEMBL523626,1 1.305,2 1.199,3 1.177,4 108.211,5 114.211,6 120.211,7 2.248,8 3.932,9 3.959,10 7.437,11 2.232,12 1.781,13 0.854,14 2.136,15 0.781,16 3.97,17 3.97,18 3.97,19 0.854,20 2.136,21 2.827,22 2.552,23 2.556,24 1.231,25 0.376,26 1.299,27 1.025,28 0.701,29 0.996,30 1.867,31 3.38,32 3.781,33 3.649,34 3.818,35 2.291,36 3.337,37 3.493,38 4.002,39 4.617,40 9.785,41 3.788,42 3.864,43 3.73,44 3.166,46 0.096,47 5.018,48 3.908,49 2.929,50 0.974,51 0.965,52 0.052,53 3.18,54 2.302,55 1.446,56 2,57 1,58 3.729,59 1.847,60 1.811,61 1.952,62 1.969,64 3.209,65 2.978,66 2.256,67 2.646,68 1.472,69 1.314,70 0.797,71 0.372,72 0.594,73 0.637,74 0.65,75 0.186,76 0.724,77 1.395,78 1.43,79 0.285,80 2.698,81 3.589,82 6.089,83 3.387,84 3.48,85 3.112,86 3.058,87 3.81,88 3.426,89 3.359,90 3.29,91 3.169,92 3.492,93 2.609,94 3.428,95 2.014,96 3.13,97 2.787,98 -0.025,99 122.211,100 26,101 28,102 13,103 3,104 3,105 9,106 4.767,107 9.361,108 9.543,109 105.94,110 105.94,111 105.94,112 105.94,113 17,114 26.033,115 28.661,116 3.809,117 6.887,118 19.949,119 4.734,120 2.747,121 2.674,122 2.138,123 1.881,124 4.523}
{0 CHEMBL525408,1 1.745,2 1.787,3 1.738,4 1674.91,5 1863.31,6 1953.68,7 3.842,8 6.416,9 6.939,10 119.863,11 124.049,12 3.836,13 2.85,14 8.869,15 2.801,16 5.864,17 5.981,18 6.026,19 2.85,20 8.869,21 3.887,22 3.653,23 3.668,24 1.997,25 1.272,26 1.985,27 1.94,28 1.692,29 1.956,30 3.628,31 5.67,32 6.719,33 6.795,34 6.998,35 30.681,36 37.895,37 55.276,38 48.505,39 71.908,40 221.819,41 50.414,42 76.509,43 86.4,44 40.823,45 37,46 0.087,47 5.27,48 3.913,49 3.905,50 1.335,51 1.315,52 1.246,53 26.006,54 18.264,55 12.548,56 4,58 3.756,59 1.808,60 1.76,61 2.014,62 2.006,63 -9.226,64 5.872,65 6.014,66 79.748,67 113.964,68 15.319,69 1.794,70 1.902,71 1.713,72 1.884,73 1.919,74 1.913,75 0.197,76 0.591,77 1.984,78 1.994,79 0.314,80 6.122,81 101.53,82 6.626,83 5.665,84 5.81,85 5.07,86 5.049,87 6.226,88 5.464,89 5.406,90 5.6,91 5.718,92 7.282,93 6.044,94 7.333,95 22.395,96 6.286,97 3.038,98 3.623,99 2171.22,100 269,101 272,102 79,103 4,104 7,105 131,106 45.7,107 11.345,108 75.295,109 1082.94,110 1082.94,111 1082.94,112 1082.94,113 49,114 274.497,115 309.913,116 5.894,117 9.199,118 165.745,119 4.958,120 3.838,121 3.859,122 3.792,123 3.626,124 9.775}
