{
  "data_features": {
    "feature": [
      {
        "data_type": "nominal",
        "index": "0",
        "is_ignore": "false",
        "is_row_identifier": "true",
        "is_target": "false",
        "name": "molecule_id",
        "nominal_value": [
          "CHEMBL118",
          "CHEMBL17",
          "CHEMBL18",
          "CHEMBL185198",
          "CHEMBL19",
          "CHEMBL20",
          "CHEMBL21",
          "CHEMBL218490",
          "CHEMBL220492",
          "CHEMBL266026",
          "CHEMBL266240",
          "CHEMBL268177",
          "CHEMBL355001",
          "CHEMBL38703",
          "CHEMBL418",
          "CHEMBL419",
          "CHEMBL6724",
          "CHEMBL68253",
          "CHEMBL6852",
          "CHEMBL6853",
          "CHEMBL7087",
          "CHEMBL7092",
          "CHEMBL7204",
          "CHEMBL865"
        ],
        "number_of_missing_values": "0"
      },
      {
        "data_type": "numeric",
        "index": "1",
        "is_ignore": "false",
        "is_row_identifier": "false",
        "is_target": "false",
        "name": "AMW",
        "number_of_missing_values": "0"
      },
      {
        "data_type": "numeric",
        "index": "2",
        "is_ignore": "false",
        "is_row_identifier": "false",
        "is_target": "false",
        "name": "C.",
        "number_of_missing_values": "0"
      },
      {
        "data_type": "numeric",
        "index": "3",
        "is_ignore": "false",
        "is_row_identifier": "false",
        "is_target": "false",
        "name": "H.",
        "number_of_missing_values": "0"
      },
      {
        "data_type": "numeric",
        "index": "4",
        "is_ignore": "false",
        "is_row_identifier": "false",
        "is_target": "false",
        "name": "Me",
        "number_of_missing_values": "0"
      },
      {
        "data_type": "numeric",
        "index": "5",
        "is_ignore": "false",
        "is_row_identifier": "false",
        "is_target": "true",
        "name": "pXC50",
        "number_of_missing_values": "0"
      }
    ]
  }
}