{
  "data_features": {
    "feature": [
      {
        "data_type": "nominal",
        "index": "0",
        "is_ignore": "false",
        "is_row_identifier": "true",
        "is_target": "false",
        "name": "molecule_id",
        "nominal_value": [
          "CHEMBL117",
          "CHEMBL122532",
          "CHEMBL124885",
          "CHEMBL150",
          "CHEMBL151",
          "CHEMBL164",
          "CHEMBL2071343",
          "CHEMBL2071344",
          "CHEMBL2071345",
          "CHEMBL2071346",
          "CHEMBL2071347",
          "CHEMBL2071348",
          "CHEMBL2071349",
          "CHEMBL2071350",
          "CHEMBL2071351",
          "CHEMBL2071352",
          "CHEMBL2071353",
          "CHEMBL210635",
          "CHEMBL214321",
          "CHEMBL226034",
          "CHEMBL243664",
          "CHEMBL253346",
          "CHEMBL279564",
          "CHEMBL28",
          "CHEMBL283196",
          "CHEMBL296411",
          "CHEMBL309490",
          "CHEMBL312149",
          "CHEMBL312248",
          "CHEMBL312848",
          "CHEMBL314132",
          "CHEMBL314445",
          "CHEMBL315422",
          "CHEMBL342696",
          "CHEMBL379064",
          "CHEMBL399121",
          "CHEMBL399910",
          "CHEMBL40919",
          "CHEMBL413956",
          "CHEMBL42427",
          "CHEMBL42428",
          "CHEMBL43013",
          "CHEMBL43065",
          "CHEMBL43395",
          "CHEMBL43396",
          "CHEMBL43740",
          "CHEMBL43741",
          "CHEMBL441035",
          "CHEMBL44156",
          "CHEMBL44509",
          "CHEMBL46909",
          "CHEMBL470266",
          "CHEMBL486598",
          "CHEMBL487402",
          "CHEMBL490170",
          "CHEMBL50",
          "CHEMBL55415",
          "CHEMBL72637",
          "CHEMBL74189",
          "CHEMBL81923",
          "CHEMBL8260",
          "CHEMBL85106",
          "CHEMBL85139",
          "CHEMBL85740",
          "CHEMBL85826",
          "CHEMBL85960",
          "CHEMBL86022",
          "CHEMBL86078",
          "CHEMBL8996",
          "CHEMBL90568",
          "CHEMBL9352"
        ],
        "number_of_missing_values": "0"
      },
      {
        "data_type": "numeric",
        "index": "1",
        "is_ignore": "false",
        "is_row_identifier": "false",
        "is_target": "false",
        "name": "Mv",
        "number_of_missing_values": "0"
      },
      {
        "data_type": "numeric",
        "index": "2",
        "is_ignore": "false",
        "is_row_identifier": "false",
        "is_target": "false",
        "name": "nBM",
        "number_of_missing_values": "0"
      },
      {
        "data_type": "numeric",
        "index": "3",
        "is_ignore": "false",
        "is_row_identifier": "false",
        "is_target": "false",
        "name": "nCsp3",
        "number_of_missing_values": "0"
      },
      {
        "data_type": "numeric",
        "index": "4",
        "is_ignore": "false",
        "is_row_identifier": "false",
        "is_target": "false",
        "name": "H.",
        "number_of_missing_values": "0"
      },
      {
        "data_type": "numeric",
        "index": "5",
        "is_ignore": "false",
        "is_row_identifier": "false",
        "is_target": "true",
        "name": "pXC50",
        "number_of_missing_values": "0"
      }
    ]
  }
}