"molecule_id","Mv","nBM","nCsp3","H.","pXC50"
{1 0.707,2 14,4 34.5,5 7.708}
{0 CHEMBL122532,1 0.655,2 12,3 2,4 45.2,5 8.699}
{0 CHEMBL124885,1 0.653,2 14,3 4,4 40.9,5 6.174}
{0 CHEMBL150,1 0.707,2 14,4 32.3,5 7.348}
{0 CHEMBL151,1 0.707,2 14,4 32.3,5 7.177}
{0 CHEMBL164,1 0.708,2 14,4 30.3,5 7.569}
{0 CHEMBL2071343,1 0.65,2 13,3 2,4 47.1,5 6.523}
{0 CHEMBL2071344,1 0.65,2 13,3 2,4 47.1,5 6.301}
{0 CHEMBL2071345,1 0.65,2 13,3 2,4 47.1,5 5.26}
{0 CHEMBL2071346,1 0.641,2 13,3 3,4 47.4,5 5.959}
{0 CHEMBL2071347,1 0.641,2 13,3 3,4 47.4,5 5.699}
{0 CHEMBL2071348,1 0.641,2 13,3 3,4 47.4,5 5.959}
{0 CHEMBL2071349,1 0.641,2 13,3 3,4 47.4,5 5.824}
{0 CHEMBL2071350,1 0.633,2 13,3 4,4 47.6,5 6}
{0 CHEMBL2071351,1 0.633,2 13,3 4,4 47.6,5 6.046}
{0 CHEMBL2071352,1 0.633,2 13,3 4,4 47.6,5 6.301}
{0 CHEMBL2071353,1 0.69,2 13,3 1,4 43.3,5 6.523}
{0 CHEMBL210635,1 0.689,2 14,3 1,4 36.4,5 5.631}
{0 CHEMBL214321,1 0.69,2 14,3 1,4 35.3,5 7.699}
{0 CHEMBL226034,1 0.69,2 14,3 1,4 34.3,5 7.699}
{0 CHEMBL243664,1 0.689,2 14,3 1,4 36.4,5 8.155}
{0 CHEMBL253346,1 0.695,2 17,3 1,4 41.4,5 7.523}
{0 CHEMBL279564,1 0.717,2 19,4 38.5,5 8.699}
{0 CHEMBL28,1 0.707,2 14,4 33.3,5 7.398}
{0 CHEMBL283196,1 0.715,2 19,4 36.4,5 8.301}
{0 CHEMBL296411,1 0.629,2 13,3 3,4 47.4,5 6.102}
{0 CHEMBL309490,1 0.707,2 14,4 33.3,5 7.602}
{0 CHEMBL312149,1 0.683,2 18,3 3,4 38.5,5 6.959}
{0 CHEMBL312248,1 0.683,2 18,3 3,4 38.5,5 6.77}
{0 CHEMBL312848,1 0.683,2 18,3 3,4 38.5,5 6.854}
{0 CHEMBL314132,1 0.683,2 18,3 3,4 38.5,5 7.149}
{0 CHEMBL314445,1 0.672,2 18,3 4,4 39.5,5 7.097}
{0 CHEMBL315422,1 0.672,2 18,3 4,4 39.5,5 6.796}
{0 CHEMBL342696,1 0.853,2 12,4 22.7,5 7.959}
{0 CHEMBL379064,1 0.69,2 14,3 1,4 34.3,5 7.77}
{0 CHEMBL399121,1 0.666,2 13,3 3,4 38.9,5 6.292}
{0 CHEMBL399910,1 0.678,2 13,3 2,4 38.7,5 5.775}
{0 CHEMBL40919,1 0.69,2 14,3 1,4 35.3,5 7.602}
{0 CHEMBL413956,1 0.724,2 25,4 33.3,5 7.161}
{0 CHEMBL42427,1 0.627,2 13,3 4,4 45.2,5 6.174}
{0 CHEMBL42428,1 0.655,2 12,3 2,4 45.2,5 8.699}
{0 CHEMBL43013,1 0.641,2 13,3 2,4 45.5,5 6.337}
{0 CHEMBL43065,1 0.667,2 13,4 40,5 4.469}
{0 CHEMBL43395,1 0.631,2 13,3 3,4 46.2,5 6.409}
{0 CHEMBL43396,1 0.64,2 12,3 2,4 45.2,5 5.678}
{0 CHEMBL43740,1 0.639,2 13,3 3,4 44.7,5 7.013}
{0 CHEMBL43741,1 0.617,2 13,3 5,4 47.8,5 5.495}
{0 CHEMBL441035,1 0.622,2 13,3 4,4 47.6,5 4.754}
{0 CHEMBL44156,1 0.625,2 13,3 4,4 46.3,5 5.31}
{0 CHEMBL44509,1 0.622,2 13,3 4,4 47.6,5 5.523}
{0 CHEMBL46909,1 0.622,2 13,3 4,4 47.6,5 8.222}
{0 CHEMBL470266,1 0.665,2 13,3 3,4 40,5 5.99}
{0 CHEMBL486598,1 0.662,2 17,3 4,4 42.5,5 6.161}
{0 CHEMBL487402,1 0.664,2 14,3 3,4 39,5 7.456}
{0 CHEMBL490170,1 0.666,2 13,3 3,4 38.9,5 5.765}
{0 CHEMBL50,1 0.707,2 14,4 31.3,5 7.376}
{0 CHEMBL55415,1 0.707,2 14,4 32.3,5 6.658}
{0 CHEMBL72637,1 0.676,2 14,3 2,4 36.8,5 6.097}
{0 CHEMBL74189,1 0.633,2 13,3 4,4 47.6,5 5.585}
{0 CHEMBL81923,1 0.672,2 18,3 3,4 41,5 6.481}
{0 CHEMBL8260,1 0.707,2 14,4 33.3,5 6.585}
{0 CHEMBL85106,1 0.721,2 18,3 2,4 34.3,5 7.046}
{0 CHEMBL85139,1 0.698,2 18,3 2,4 37.1,5 7.26}
{0 CHEMBL85740,1 0.672,2 18,3 4,4 39.5,5 5.619}
{0 CHEMBL85826,1 0.683,2 18,3 3,4 38.5,5 7.076}
{0 CHEMBL85960,1 0.727,2 18,3 2,4 34.3,5 6.921}
{0 CHEMBL86022,1 0.672,2 18,3 4,4 39.5,5 6.854}
{0 CHEMBL86078,1 0.721,2 18,3 2,4 34.3,5 7.432}
{0 CHEMBL8996,1 0.68,2 13,3 2,4 36.4,5 5.891}
{0 CHEMBL90568,1 0.69,2 14,3 1,4 35.3,5 7.667}
{0 CHEMBL9352,1 0.679,2 13,3 2,4 37.5,5 5.437}
