{
  "data_set_description": {
    "collection_date": "November 2013",
    "creator": "Dr Jeremy Besnard, Dr Ivan Olier, Dr Noureddin Sadawi, Dr Larisa Soldatova, Dr Crina Grosan, Prof Ross King, Dr Richard Bickerton, Prof Andrew Hopkins and Dr Willem van Hoorn",
    "default_target_attribute": "pXC50",
    "description": "This dataset contains QSAR data (from ChEMBL version 17) showing activity values (unit is pseudo-pCI50) of several compounds on drug target ChEMBL_ID: CHEMBL2266 (TID: 11633), and it has 20 rows and 43 features (not including molecule IDs and class feature: molecule_id and pXC50). The features represent Basic Molecular Descriptors which were generated from SMILES strings.  Missing value imputation was applied to this dataset (By choosing the Median).",
    "description_version": "1",
    "file_id": "3327090",
    "format": "ARFF",
    "id": "27327",
    "licence": "Public",
    "md5_checksum": "e9b5ef7e111a6ff93077c05b5a499273",
    "minio_url": "https://data.openml.org/datasets/0002/27327/dataset_27327.pq",
    "name": "QSAR-DATASET-FOR-DRUG-TARGET-CHEMBL2266",
    "original_data_url": "https://www.ebi.ac.uk/chembl/target/inspect/CHEMBL2266",
    "parquet_url": "https://data.openml.org/datasets/0002/27327/dataset_27327.pq",
    "processing_date": "2018-10-04 00:14:05",
    "row_id_attribute": "molecule_id",
    "status": "deactivated",
    "tag": [
      "MetaQSAR",
      "study_13"
    ],
    "upload_date": "2016-07-14T21:18:57",
    "url": "https://api.openml.org/data/v1/download/3327090/QSAR-DATASET-FOR-DRUG-TARGET-CHEMBL2266.arff",
    "version": "7",
    "visibility": "public"
  }
}