{
  "data_set_description": {
    "collection_date": "November 2013",
    "creator": "Dr Jeremy Besnard, Dr Ivan Olier, Dr Noureddin Sadawi, Dr Larisa Soldatova, Dr Crina Grosan, Prof Ross King, Dr Richard Bickerton, Prof Andrew Hopkins and Dr Willem van Hoorn",
    "default_target_attribute": "pXC50",
    "description": "This dataset contains QSAR data (from ChEMBL version 17) showing activity values (unit is pseudo-pCI50) of several compounds on drug target ChEMBL_ID: CHEMBL5082 (TID: 101056), and it has 79 rows and 43 features (not including molecule IDs and class feature: molecule_id and pXC50). The features represent Basic Molecular Descriptors which were generated from SMILES strings.  Missing value imputation was applied to this dataset (By choosing the Median).",
    "description_version": "1",
    "file_id": "3326595",
    "format": "ARFF",
    "id": "27318",
    "licence": "Public",
    "md5_checksum": "f635720f7d61c22c217544025306e9f7",
    "minio_url": "https://data.openml.org/datasets/0002/27318/dataset_27318.pq",
    "name": "QSAR-DATASET-FOR-DRUG-TARGET-CHEMBL5082",
    "original_data_url": "https://www.ebi.ac.uk/chembl/target/inspect/CHEMBL5082",
    "parquet_url": "https://data.openml.org/datasets/0002/27318/dataset_27318.pq",
    "processing_date": "2018-10-04 00:23:55",
    "row_id_attribute": "molecule_id",
    "status": "deactivated",
    "tag": [
      "MetaQSAR",
      "study_13"
    ],
    "upload_date": "2016-07-14T21:17:29",
    "url": "https://api.openml.org/data/v1/download/3326595/QSAR-DATASET-FOR-DRUG-TARGET-CHEMBL5082.arff",
    "version": "8",
    "visibility": "public"
  }
}