"molecule_id","CATS2D_01_DA","nC.N.N.","NNRS","Rbrid","RCI","RFD","C.039","MATS1v","CATS2D_09_LL","CATS2D_04_DL","SpMax3_Bh.p.","SpMin4_Bh.e.","SpMin4_Bh.i.","CATS2D_05_DL","CATS2D_03_LL","CATS2D_04_LL","C.019","C.038","CATS2D_06_DL","Eig12_AEA.bo.","SpMax4_Bh.p.","SpMax4_Bh.v.","SpMax3_Bh.v.","NdsN","Eig02_AEA.dm.","CATS2D_07_DD","CATS2D_02_LL","C.030","Eig04_EA.ri.","SpMax4_Bh.e.","nPyrrolidines","CATS2D_07_DL","SpMin4_Bh.s.","SdssC","SpMin4_Bh.m.","SM05_EA.dm.","SM07_EA.dm.","SM09_EA.dm.","SM11_EA.dm.","SM13_EA.dm.","SM15_EA.dm.","SpMax3_Bh.s.","MATS5p","C.006","H.050","Hy","nHDon","GATS1p","N.071","nArNR2","NRS","CATS2D_07_AA","GATS5v","MATS5v","Eig02_AEA.ri.","CATS2D_02_AL","Eta_betaS_A","CATS2D_01_LL","Eig11_AEA.ri.","N.074","C.002","CATS2D_06_AA","pXC50"
{1 1,2 1,3 1,5 1,7 1,8 0.047,9 5,10 6,11 3.595,12 1.211,13 1.179,14 3,15 9,16 8,19 1,20 1.442,21 3.105,22 3.137,23 3.602,24 1,25 3.636,26 1,27 12,29 2.379,30 3.331,32 2,33 0.543,34 -0.292,35 1.467,36 6.713,37 9.395,38 12.076,39 14.758,40 17.441,41 20.124,42 7.999,43 0.032,45 2,46 0.304,47 2,48 0.968,51 3,53 1.035,54 -0.109,55 4.008,56 4,57 0.62,58 12,59 2,60 1,61 1,63 8.301}
{0 CHEMBL128263,1 1,2 1,3 1,5 1,7 1,8 0.053,9 10,10 4,11 3.721,12 1.65,13 1.609,14 4,15 13,16 13,17 1,18 1,19 3,20 2.484,21 3.609,22 3.617,23 3.724,24 1,25 3.698,26 1,27 15,29 2.518,30 3.736,32 2,33 1.002,34 1.509,35 1.852,36 3.123,37 4.612,38 6.055,39 7.47,40 8.866,41 10.252,42 7.43,43 0.002,45 2,46 0.193,47 2,48 0.977,51 4,53 0.961,54 0.045,55 4.038,56 5,57 0.613,58 12,59 2.151,60 1,61 4,63 8.509}
{0 CHEMBL128338,1 1,2 1,3 1,5 1,7 1,8 0.047,9 12,10 6,11 3.73,12 1.695,13 1.65,14 4,15 15,16 15,17 1,18 1,19 3,20 2.5,21 3.586,22 3.591,23 3.735,24 1,25 3.697,26 1,27 16,29 2.495,30 3.725,32 2,33 1.04,34 2.496,35 1.879,36 4.694,37 6.657,38 8.601,39 10.537,40 12.467,41 14.394,42 7.425,43 0.034,45 2,46 0.208,47 2,48 0.959,51 4,53 1.019,54 -0.007,55 3.999,56 7,57 0.617,58 14,59 2.21,60 1,61 5,63 8.26}
{0 CHEMBL128391,1 1,2 1,3 1,5 1,7 1,8 0.055,9 13,10 5,11 3.712,12 1.686,13 1.643,14 3,15 15,16 13,17 1,18 1,19 3,20 2.466,21 3.582,22 3.589,23 3.71,24 2,25 3.455,27 16,29 2.433,30 3.718,32 3,33 1.015,34 2.369,35 1.857,36 2.98,37 4.33,38 5.648,39 6.944,40 8.228,41 9.506,42 6.466,43 0.005,45 2,46 0.177,47 2,48 0.972,51 4,53 0.981,54 -0.006,55 3.993,56 6,57 0.608,58 15,59 2.212,60 2,61 5,62 1,63 9.585}
{0 CHEMBL128456,1 1,2 1,3 1,5 1,7 1,8 0.053,9 14,10 6,11 3.717,12 1.694,13 1.649,14 4,15 16,16 16,17 1,18 1,19 3,20 2.467,21 3.586,22 3.59,23 3.715,24 1,25 3.636,26 1,27 18,29 2.44,30 3.721,32 3,33 1.04,34 3.001,35 1.879,36 2.98,37 4.33,38 5.648,39 6.944,40 8.228,41 9.506,42 4.846,43 0.018,45 2,46 0.16,47 2,48 0.977,51 4,53 0.993,54 -0.013,55 3.999,56 5,57 0.603,58 16,59 2,60 1,61 5,63 9.721}
{0 CHEMBL128485,1 1,2 1,3 1,5 1,7 1,8 0.053,9 12,10 4,11 3.721,12 1.65,13 1.609,14 4,15 14,16 14,17 1,18 1,19 3,20 2.467,21 3.609,22 3.617,23 3.721,24 1,25 3.698,26 1,27 17,29 2.453,30 3.735,32 3,33 1.002,34 1.867,35 1.852,36 3.123,37 4.612,38 6.055,39 7.47,40 8.866,41 10.252,42 7.425,43 0.003,45 2,46 0.177,47 2,48 0.977,51 4,53 0.952,54 0.037,55 4.037,56 5,57 0.608,58 14,59 2.15,60 1,61 4,63 8.602}
{0 CHEMBL128619,1 1,2 1,3 1,5 1,7 1,8 0.053,9 14,10 5,11 3.721,12 1.651,13 1.61,14 4,15 16,16 16,17 1,18 1,19 3,20 2.467,21 3.609,22 3.615,23 3.721,24 1,25 3.698,26 1,27 18,29 2.449,30 3.73,32 3,33 1.011,34 2.763,35 1.859,36 3.123,37 4.612,38 6.055,39 7.47,40 8.866,41 10.252,42 4.853,43 0.006,45 2,46 0.16,47 2,48 0.977,51 4,53 0.979,54 0.019,55 4.035,56 5,57 0.603,58 16,59 2,60 1,61 4,63 8}
{0 CHEMBL128621,1 1,2 1,3 1,5 1,7 1,8 0.048,9 14,10 6,11 3.73,12 1.694,13 1.649,14 4,15 16,16 17,17 1,18 1,19 2,20 2.468,21 3.586,22 3.591,23 3.724,24 1,25 3.636,26 1,27 18,29 2.462,30 3.721,32 4,33 1.04,34 2.951,35 1.878,36 2.98,37 4.33,38 5.648,39 6.944,40 8.228,41 9.506,42 4.845,43 -0.045,45 2,46 0.177,47 2,48 0.82,51 4,53 1.031,54 -0.062,55 3.999,56 5,57 0.6,58 14,59 2.165,60 1,61 5,63 9.523}
{0 CHEMBL128783,1 1,2 1,3 1,5 1,7 1,8 0.05,9 14,10 6,11 3.717,12 1.692,13 1.65,14 5,15 15,16 16,17 1,18 1,19 3,20 2.467,21 3.59,22 3.594,23 3.716,24 1,25 3.644,26 1,27 19,29 2.446,30 3.724,32 3,33 1.037,34 2.718,35 1.861,36 2.98,37 4.33,38 5.648,39 6.944,40 8.228,41 9.506,42 4.963,43 0.013,45 2,46 0.177,47 2,48 0.904,51 4,53 0.994,54 -0.014,55 4.024,56 5,57 0.608,58 14,59 2.161,60 1,61 5,63 8.319}
{0 CHEMBL128877,1 1,2 1,3 1,5 1,7 1,8 0.051,9 12,10 4,11 3.734,12 1.65,13 1.609,14 4,15 14,16 14,17 1,18 1,19 3,20 2.619,21 3.609,22 3.618,23 3.737,24 1,25 4.058,26 1,27 17,29 2.638,30 3.737,32 3,33 1.002,34 1.574,35 1.852,36 3.123,37 4.612,38 6.055,39 7.47,40 8.866,41 10.252,42 7.425,43 -0.031,45 2,46 0.177,47 2,48 0.951,51 4,53 0.994,54 -0.001,55 4.041,56 6,57 0.609,58 14,59 2.204,60 2,61 4,63 8.495}
{0 CHEMBL129255,1 1,2 1,3 1,5 1,7 1,8 0.036,9 12,10 6,11 3.718,12 1.694,13 1.65,14 4,15 15,16 15,17 1,18 1,19 3,20 2.487,21 3.586,22 3.591,23 3.719,24 1,25 3.636,26 1,27 16,29 2.486,30 3.722,32 2,33 1.04,34 2.9,35 1.878,36 2.98,37 4.33,38 5.648,39 6.944,40 8.228,41 9.506,42 4.877,43 0.008,45 2,46 0.161,47 2,48 1.045,51 4,53 1.009,54 -0.009,55 3.999,56 7,57 0.613,58 14,59 2,60 1,61 5,63 9.155}
{0 CHEMBL129283,1 1,2 1,3 1,5 1,7 1,8 0.054,9 11,10 3,11 3.73,12 1.645,13 1.605,14 3,15 13,16 11,17 1,18 1,19 3,20 2.619,21 3.605,22 3.615,23 3.733,24 2,25 4.058,27 15,29 2.627,30 3.734,32 2,33 0.98,34 0.913,35 1.835,36 3.123,37 4.612,38 6.055,39 7.47,40 8.866,41 10.252,42 7.429,43 -0.047,45 2,46 0.192,47 2,48 0.945,51 4,53 0.979,54 0.011,55 4.056,56 7,57 0.614,58 14,59 2.241,60 3,61 4,62 1,63 9.481}
{0 CHEMBL129407,1 1,2 1,3 1,5 1,7 1,8 0.053,9 11,10 4,11 3.721,12 1.65,13 1.609,14 4,15 12,16 13,17 1,18 1,19 2,20 2.468,21 3.609,22 3.617,23 3.724,24 1,25 3.698,26 1,27 15,29 2.542,30 3.736,32 3,33 1.002,34 1.402,35 1.852,36 3.123,37 4.612,38 6.055,39 7.47,40 8.866,41 10.252,42 7.43,43 0.006,45 2,46 0.193,47 2,48 0.977,51 4,53 0.974,54 0.017,55 4.04,56 5,57 0.613,58 12,59 2.177,60 1,61 4,63 8.252}
{0 CHEMBL129600,1 1,2 1,3 1,5 1,7 1,8 0.048,9 11,10 4,11 3.733,12 1.65,13 1.609,14 4,15 12,16 13,17 1,18 1,19 2,20 2.59,21 3.609,22 3.618,23 3.74,24 1,25 3.781,26 1,27 15,29 2.716,30 3.74,32 3,33 1.002,34 1.229,35 1.852,36 4.721,37 6.689,38 8.627,39 10.556,40 12.48,41 14.402,42 7.43,43 -0.02,45 2,46 0.222,47 2,48 0.959,51 4,52 1,53 0.994,54 0.013,55 4.043,56 7,57 0.621,58 12,59 2.29,60 1,61 4,63 8.347}
{0 CHEMBL129668,1 1,2 1,3 1,5 1,7 1,8 0.049,9 12,10 4,11 3.731,12 1.65,13 1.609,14 2,15 14,16 19,17 1,18 1,19 5,20 2.487,21 3.609,22 3.617,23 3.731,24 1,25 3.709,26 1,27 16,29 2.63,30 3.736,32 3,33 1.002,34 1.445,35 1.852,36 3.123,37 4.612,38 6.055,39 7.47,40 8.866,41 10.252,42 7.425,43 0.039,45 2,46 0.208,47 2,48 0.841,51 4,53 0.92,54 0.061,55 4.074,56 5,57 0.617,58 10,59 2.333,60 1,61 4,63 9.886}
{0 CHEMBL129689,1 1,2 1,3 1,5 1,7 1,8 0.051,9 16,10 6,11 3.721,12 1.656,13 1.615,14 5,15 17,16 18,17 1,18 1,19 3,20 2.467,21 3.62,22 3.627,23 3.721,24 1,25 3.698,26 1,27 20,29 2.453,30 3.744,32 3,33 1.046,34 2.791,35 1.867,36 3.123,37 4.612,38 6.055,39 7.47,40 8.866,41 10.252,42 4.846,43 0.021,45 2,46 0.144,47 2,48 0.998,51 4,53 0.969,54 0.016,55 4.038,56 5,57 0.6,58 17,59 2.154,60 1,61 4,63 8.319}
{0 CHEMBL129691,1 1,2 1,3 1,5 1,7 1,8 -0.002,10 5,11 3.311,12 1.159,13 1.116,14 2,15 6,16 6,19 1,20 0.678,21 3.024,22 3.05,23 3.328,24 1,25 3.635,26 1,27 6,29 1.994,30 3.262,32 2,33 0.543,34 0.296,35 1.467,36 4.006,37 5.61,38 7.174,39 8.724,40 10.269,41 11.815,42 4.832,43 -0.052,44 1,45 2,46 0.41,47 2,48 1.18,51 2,53 1.097,54 -0.156,55 3.586,56 4,57 0.625,58 6,59 0.52,60 1,61 1,63 8.071}
{0 CHEMBL129692,1 1,2 1,3 1,5 1,7 1,8 0.025,9 8,10 5,11 3.596,12 1.289,13 1.266,14 4,15 9,16 6,19 3,20 1.439,21 3.157,22 3.209,23 3.605,24 1,25 3.635,26 1,27 12,29 2.287,30 3.446,32 3,33 0.615,34 0.251,35 1.488,36 4.006,37 5.628,38 7.213,39 8.783,40 10.349,41 11.915,42 4.838,43 -0.05,44 1,45 2,46 0.273,47 2,48 1.031,51 3,53 1.004,54 -0.058,55 3.603,56 4,57 0.62,58 12,59 1.497,60 1,61 1,63 9}
{0 CHEMBL130026,1 1,2 1,3 1,5 1,7 1,8 0.053,9 11,10 5,11 3.717,12 1.687,13 1.646,14 3,15 14,16 11,17 1,18 1,19 3,20 2.468,21 3.585,22 3.594,23 3.715,24 1,25 3.646,26 1,27 15,29 2.449,30 3.731,32 3,33 1.013,34 1.307,35 1.844,36 2.98,37 4.33,38 5.648,39 6.944,40 8.228,41 9.506,42 7.43,43 0.015,45 2,46 0.193,47 2,48 0.977,51 4,53 0.956,54 0.013,55 4.025,56 5,57 0.613,58 13,59 2.25,60 1,61 5,63 9.208}
{0 CHEMBL130081,1 1,2 1,3 1,5 1,7 1,8 0.051,9 12,10 4,11 3.727,12 1.65,13 1.609,14 3,15 15,16 16,17 1,18 1,19 4,20 2.468,21 3.609,22 3.617,23 3.726,24 1,25 3.702,26 1,27 16,29 2.553,30 3.735,32 3,33 1.002,34 1.656,35 1.852,36 3.123,37 4.612,38 6.055,39 7.47,40 8.866,41 10.252,42 7.425,43 0.022,45 2,46 0.193,47 2,48 0.904,51 4,53 0.934,54 0.049,55 4.051,56 5,57 0.613,58 12,59 2.301,60 1,61 4,63 9.276}
{0 CHEMBL131111,1 1,2 1,3 1,5 1,7 1,8 0.036,9 13,10 6,11 3.717,12 1.694,13 1.649,14 3,15 14,16 16,17 1,18 1,19 3,20 2.468,21 3.586,22 3.59,23 3.718,24 1,25 3.636,26 1,27 15,29 2.49,30 3.721,32 3,33 1.04,34 2.83,35 1.878,36 2.98,37 4.33,38 5.648,39 6.944,40 8.228,41 9.506,42 4.874,43 -0.036,45 2,46 0.161,47 2,48 1.045,51 4,53 1.053,54 -0.059,55 4.002,56 7,57 0.613,58 14,59 2.214,60 1,61 5,62 1,63 9.886}
{0 CHEMBL131118,1 1,2 1,3 1,5 1,7 1,8 0.049,9 18,10 7,11 3.718,12 1.71,13 1.664,14 6,15 19,16 19,17 1,18 1,19 4,20 2.467,21 3.598,22 3.604,23 3.716,24 1,25 3.641,26 1,27 21,29 2.452,30 3.739,32 3,33 1.136,34 3.066,35 1.908,36 2.98,37 4.33,38 5.648,39 6.944,40 8.228,41 9.506,42 4.833,43 -0.025,45 2,46 0.129,47 2,48 1.017,51 4,53 1.028,54 -0.053,55 4.026,56 5,57 0.597,58 18,59 2.176,60 1,61 6,63 7.678}
{0 CHEMBL131355,1 1,2 1,3 1,5 1,7 1,8 0.045,9 14,10 6,11 3.767,12 1.694,13 1.65,14 4,15 16,16 17,17 1,18 1,19 2,20 2.468,21 3.588,22 3.591,23 3.727,24 1,25 3.636,26 1,27 18,29 2.447,30 3.721,32 4,33 1.04,34 3.001,35 1.878,36 2.98,37 4.33,38 5.648,39 6.944,40 8.228,41 9.506,42 4.845,43 -0.062,45 2,46 0.177,47 2,48 0.633,51 4,53 1.029,54 -0.072,55 3.999,56 5,57 0.6,58 14,59 2.16,60 1,61 5,63 9.959}
{0 CHEMBL131672,1 1,2 1,3 1,5 1,7 1,8 0.053,9 11,10 4,11 3.721,12 1.65,13 1.609,14 3,15 12,16 14,17 1,18 1,19 3,20 2.468,21 3.609,22 3.617,23 3.723,24 1,25 3.702,26 1,27 14,29 2.633,30 3.736,32 3,33 1.002,34 1.237,35 1.852,36 3.123,37 4.612,38 6.055,39 7.47,40 8.866,41 10.252,42 7.43,43 0.002,45 2,46 0.193,47 2,48 0.977,51 4,53 0.952,54 0.044,55 4.053,56 5,57 0.613,58 12,59 2.312,60 1,61 4,63 8.959}
{0 CHEMBL131939,1 1,2 1,3 1,5 1,7 1,8 0.053,9 16,10 5,11 3.712,12 1.706,13 1.661,14 4,15 18,16 17,17 1,18 1,19 5,20 2.466,21 3.598,22 3.602,23 3.71,24 2,25 3.446,27 19,29 2.434,30 3.729,32 4,33 1.092,34 3.231,35 1.895,36 2.98,37 4.33,38 5.648,39 6.944,40 8.228,41 9.506,42 4.876,43 -0.006,45 2,46 0.144,47 2,48 0.993,51 4,53 1.013,54 -0.028,55 3.993,56 7,57 0.6,58 17,59 2.212,60 2,61 5,62 1,63 9.215}
{0 CHEMBL1650673,3 0.4,4 3,5 1.273,6 0.273,8 0.018,9 4,10 2,11 3.64,12 1.577,13 1.512,14 3,15 9,16 9,20 2.091,21 3.353,22 3.352,23 3.665,25 3.594,27 13,29 2.245,30 3.492,32 2,33 0.993,34 -0.434,35 1.806,36 3.689,37 5.114,38 6.531,39 7.949,40 9.369,41 10.793,42 5.03,43 0.068,44 1,45 1,46 -0.323,47 1,48 0.837,51 2,53 0.904,54 0.014,55 4.087,56 3,57 0.679,58 8,59 2.032,61 1,63 4.301}
{0 CHEMBL1650676,3 0.4,4 3,5 1.273,6 0.273,8 0.018,9 4,10 2,11 3.64,12 1.577,13 1.512,14 3,15 9,16 9,20 2.091,21 3.353,22 3.352,23 3.665,25 3.594,27 13,29 2.245,30 3.492,32 2,33 0.993,34 -0.434,35 1.806,36 3.689,37 5.114,38 6.531,39 7.949,40 9.369,41 10.793,42 5.03,43 0.068,44 1,45 1,46 -0.323,47 1,48 0.837,51 2,53 0.904,54 0.014,55 4.087,56 3,57 0.679,58 8,59 2.032,61 1,63 4.301}
{0 CHEMBL1650866,3 0.4,4 3,5 1.261,6 0.261,8 0.018,9 7,10 2,11 3.649,12 1.567,13 1.506,14 3,15 9,16 9,20 2.266,21 3.381,22 3.379,23 3.67,25 3.635,27 13,29 2.307,30 3.518,32 1,33 0.988,34 -0.088,35 1.789,36 3.941,37 5.419,38 6.864,39 8.292,40 9.712,41 11.131,42 5.03,43 0.08,44 2,45 1,46 -0.336,47 1,48 0.861,51 2,53 0.881,54 0.063,55 4.029,56 3,57 0.672,58 8,59 2.058,61 1,63 4.301}
{0 CHEMBL1683806,1 1,3 0.667,4 1,5 1.133,6 0.133,7 1,8 0.048,9 10,10 5,11 3.606,12 1.527,13 1.535,14 3,15 12,16 7,19 3,20 1.276,21 3.493,22 3.467,23 3.559,24 1,25 4.156,26 1,27 15,29 2.398,30 3.593,32 2,33 0.763,34 0.456,35 1.652,36 3.168,37 4.654,38 6.091,39 7.5,40 8.894,41 10.279,42 6.999,43 0.09,45 2,46 0.289,47 2,48 1.186,51 2,52 1,53 0.841,54 0.154,55 4.296,56 3,57 0.596,58 12,59 1.448,60 1,63 7.054}
{0 CHEMBL17423,3 0.75,4 1,5 1.091,6 0.091,8 -0.023,9 7,11 3.569,12 1.464,13 1.42,15 5,16 2,20 1.933,21 3.343,22 3.351,23 3.582,25 3.618,27 6,29 2.499,30 3.504,33 0.867,34 0.075,35 1.672,36 3.09,37 4.432,38 5.759,39 7.072,40 8.376,41 9.674,42 4.922,43 -0.036,44 4,45 1,46 -0.336,47 1,48 1.214,49 1,50 1,51 3,52 1,53 1.075,54 -0.079,55 3.972,56 7,57 0.672,58 7,59 1.908,61 2,62 2,63 4.879}
{0 CHEMBL1821774,3 0.667,4 1,5 1.125,6 0.125,8 -0.025,11 3.376,12 1.362,13 1.306,15 7,16 6,20 1.385,21 3.205,22 3.213,23 3.401,25 3.249,27 9,29 2.17,30 3.424,33 0.691,35 1.616,42 5.019,43 -0.008,44 2,46 -0.76,48 1.158,51 2,52 1,53 1.026,54 -0.044,55 3.818,56 6,57 0.635,58 8,59 1.458,61 1,62 1,63 5.903}
{0 CHEMBL1821775,3 0.667,4 1,5 1.125,6 0.125,8 -0.022,11 3.382,12 1.369,13 1.31,15 11,16 8,20 1.385,21 3.209,22 3.216,23 3.405,25 3.141,27 12,29 2.192,30 3.425,33 0.781,35 1.626,42 4.845,43 -0.142,44 2,46 -0.798,48 1.175,51 2,52 1,53 1.126,54 -0.133,55 3.841,56 7,57 0.625,58 10,59 1.463,61 1,62 1,63 5.777}
{0 CHEMBL1821787,3 0.667,4 1,5 1.125,6 0.125,8 -0.039,11 3.354,12 1.421,13 1.365,15 7,16 6,20 1.515,21 3.257,22 3.268,23 3.378,25 3.221,27 9,29 2.188,30 3.488,33 0.704,35 1.643,42 4.903,43 -0.014,44 2,46 -0.769,48 1.228,51 2,52 1,53 1.036,54 -0.059,55 3.856,56 7,57 0.639,58 8,59 1.498,61 1,62 2,63 5.6}
{0 CHEMBL1821789,3 0.667,4 1,5 1.125,6 0.125,8 -0.039,11 3.356,12 1.418,13 1.364,15 7,16 6,20 1.52,21 3.26,22 3.271,23 3.38,25 3.22,27 9,29 2.19,30 3.486,33 0.699,35 1.64,42 4.903,43 -0.014,44 2,46 -0.769,48 1.228,51 2,52 1,53 1.036,54 -0.059,55 3.856,56 7,57 0.639,58 8,59 1.467,61 1,62 2,63 5.664}
{0 CHEMBL1821790,3 0.667,4 1,5 1.125,6 0.125,8 -0.05,11 3.383,12 1.447,13 1.417,15 7,16 6,20 1.805,21 3.336,22 3.358,23 3.403,25 3.22,27 9,29 2.19,30 3.53,33 0.883,35 1.648,42 4.91,43 0.029,44 4,46 -0.759,48 1.298,51 2,52 1,53 0.991,54 -0.012,55 3.856,56 7,57 0.642,58 8,59 1.617,61 1,62 3,63 5.599}
{0 CHEMBL1821791,3 0.667,4 1,5 1.125,6 0.125,8 -0.025,11 3.348,12 1.271,13 1.223,15 9,16 6,20 1.287,21 3.137,22 3.136,23 3.372,25 3.039,27 11,29 2.105,30 3.309,33 0.607,35 1.584,42 4.719,43 0.037,46 -0.815,48 1.147,51 2,52 1,53 0.952,54 0.03,55 3.678,56 7,57 0.63,58 9,59 1.225,61 1,62 1,63 5.509}
{0 CHEMBL189,3 1,5 1,8 0.017,10 2,11 3.183,12 0.886,13 0.821,15 5,16 5,17 1,20 0.431,21 2.735,22 2.742,23 3.188,25 3.524,27 6,29 1.597,30 2.991,33 0.218,34 1.365,35 1.181,42 4.913,43 -0.063,45 1,46 -0.229,47 1,48 0.92,51 2,53 1.105,54 -0.074,55 3.606,56 4,57 0.625,58 5,59 -0.049,60 1,63 6.277}
{0 CHEMBL1916475,3 0.75,4 1,5 1.091,6 0.091,8 -0.024,9 5,10 1,11 3.645,12 1.619,13 1.557,15 3,16 1,19 1,20 2.291,21 3.457,22 3.452,23 3.664,24 1,25 3.084,27 4,29 2.302,30 3.649,32 1,33 0.992,34 0.057,35 1.829,36 2.535,37 3.736,38 4.903,39 6.047,40 7.176,41 8.297,42 5.079,43 0.071,44 3,45 2,46 0.252,47 2,48 1.293,51 3,52 2,53 0.872,54 0.085,55 3.801,56 7,57 0.674,58 5,59 2.044,60 1,61 5,62 4,63 5.699}
{0 CHEMBL19224,3 0.667,4 1,5 1.125,6 0.125,8 -0.041,11 3.35,12 1.279,13 1.233,15 7,16 6,20 1.48,21 3.144,22 3.147,23 3.374,25 3.208,27 9,29 2.186,30 3.32,33 0.608,35 1.585,42 4.721,43 0.029,46 -0.79,48 1.219,51 2,52 1,53 1.01,54 -0.047,55 3.852,56 7,57 0.64,58 8,59 1.228,61 1,62 2,63 5.987}
{0 CHEMBL2096844,3 0.75,4 1,5 1.095,6 0.095,8 -0.058,9 4,11 3.614,12 1.477,13 1.426,15 2,16 2,20 1.709,21 3.244,22 3.28,23 3.616,25 3.248,27 3,28 1,29 2.323,30 3.475,31 1,33 0.932,35 1.671,36 0.268,37 0.188,38 0.125,39 0.082,40 0.054,41 0.035,42 4.768,43 -0.126,44 2,46 -0.742,48 1.284,49 1,50 1,51 3,52 1,53 1.17,54 -0.197,55 3.832,56 10,57 0.688,58 4,59 1.689,61 1,62 3,63 7}
{0 CHEMBL218855,3 0.8,4 1,5 1.074,6 0.074,8 -0.02,9 7,11 3.692,12 1.543,13 1.488,15 13,16 11,20 2.5,21 3.602,22 3.6,23 3.692,25 3.179,27 15,28 1,29 2.386,30 3.708,31 1,33 0.946,35 1.791,36 0.268,37 0.188,38 0.125,39 0.082,40 0.054,41 0.035,42 4.769,43 -0.13,44 2,46 -0.805,48 1.12,49 1,50 1,51 4,52 1,53 1.126,54 -0.159,55 3.894,56 10,57 0.664,58 12,59 2.095,61 1,62 2,63 6.553}
{0 CHEMBL218955,3 0.6,4 2,5 1.16,6 0.16,8 -0.033,9 6,11 3.635,12 1.485,13 1.432,15 9,16 6,20 2.268,21 3.383,22 3.39,23 3.642,25 3.186,27 11,28 1,29 2.377,30 3.519,31 1,33 0.936,35 1.68,36 0.268,37 0.188,38 0.125,39 0.082,40 0.054,41 0.035,42 4.77,43 -0.122,44 2,46 -0.774,48 1.188,49 1,50 1,51 3,52 1,53 1.118,54 -0.135,55 3.961,56 12,57 0.68,58 8,59 2.115,61 1,62 3,63 6.516}
{0 CHEMBL219123,3 0.75,4 1,5 1.095,6 0.095,8 -0.036,9 6,11 3.623,12 1.498,13 1.436,15 8,16 6,20 1.821,21 3.362,22 3.345,23 3.626,25 3.186,27 10,28 1,29 2.366,30 3.501,31 1,33 0.939,35 1.763,36 0.268,37 0.188,38 0.125,39 0.082,40 0.054,41 0.035,42 4.768,43 -0.118,44 2,46 -0.785,48 1.251,49 1,50 1,51 3,52 1,53 1.117,54 -0.135,55 3.828,56 10,57 0.664,58 8,59 2,61 1,62 2,63 6.324}
{0 CHEMBL219445,3 0.6,4 2,5 1.16,6 0.16,8 -0.05,9 1,11 3.634,12 1.481,13 1.429,15 2,16 1,20 2.177,21 3.284,22 3.31,23 3.641,25 3.182,27 3,28 1,29 2.363,30 3.487,31 1,33 0.936,35 1.676,36 0.268,37 0.188,38 0.125,39 0.082,40 0.054,41 0.035,42 4.769,43 -0.128,44 2,46 -0.726,48 1.203,49 1,50 1,51 3,52 2,53 1.135,54 -0.187,55 3.887,56 10,57 0.708,58 4,59 2.11,61 1,62 3,63 6.564}
{0 CHEMBL219451,3 0.75,4 1,5 1.095,6 0.095,8 -0.054,9 4,11 3.614,12 1.479,13 1.427,15 2,16 5,20 1.821,21 3.257,22 3.281,23 3.617,25 3.181,27 4,28 1,29 2.328,30 3.478,31 1,33 0.936,35 1.775,36 0.268,37 0.188,38 0.125,39 0.082,40 0.054,41 0.035,42 4.769,43 -0.162,44 3,46 -0.751,48 1.292,49 1,50 1,51 3,52 2,53 1.193,54 -0.201,55 3.773,56 13,57 0.681,58 3,59 1.937,61 1,62 2,63 7.056}
{0 CHEMBL220185,3 0.6,4 2,5 1.16,6 0.16,8 -0.035,9 4,11 3.634,12 1.481,13 1.429,15 6,16 3,20 2.177,21 3.285,22 3.307,23 3.64,25 3.182,27 9,28 1,29 2.363,30 3.486,31 1,33 0.936,35 1.676,36 0.268,37 0.188,38 0.125,39 0.082,40 0.054,41 0.035,42 4.769,43 -0.096,44 2,46 -0.759,48 1.165,49 1,50 1,51 3,52 2,53 1.091,54 -0.144,55 3.914,56 11,57 0.692,58 8,59 2.109,61 1,62 2,63 6.708}
{0 CHEMBL2313234,3 0.6,4 2,5 1.16,6 0.16,8 -0.025,9 1,11 3.609,12 1.543,13 1.497,15 5,16 3,20 2.31,21 3.472,22 3.484,23 3.626,25 3.111,27 8,29 2.303,30 3.627,33 0.872,35 1.734,36 0.393,37 0.384,38 0.351,39 0.312,40 0.273,41 0.236,42 4.726,43 0.134,44 5,46 -0.742,48 1.021,51 3,52 2,53 0.861,54 0.105,55 3.838,56 6,57 0.688,58 7,59 1.952,62 1,63 5}
{0 CHEMBL252387,3 0.75,4 1,5 1.095,6 0.095,7 1,8 -0.044,9 3,11 3.606,12 1.249,13 1.196,15 4,16 3,20 1.88,21 3.162,22 3.179,23 3.601,24 1,25 3.268,27 4,29 2.371,30 3.358,33 0.588,34 0.881,35 1.592,42 4.867,43 0.051,44 1,46 -0.683,48 1.072,51 3,52 1,53 0.972,54 0.002,55 3.936,56 11,57 0.664,58 5,59 1.643,60 1,62 4,63 6.143}
{0 CHEMBL259295,3 0.75,4 1,5 1.095,6 0.095,8 -0.062,9 2,11 3.596,12 1.476,13 1.425,15 1,16 3,20 1.679,21 3.243,22 3.279,23 3.6,25 3.172,27 2,28 1,29 2.254,30 3.474,31 1,33 0.891,35 1.669,36 0.268,37 0.188,38 0.125,39 0.082,40 0.054,41 0.035,42 4.769,43 -0.161,44 2,46 -0.722,48 1.266,49 1,50 1,51 3,52 2,53 1.193,54 -0.203,55 3.763,56 12,57 0.702,58 1,59 1.686,61 1,62 2,63 6.164}
{0 CHEMBL260006,3 0.75,4 1,5 1.095,6 0.095,8 -0.062,9 3,11 3.605,12 1.477,13 1.426,15 1,16 2,20 1.679,21 3.244,22 3.28,23 3.607,25 3.172,27 2,28 1,29 2.227,30 3.475,31 1,33 0.903,35 1.671,36 0.268,37 0.188,38 0.125,39 0.082,40 0.054,41 0.035,42 4.768,43 -0.109,44 2,46 -0.722,48 1.266,49 1,50 1,51 3,52 2,53 1.145,54 -0.186,55 3.761,56 11,57 0.702,58 3,59 1.686,61 1,62 2,63 6.684}
{0 CHEMBL261711,3 0.6,4 2,5 1.16,6 0.16,8 -0.033,9 6,11 3.635,12 1.485,13 1.432,15 9,16 5,20 2.23,21 3.383,22 3.39,23 3.642,25 3.185,27 11,28 1,29 2.38,30 3.519,31 1,33 0.936,35 1.68,36 0.268,37 0.188,38 0.125,39 0.082,40 0.054,41 0.035,42 4.77,43 -0.122,44 2,46 -0.774,48 1.188,49 1,50 1,51 3,52 2,53 1.118,54 -0.135,55 3.96,56 12,57 0.68,58 8,59 2.113,61 1,62 2,63 6.553}
{0 CHEMBL262088,3 0.75,4 1,5 1.095,6 0.095,8 -0.041,9 6,11 3.616,12 1.477,13 1.426,15 5,16 4,20 1.68,21 3.244,22 3.28,23 3.619,25 3.212,27 6,28 1,29 2.326,30 3.475,31 1,33 0.934,35 1.672,36 0.268,37 0.188,38 0.125,39 0.082,40 0.054,41 0.035,42 4.768,43 -0.124,44 2,46 -0.769,48 1.231,49 1,50 1,51 3,52 1,53 1.146,54 -0.166,55 3.823,56 10,57 0.676,58 6,59 1.688,61 1,62 2,63 7}
{0 CHEMBL263641,3 0.6,4 2,5 1.16,6 0.16,8 -0.035,9 5,11 3.631,12 1.482,13 1.43,15 5,16 5,20 2.177,21 3.341,22 3.342,23 3.637,25 3.182,27 5,28 1,29 2.365,30 3.489,31 1,33 0.935,35 1.677,36 0.268,37 0.188,38 0.125,39 0.082,40 0.054,41 0.035,42 4.769,43 -0.161,44 2,46 -0.759,48 1.165,49 1,50 1,51 3,52 1,53 1.178,54 -0.203,55 3.911,56 13,57 0.692,58 5,59 2.111,61 1,62 2,63 6.697}
{0 CHEMBL263642,3 0.6,4 2,5 1.16,6 0.16,8 -0.022,9 8,11 3.629,12 1.484,13 1.432,15 10,16 8,20 2.283,21 3.377,22 3.368,23 3.634,25 3.236,27 12,28 1,29 2.35,30 3.486,31 1,33 0.935,35 1.678,36 0.268,37 0.188,38 0.125,39 0.082,40 0.054,41 0.035,42 4.769,43 -0.131,44 2,46 -0.792,48 1.13,49 1,50 1,51 3,52 1,53 1.146,54 -0.186,55 4.023,56 10,57 0.675,58 10,59 2.128,61 1,62 2,63 7.252}
{0 CHEMBL273816,1 1,2 1,3 1,5 1,7 1,8 0.046,9 13,10 5,11 3.733,12 1.65,13 1.61,14 5,15 13,16 15,17 1,18 1,19 2,20 2.59,21 3.615,22 3.621,23 3.74,24 1,25 3.781,26 1,27 17,29 2.671,30 3.737,32 3,33 1.009,34 1.828,35 1.849,36 4.721,37 6.689,38 8.627,39 10.556,40 12.48,41 14.402,42 7.425,43 0.021,45 2,46 0.222,47 2,48 0.886,51 4,52 1,53 0.987,54 0.028,55 4.043,56 7,57 0.621,58 12,59 2.289,60 1,61 4,63 7.523}
{0 CHEMBL338179,1 1,2 1,3 1,5 1,7 1,8 0.053,9 12,10 5,11 3.717,12 1.692,13 1.648,14 4,15 14,16 14,17 1,18 1,19 3,20 2.467,21 3.586,22 3.592,23 3.715,24 1,25 3.644,26 1,27 17,29 2.449,30 3.726,32 3,33 1.028,34 2.147,35 1.866,36 2.98,37 4.33,38 5.648,39 6.944,40 8.228,41 9.506,42 7.425,43 0.018,45 2,46 0.177,47 2,48 0.977,51 4,53 0.983,54 -0.013,55 4.025,56 5,57 0.608,58 14,59 2.164,60 1,61 5,63 9.62}
{0 CHEMBL338381,1 1,2 1,3 1,5 1,7 1,8 0.051,9 14,10 6,11 3.726,12 1.694,13 1.65,14 4,15 16,16 16,17 1,18 1,19 3,20 2.5,21 3.586,22 3.591,23 3.728,24 1,25 3.697,26 1,27 18,29 2.493,30 3.722,32 3,33 1.04,34 1.607,35 1.878,36 6.713,37 9.395,38 12.076,39 14.758,40 17.441,41 20.124,42 7.999,43 0.07,45 2,46 0.192,47 2,48 0.997,51 4,53 0.982,55 4.022,56 5,57 0.614,58 16,59 2.214,60 1,61 5,63 9.456}
{0 CHEMBL338860,1 1,2 1,3 1,5 1,7 1,8 0.053,9 23,10 6,11 3.782,12 1.762,13 1.729,14 4,15 26,16 27,17 1,18 1,19 4,20 2.606,21 3.679,22 3.681,23 3.786,24 1,25 3.7,26 1,27 26,29 2.61,30 3.794,32 5,33 1.04,34 2.532,35 1.899,36 4.694,37 6.657,38 8.601,39 10.537,40 12.467,41 14.394,42 7.425,43 -0.006,45 2,46 0.123,47 2,48 0.917,51 5,53 1.033,54 -0.029,55 4.009,56 7,57 0.612,58 21,59 2.423,60 1,61 5,63 10.31}
{0 CHEMBL339210,1 1,2 1,3 1,5 1,7 1,8 0.065,9 19,10 6,11 3.786,12 1.694,13 1.65,14 4,15 22,16 23,17 1,18 1,19 4,20 2.5,21 3.672,22 3.627,23 3.765,24 1,25 3.636,26 1,27 23,29 2.493,30 3.726,32 4,33 1.04,34 2.97,35 1.879,36 2.98,37 4.33,38 5.648,39 6.944,40 8.228,41 9.506,42 4.853,43 0.01,45 2,46 0.118,47 2,48 0.856,51 5,53 1.017,54 -0.04,55 4.008,56 5,57 0.603,58 18,59 2.309,60 1,61 5,63 10.167}
{0 CHEMBL340118,1 1,2 1,3 1,5 1,7 1,8 0.048,9 13,10 5,11 3.727,12 1.65,13 1.61,14 4,15 16,16 18,17 1,18 1,19 4,20 2.468,21 3.614,22 3.62,23 3.726,24 1,25 3.702,26 1,27 18,29 2.551,30 3.733,32 3,33 1.009,34 2.255,35 1.849,36 3.123,37 4.612,38 6.055,39 7.47,40 8.866,41 10.252,42 4.971,43 0.054,45 2,46 0.193,47 2,48 0.841,51 4,53 0.929,54 0.064,55 4.05,56 5,57 0.613,58 12,59 2.301,60 1,61 4,63 8.201}
{0 CHEMBL340785,1 1,2 1,3 1,5 1,7 1,8 0.026,9 2,10 4,11 3.288,12 1.151,13 1.08,14 2,15 6,16 8,19 1,20 0.5,21 2.96,22 2.98,23 3.31,24 1,25 3.533,26 1,27 6,29 1.993,30 3.212,32 2,33 0.543,34 0.712,35 1.466,36 3.675,37 5.057,38 6.392,39 7.701,40 8.997,41 10.286,42 4.83,43 -0.214,45 2,46 0.429,47 2,48 1.068,51 2,53 1.254,54 -0.279,55 3.575,56 4,57 0.611,58 6,59 0.15,60 1,61 1,63 7.432}
{0 CHEMBL341160,1 1,2 1,3 1,5 1,7 1,8 0.049,9 16,10 6,11 3.735,12 1.656,13 1.615,14 5,15 17,16 18,17 1,18 1,19 3,20 2.619,21 3.621,22 3.628,23 3.737,24 1,25 4.058,26 1,27 20,29 2.639,30 3.746,32 3,33 1.046,34 2.498,35 1.867,36 3.123,37 4.612,38 6.055,39 7.47,40 8.866,41 10.252,42 6.82,43 -0.01,45 2,46 0.146,47 2,48 0.972,51 4,53 1.003,54 -0.016,55 4.041,56 6,57 0.602,58 17,59 2.204,60 2,61 4,63 8}
{0 CHEMBL341231,1 1,2 1,3 1,5 1,7 1,8 0.053,9 12,10 6,11 3.716,12 1.694,13 1.649,14 4,15 14,16 15,17 1,18 1,19 2,20 2.468,21 3.586,22 3.59,23 3.718,24 1,25 3.636,26 1,27 16,29 2.484,30 3.721,32 3,33 1.04,34 2.54,35 1.878,36 2.98,37 4.33,38 5.648,39 6.944,40 8.228,41 9.506,42 7.425,43 0.021,45 2,46 0.177,47 2,48 0.977,51 4,53 1.015,54 -0.032,55 3.999,56 5,57 0.608,58 14,59 2.174,60 1,61 5,63 9.155}
{0 CHEMBL341327,1 1,2 1,3 1,5 1,7 1,8 0.044,9 6,10 5,11 3.587,12 1.298,13 1.219,14 2,15 9,16 11,17 1,18 1,19 1,20 1.108,21 3.116,22 3.097,23 3.593,24 1,25 3.636,26 1,27 9,29 2.242,30 3.271,32 2,33 0.78,34 2.956,35 1.632,36 2.98,37 4.33,38 5.648,39 6.944,40 8.228,41 9.506,42 4.841,43 0.024,45 2,46 0.278,47 2,48 1.052,51 3,53 1.021,54 -0.031,55 3.96,56 5,57 0.609,58 9,59 1.116,60 1,61 4,63 8.056}
{0 CHEMBL341354,1 1,2 1,3 1,5 1,7 1,8 0.047,9 12,10 6,11 3.729,12 1.695,13 1.65,14 4,15 14,16 15,17 1,18 1,19 2,20 2.5,21 3.586,22 3.591,23 3.734,24 1,25 3.697,26 1,27 16,29 2.494,30 3.724,32 3,33 1.04,34 2.368,35 1.879,36 4.694,37 6.657,38 8.601,39 10.537,40 12.467,41 14.394,42 7.425,43 -0.005,45 2,46 0.208,47 2,48 0.959,51 4,52 1,53 1.034,54 -0.035,55 4,56 7,57 0.617,58 14,59 2.214,60 1,61 5,63 9.027}
{0 CHEMBL34431,3 0.667,4 1,5 1.125,6 0.125,8 0.002,9 4,10 2,11 3.523,12 1.441,13 1.41,14 2,15 6,16 6,20 1.577,21 3.347,22 3.357,23 3.523,25 3.051,27 8,29 2.177,30 3.497,33 0.876,34 0.216,35 1.665,36 3.13,37 4.539,38 5.912,39 7.263,40 8.602,41 9.936,42 4.953,43 -0.001,44 1,45 1,46 -0.356,47 1,48 1.219,51 2,53 0.986,54 -0.015,55 3.886,56 10,57 0.63,58 9,59 1.65,61 7,63 7.3}
{0 CHEMBL374993,3 0.75,4 1,5 1.095,6 0.095,8 -0.062,9 2,11 3.599,12 1.476,13 1.425,15 1,16 2,20 1.679,21 3.244,22 3.279,23 3.602,25 3.172,27 1,28 1,29 2.25,30 3.475,31 1,33 0.895,35 1.67,36 0.268,37 0.188,38 0.125,39 0.082,40 0.054,41 0.035,42 4.768,43 -0.157,44 2,46 -0.722,48 1.266,49 1,50 1,51 3,52 1,53 1.182,54 -0.207,55 3.762,56 10,57 0.702,58 2,59 1.686,61 1,62 3,63 6.126}
{0 CHEMBL375200,3 0.75,4 1,5 1.095,6 0.095,8 -0.054,9 5,11 3.614,12 1.479,13 1.427,15 3,16 5,20 1.822,21 3.258,22 3.282,23 3.618,25 3.176,27 3,28 1,29 2.331,30 3.48,31 1,33 0.936,35 1.772,36 0.268,37 0.188,38 0.125,39 0.082,40 0.054,41 0.035,42 4.769,43 -0.166,44 3,46 -0.751,48 1.292,49 1,50 1,51 3,52 1,53 1.209,54 -0.209,55 3.768,56 13,57 0.681,58 3,59 2,61 1,62 2,63 6.484}
{0 CHEMBL385754,3 0.75,4 1,5 1.095,6 0.095,8 -0.08,11 3.591,12 1.476,13 1.426,15 1,16 1,20 1.68,21 3.244,22 3.28,23 3.596,25 3.177,27 1,28 1,29 2.22,30 3.475,31 1,33 0.73,35 1.667,36 0.268,37 0.188,38 0.125,39 0.082,40 0.054,41 0.035,42 4.769,43 -0.101,44 2,46 -0.659,48 1.199,49 1,50 1,51 3,52 3,53 1.117,54 -0.185,55 3.761,56 8,57 0.722,58 1,59 1.689,61 1,62 2,63 6.479}
{0 CHEMBL387166,3 0.75,4 1,5 1.095,6 0.095,8 -0.062,9 4,11 3.614,12 1.477,13 1.426,15 3,16 3,20 1.826,21 3.244,22 3.281,23 3.618,25 3.361,27 3,28 1,29 2.359,30 3.477,31 1,33 0.932,35 1.671,36 6.953,37 9.758,38 12.548,39 15.337,40 18.126,41 20.915,42 7.999,43 -0.131,44 2,46 -0.671,48 1.277,49 1,50 1,51 3,52 1,53 1.203,54 -0.2,55 3.9,56 12,57 0.694,58 3,59 2,61 1,62 2,63 5.74}
{0 CHEMBL387167,3 0.75,4 1,5 1.095,6 0.095,8 -0.034,9 5,11 3.629,12 1.516,13 1.455,15 11,16 9,20 1.822,21 3.443,22 3.429,23 3.634,25 3.36,27 13,28 1,29 2.421,30 3.563,31 1,33 0.944,35 1.772,36 0.268,37 0.188,38 0.125,39 0.082,40 0.054,41 0.035,42 4.768,43 -0.139,44 2,46 -0.792,48 1.259,49 1,50 1,51 3,52 1,53 1.14,54 -0.145,55 4.148,56 10,57 0.658,58 9,59 2,61 1,62 2,63 5.724}
{0 CHEMBL408977,3 0.6,4 2,5 1.167,6 0.167,8 -0.018,9 6,11 3.63,12 1.547,13 1.489,15 8,16 5,20 1.829,21 3.311,22 3.311,23 3.635,25 3.215,27 12,28 1,29 2.369,30 3.486,31 1,33 1.145,35 1.798,36 0.268,37 0.188,38 0.125,39 0.082,40 0.054,41 0.035,42 4.768,43 -0.123,44 2,46 -0.785,48 1.191,49 1,50 1,51 3,52 1,53 1.113,54 -0.143,55 3.939,56 10,57 0.681,58 9,59 2.067,61 4,62 2,63 6.625}
{0 CHEMBL408978,3 0.75,4 1,5 1.095,6 0.095,8 -0.045,9 5,11 3.615,12 1.477,13 1.426,15 4,16 3,20 1.68,21 3.244,22 3.28,23 3.617,25 3.28,27 4,28 1,29 2.302,30 3.475,31 1,33 0.932,35 1.671,36 0.268,37 0.188,38 0.125,39 0.082,40 0.054,41 0.035,42 4.769,43 -0.139,44 2,46 -0.733,48 1.12,49 1,50 1,51 3,52 1,53 1.159,54 -0.203,55 3.798,56 9,57 0.685,58 4,59 1.688,61 1,62 2,63 7}
{0 CHEMBL409484,3 0.75,4 1,5 1.095,6 0.095,8 -0.046,9 5,11 3.616,12 1.477,13 1.426,15 3,16 3,20 1.823,21 3.244,22 3.28,23 3.619,25 3.361,27 5,28 1,29 2.329,30 3.475,31 1,33 0.932,35 1.671,36 0.268,37 0.188,38 0.125,39 0.082,40 0.054,41 0.035,42 4.816,43 -0.14,44 2,46 -0.742,48 1.187,49 1,50 1,51 3,52 2,53 1.167,54 -0.203,55 3.85,56 11,57 0.679,58 5,59 1.689,60 1,61 1,62 2,63 7}
{0 CHEMBL409613,3 0.6,4 2,5 1.16,6 0.16,8 -0.035,9 4,11 3.632,12 1.482,13 1.43,15 5,16 5,20 2.177,21 3.34,22 3.343,23 3.638,25 3.182,27 6,28 1,29 2.367,30 3.489,31 1,33 0.936,35 1.677,36 0.268,37 0.188,38 0.125,39 0.082,40 0.054,41 0.035,42 4.769,43 -0.167,44 2,46 -0.759,48 1.165,49 1,50 1,51 3,52 2,53 1.167,54 -0.19,55 3.91,56 13,57 0.692,58 5,59 2.111,61 1,62 2,63 6.62}
{0 CHEMBL409651,3 0.6,4 2,5 1.16,6 0.16,8 -0.032,9 6,11 3.633,12 1.494,13 1.438,15 6,16 7,20 2.216,21 3.413,22 3.41,23 3.64,25 3.184,27 6,28 1,29 2.376,30 3.524,31 1,33 0.936,35 1.717,36 0.268,37 0.188,38 0.125,39 0.082,40 0.054,41 0.035,42 4.769,43 -0.155,44 2,46 -0.767,48 1.176,49 1,50 1,51 3,52 1,53 1.172,54 -0.193,55 3.941,56 14,57 0.685,58 5,59 2.112,61 1,62 2,63 6.652}
{0 CHEMBL409862,3 0.75,4 1,5 1.095,6 0.095,8 -0.07,9 3,11 3.614,12 1.477,13 1.426,15 2,16 3,20 1.813,21 3.244,22 3.281,23 3.619,25 3.243,27 2,28 1,29 2.355,30 3.476,31 1,33 0.932,35 1.672,36 0.268,37 0.188,38 0.125,39 0.082,40 0.054,41 0.035,42 4.769,43 -0.129,44 2,46 -0.726,48 1.342,49 1,50 1,51 3,52 2,53 1.191,54 -0.201,55 3.858,56 12,57 0.692,58 2,59 1.695,61 1,62 2,63 6.585}
{0 CHEMBL410834,3 0.6,4 2,5 1.16,6 0.16,8 -0.022,9 6,11 3.635,12 1.484,13 1.431,15 11,16 7,20 2.177,21 3.37,22 3.368,23 3.641,25 3.182,27 13,28 1,29 2.368,30 3.494,31 1,33 0.936,35 1.68,36 0.268,37 0.188,38 0.125,39 0.082,40 0.054,41 0.035,42 4.769,43 -0.146,44 2,46 -0.792,48 1.13,49 1,50 1,51 3,52 1,53 1.137,54 -0.171,55 3.923,56 10,57 0.675,58 10,59 2.111,61 1,62 2,63 6.334}
{0 CHEMBL421249,1 1,2 1,3 1,5 1,7 1,8 0.051,9 16,10 7,11 3.718,12 1.704,13 1.658,14 5,15 17,16 18,17 1,18 1,19 3,20 2.467,21 3.594,22 3.599,23 3.716,24 1,25 3.64,26 1,27 20,29 2.451,30 3.733,32 3,33 1.093,34 3.027,35 1.893,36 2.98,37 4.33,38 5.648,39 6.944,40 8.228,41 9.506,42 4.838,43 0.003,45 2,46 0.144,47 2,48 0.998,51 4,53 1.01,54 -0.041,55 4.025,56 5,57 0.6,58 17,59 2.168,60 1,61 5,63 8.585}
{0 CHEMBL427777,3 0.75,4 1,5 1.095,6 0.095,8 -0.058,9 4,11 3.614,12 1.477,13 1.426,15 2,16 2,20 1.709,21 3.244,22 3.28,23 3.616,25 3.248,27 3,28 1,29 2.323,30 3.475,31 1,33 0.932,35 1.671,36 0.268,37 0.188,38 0.125,39 0.082,40 0.054,41 0.035,42 4.768,43 -0.126,44 2,46 -0.742,48 1.284,49 1,50 1,51 3,52 1,53 1.17,54 -0.197,55 3.832,56 10,57 0.688,58 4,59 1.689,61 1,62 3,63 7}
{0 CHEMBL428445,3 0.75,4 1,5 1.095,6 0.095,8 -0.046,9 5,11 3.616,12 1.477,13 1.426,15 3,16 3,20 1.822,21 3.244,22 3.28,23 3.619,25 3.361,27 5,28 1,29 2.35,30 3.475,31 1,33 0.933,35 1.671,36 6.69,37 9.389,38 12.074,39 14.758,40 17.441,41 20.124,42 7.999,43 -0.12,44 2,46 -0.693,48 1.224,49 1,50 1,51 3,52 1,53 1.178,54 -0.196,55 4.147,56 10,57 0.683,58 5,59 2.091,61 1,62 2,63 7}
{0 CHEMBL429686,3 0.75,4 1,5 1.095,6 0.095,8 -0.036,9 8,11 3.619,12 1.515,13 1.45,15 7,16 8,20 1.821,21 3.366,22 3.344,23 3.622,25 3.28,27 9,28 1,29 2.341,30 3.494,31 1,33 0.938,35 1.78,36 0.268,37 0.188,38 0.125,39 0.082,40 0.054,41 0.035,42 4.768,43 -0.112,44 2,46 -0.785,48 1.251,49 1,50 1,51 3,52 1,53 1.161,54 -0.184,55 3.955,56 10,57 0.664,58 8,59 2,61 1,62 2,63 6.324}
{0 CHEMBL430071,3 0.75,4 1,5 1.095,6 0.095,8 -0.062,9 4,11 3.613,12 1.477,13 1.426,15 2,16 2,20 1.825,21 3.244,22 3.28,23 3.616,25 3.366,27 3,28 1,29 2.335,30 3.475,31 1,33 0.932,35 1.671,36 6.953,37 9.758,38 12.548,39 15.337,40 18.126,41 20.915,42 7.999,43 -0.124,44 2,46 -0.671,48 1.277,49 1,50 1,51 3,52 1,53 1.169,54 -0.196,55 3.964,56 10,57 0.694,58 4,59 2.095,61 1,62 3,63 5.74}
{0 CHEMBL441704,3 0.75,4 1,5 1.095,6 0.095,8 -0.046,9 5,11 3.619,12 1.478,13 1.426,15 3,16 3,20 1.823,21 3.245,22 3.282,23 3.623,25 3.36,27 5,28 1,29 2.348,30 3.476,31 1,33 0.933,35 1.671,36 0.268,37 0.188,38 0.125,39 0.082,40 0.054,41 0.035,42 4.828,43 -0.157,44 2,46 -0.742,48 1.187,49 1,50 1,51 3,52 1,53 1.171,54 -0.199,55 3.769,56 11,57 0.679,58 5,59 1.694,60 1,61 1,62 3,63 6.327}
{0 CHEMBL466068,3 0.75,4 1,5 1.095,6 0.095,8 -0.013,9 5,10 2,11 3.582,12 1.631,13 1.568,14 5,15 4,16 1,19 6,20 2.109,21 3.442,22 3.44,23 3.596,25 3.178,27 6,29 2.297,30 3.604,32 2,33 0.928,35 1.81,36 0.268,37 0.188,38 0.125,39 0.082,40 0.054,41 0.035,42 4.843,43 0.041,44 6,45 2,46 0.262,47 2,48 1.246,51 3,53 0.956,54 0.005,55 3.839,56 4,57 0.672,58 7,59 1.952,61 1,62 1,63 5}
{0 CHEMBL466280,3 0.75,4 1,5 1.095,6 0.095,8 0.035,9 5,10 4,11 3.704,12 1.633,13 1.57,14 5,15 4,16 1,19 6,20 2.433,21 3.445,22 3.442,23 3.716,25 3.574,26 1,27 6,29 2.424,30 3.607,32 2,33 0.883,34 -1.747,35 1.821,36 6.69,37 9.388,38 12.074,39 14.758,40 17.441,41 20.124,42 7.999,43 0.074,45 4,46 1.662,47 4,48 1.158,51 3,52 2,53 0.947,54 -0.009,55 4.175,56 5,57 0.676,58 7,59 2.247,61 5,63 6}
{0 CHEMBL466481,3 0.75,4 1,5 1.095,6 0.095,8 0.019,9 5,10 4,11 3.613,12 1.633,13 1.569,14 5,15 4,16 1,19 6,20 2.117,21 3.445,22 3.441,23 3.629,25 3.03,26 1,27 6,29 2.254,30 3.606,32 2,33 0.84,35 1.831,42 5.016,43 0.039,45 3,46 0.981,47 3,48 1.17,51 3,52 2,53 0.961,54 -0.016,55 3.876,56 4,57 0.676,58 7,59 1.917,61 5,63 5}
{0 CHEMBL549560,3 0.8,4 1,5 1.077,6 0.077,8 -0.045,9 3,11 3.683,12 1.542,13 1.488,15 6,16 5,20 2.191,21 3.571,22 3.578,23 3.706,25 3.269,27 5,29 2.426,30 3.738,33 0.868,35 1.773,42 4.883,43 -0.054,44 2,46 -0.721,48 1.217,51 4,52 1,53 1.016,54 -0.052,55 3.951,56 14,57 0.674,58 6,59 2.009,61 1,62 5,63 5.638}
{0 CHEMBL551052,3 0.75,4 1,5 1.091,6 0.091,8 -0.069,9 1,11 3.59,12 1.622,13 1.56,14 1,15 1,16 1,20 2.281,21 3.458,22 3.454,23 3.604,24 1,25 3.018,27 2,29 2.297,30 3.65,32 1,33 0.997,34 0.163,35 1.846,36 0.801,37 1.074,38 1.404,39 1.768,40 2.15,41 2.538,42 4.868,43 -0.005,44 9,45 1,46 -0.304,47 1,48 1.396,51 3,52 2,53 0.948,54 0.029,55 3.819,56 7,57 0.699,58 3,59 2.13,60 1,61 1,62 6,63 5.699}
{0 CHEMBL564209,3 0.8,4 1,5 1.077,6 0.077,7 1,8 -0.035,9 3,11 3.624,12 1.518,13 1.47,15 4,16 4,20 2.191,21 3.562,22 3.564,23 3.623,24 1,25 3.309,27 4,29 2.409,30 3.72,33 0.852,34 0.88,35 1.62,42 4.868,43 -0.005,44 3,46 -0.691,48 1.104,51 4,52 1,53 0.999,54 -0.029,55 3.949,56 13,57 0.674,58 5,59 2,60 1,61 1,62 5,63 5.337}
{0 CHEMBL567470,3 0.75,4 1,5 1.091,6 0.091,8 -0.019,9 3,11 3.661,12 1.621,13 1.56,14 1,15 3,16 1,20 2.263,21 3.459,22 3.454,23 3.676,24 1,25 3.019,27 4,29 2.357,30 3.65,32 1,33 0.996,34 0.138,35 1.841,36 0.653,37 1.001,38 1.37,39 1.754,40 2.143,41 2.535,42 5.026,43 -0.006,44 3,45 2,46 0.222,47 2,48 1.28,51 3,52 2,53 0.94,54 0.035,55 3.827,56 7,57 0.674,58 5,59 2.004,60 1,61 5,62 4,63 5.699}
{0 CHEMBL589984,3 0.75,4 1,5 1.091,6 0.091,8 -0.007,9 7,10 1,11 3.622,12 1.521,13 1.49,15 8,16 5,20 2,21 3.428,22 3.433,23 3.632,25 3.53,27 12,29 2.32,30 3.554,32 1,33 0.932,34 0.888,35 1.745,36 0.801,37 1.074,38 1.404,39 1.768,40 2.15,41 2.538,42 4.879,43 0.04,44 6,45 1,46 -0.382,47 1,48 1.15,51 3,52 1,53 0.93,54 0.046,55 3.979,56 7,57 0.65,58 11,59 1.967,62 2,63 5.714}
{0 CHEMBL591059,3 0.75,4 1,5 1.091,6 0.091,8 -0.008,9 5,10 1,11 3.603,12 1.52,13 1.49,15 8,16 5,20 2,21 3.428,22 3.433,23 3.613,25 3.53,27 12,29 2.314,30 3.553,32 1,33 0.825,34 0.879,35 1.711,36 0.801,37 1.074,38 1.404,39 1.768,40 2.15,41 2.538,42 4.879,43 0.078,44 5,45 1,46 -0.371,47 1,48 1.136,51 3,52 1,53 0.901,54 0.069,55 3.978,56 6,57 0.655,58 11,59 1.967,62 2,63 5.455}
{0 CHEMBL591114,3 0.75,4 1,5 1.091,6 0.091,8 0.016,9 5,10 1,11 3.656,12 1.52,13 1.49,15 8,16 7,18 1,20 2,21 3.428,22 3.433,23 3.662,25 3.593,27 13,29 2.366,30 3.553,32 1,33 0.825,34 0.931,35 1.711,36 3.768,37 5.387,38 6.976,39 8.549,40 10.114,41 11.675,42 7.424,43 -0.019,44 3,45 1,46 -0.371,47 1,48 1.052,51 3,52 1,53 1.005,54 -0.025,55 3.98,56 10,57 0.638,58 11,59 1.984,61 2,62 3,63 5.943}
{0 CHEMBL591501,3 0.75,4 1,5 1.091,6 0.091,8 -0.065,9 1,11 3.6,12 1.621,13 1.559,15 1,16 1,20 2.247,21 3.459,22 3.454,23 3.612,24 1,25 3.076,27 2,29 2.298,30 3.65,33 0.997,34 0.306,35 1.836,36 1.018,37 1.287,38 1.595,39 1.928,40 2.278,41 2.638,42 5.025,43 0.02,44 9,45 1,46 -0.304,47 1,48 1.378,51 3,52 2,53 0.932,54 0.035,55 3.855,56 7,57 0.699,58 3,59 2.038,60 1,61 1,62 7,63 5.699}
{0 CHEMBL591997,3 0.75,4 1,5 1.091,6 0.091,8 0.032,9 5,10 1,11 3.704,12 1.521,13 1.49,15 8,16 7,20 2.189,21 3.428,22 3.434,23 3.703,25 3.679,27 13,29 2.42,30 3.554,32 2,33 0.825,34 -0.131,35 1.711,36 4.127,37 5.894,38 7.627,39 9.343,40 11.051,41 12.755,42 7.426,43 0.043,44 3,45 2,46 0.193,47 2,48 1.053,51 3,52 2,53 0.984,54 -0.018,55 3.988,56 9,57 0.637,58 13,59 2.009,61 2,62 2,63 5.893}
{0 CHEMBL592057,3 0.75,4 1,5 1.095,6 0.095,8 0.018,9 5,10 1,11 3.643,12 1.525,13 1.493,15 8,16 7,20 1.844,21 3.428,22 3.433,23 3.639,25 3.53,27 12,29 2.309,30 3.551,31 1,32 1,33 0.965,34 0.908,35 1.714,36 0.653,37 1.001,38 1.37,39 1.754,40 2.143,41 2.535,42 4.878,43 -0.09,44 3,45 1,46 -0.382,47 1,48 1.055,51 3,52 1,53 1.082,54 -0.13,55 3.977,56 8,57 0.639,58 12,59 1.603,61 2,62 2,63 5.921}
{0 CHEMBL592059,3 0.75,4 1,5 1.091,6 0.091,8 -0.009,9 3,11 3.602,12 1.458,13 1.434,15 7,16 4,20 2,21 3.368,22 3.382,23 3.613,25 3.497,27 10,29 2.294,30 3.52,32 1,33 0.825,34 -0.049,35 1.606,36 0.801,37 1.074,38 1.404,39 1.768,40 2.15,41 2.538,42 4.881,43 0.13,44 5,45 1,46 -0.358,47 1,48 1.121,51 3,52 1,53 0.849,54 0.142,55 3.939,56 6,57 0.661,58 10,59 1.82,62 2,63 5.246}
{0 CHEMBL592241,3 0.75,4 1,5 1.091,6 0.091,8 0.033,9 5,10 1,11 3.658,12 1.52,13 1.49,15 8,16 7,19 1,20 2,21 3.428,22 3.433,23 3.657,25 3.53,27 13,29 2.321,30 3.553,32 3,33 0.825,34 0.769,35 1.711,36 0.653,37 1.001,38 1.37,39 1.754,40 2.143,41 2.535,42 6.449,43 0.002,44 3,45 2,46 0.194,47 2,48 1.056,51 3,52 1,53 0.976,54 0.001,55 3.979,56 8,57 0.638,58 11,59 1.984,61 2,62 2,63 6.041}
{0 CHEMBL592242,3 0.75,4 1,5 1.091,6 0.091,8 0.018,9 5,10 1,11 3.66,12 1.52,13 1.49,15 8,16 7,20 2,21 3.428,22 3.433,23 3.652,25 3.53,27 13,29 2.308,30 3.552,32 1,33 0.825,34 0.916,35 1.711,36 0.653,37 1.001,38 1.37,39 1.754,40 2.143,41 2.535,42 4.879,43 -0.031,44 3,45 1,46 -0.394,47 1,48 1.073,51 3,52 1,53 1.006,54 -0.045,55 3.973,56 8,57 0.634,58 13,59 1.984,61 3,62 2,63 5.762}
{0 CHEMBL592243,3 0.75,4 1,5 1.091,6 0.091,8 0.018,9 6,10 1,11 3.706,12 1.521,13 1.49,15 8,16 7,20 2,21 3.428,22 3.434,23 3.697,25 3.53,27 15,29 2.338,30 3.554,32 1,33 0.825,34 0.912,35 1.711,36 0.653,37 1.001,38 1.37,39 1.754,40 2.143,41 2.535,42 4.879,43 0.073,44 3,45 1,46 -0.405,47 1,48 1.09,51 3,52 1,53 0.894,54 0.065,55 3.979,56 8,57 0.629,58 14,59 1.984,61 2,62 2,63 5.793}
{0 CHEMBL601295,3 0.75,4 1,5 1.091,6 0.091,8 0.007,9 5,10 1,11 3.622,12 1.521,13 1.49,15 8,16 5,20 2.037,21 3.428,22 3.433,23 3.633,25 3.53,27 12,29 2.322,30 3.555,32 1,33 0.939,34 0.807,35 1.711,36 0.801,37 1.074,38 1.404,39 1.768,40 2.15,41 2.538,42 6.456,43 0.021,44 7,45 2,46 0.193,47 2,48 1.134,51 3,52 1,53 0.959,54 0.016,55 3.979,56 6,57 0.653,58 11,59 2.009,62 2,63 5.553}
{0 CHEMBL603613,3 0.75,4 1,5 1.091,6 0.091,8 0.002,9 5,10 1,11 3.536,12 1.52,13 1.489,15 8,16 5,20 2,21 3.426,22 3.431,23 3.554,25 3.53,27 12,29 2.306,30 3.551,32 1,33 0.825,34 0.818,35 1.71,36 0.653,37 1.001,38 1.37,39 1.754,40 2.143,41 2.535,42 4.879,43 -0.02,44 5,45 1,46 -0.358,47 1,48 1.107,51 3,52 1,53 1.011,54 -0.036,55 3.972,56 6,57 0.652,58 11,59 1.952,62 2,63 5.812}
{0 CHEMBL779,3 0.333,4 4,5 1.308,6 0.308,8 0.009,10 3,11 3.637,12 1.511,13 1.459,14 1,15 7,16 7,20 2.195,21 3.343,22 3.352,23 3.662,25 3.611,27 8,29 2.551,30 3.497,33 0.889,34 -0.074,35 1.704,36 3.941,37 5.419,38 6.864,39 8.292,40 9.712,41 11.131,42 5.018,43 0.029,44 1,45 1,46 -0.336,47 1,48 1.051,51 2,52 1,53 0.966,54 0.014,55 4.022,56 4,57 0.707,58 9,59 2.145,61 1,62 1,63 4.301}
