"molecule_id","AMW","C.","H.","Me","pXC50"
{1 8.281,2 45.5,3 39.4,4 1.027,5 4.609}
{0 CHEMBL164581,1 7.93,2 48,3 40,4 1.003,5 5.222}
{0 CHEMBL1945166,1 8.615,2 50,3 38.1,4 1.003,5 5.824}
{0 CHEMBL1945167,1 8.615,2 50,3 38.1,4 1.003,5 5.959}
{0 CHEMBL1945284,1 8.615,2 50,3 38.1,4 1.003,5 6}
{0 CHEMBL2062928,1 7.981,2 44.4,3 41.7,4 1.021,5 4.996}
{0 CHEMBL424381,1 8.411,2 40,3 40,4 1.007,5 5.523}
{0 CHEMBL445718,1 7.197,2 30.8,3 51.4,4 1.009,5 6.398}
{0 CHEMBL450428,1 7.182,2 30.5,3 51,4 1.013,5 6.523}
{0 CHEMBL450846,1 6.904,2 31.1,3 53,4 1.005,5 5.699}
{0 CHEMBL463175,1 8.642,2 46.7,3 36.7,4 1.033,5 4.535}
{0 CHEMBL472851,1 9.284,2 51.7,3 31,4 1.038,5 4.502}
{0 CHEMBL495454,1 7.587,2 46.2,3 42.3,4 0.994,5 5}
{0 CHEMBL500027,1 8.403,2 42.1,3 39.5,4 1.037,5 4.544}
{0 CHEMBL501525,1 6.968,2 28,3 53.4,4 1.01,5 5.699}
{0 CHEMBL503713,1 6.917,2 31.1,3 52.1,4 1.009,5 6.155}
{0 CHEMBL504647,1 7.01,2 31,3 52.4,4 1.007,5 5.097}
{0 CHEMBL505020,1 7.01,2 31,3 52.4,4 1.007,5 6.523}
{0 CHEMBL506539,1 7.184,2 31.3,3 51.3,4 1.01,5 5.523}
{0 CHEMBL507218,1 7.099,2 31.1,3 51.1,4 1.011,5 5.398}
{0 CHEMBL508950,1 6.994,2 31.1,3 52.5,4 1.005,5 6.155}
{0 CHEMBL509348,1 7.522,2 33.3,3 48.9,4 1.009,5 4.222}
{0 CHEMBL521660,1 7.447,2 32.7,3 49.1,4 1.011,5 4.222}
{0 CHEMBL538911,1 7.401,2 31.9,3 49.3,4 1.015,5 4.523}
{0 CHEMBL599255,1 8.284,2 46.9,3 40.8,4 1.005,5 5.678}
