"molecule_id","AMW","C.","H.","Me","Mi","Mp","Mv","MW","N.","nAB","nAT","nB","nBM","nBO","nBR","nBT","nC","nCL","nCsp","nCsp2","nCsp3","nDB","nF","nH","nHet","nHM","nI","nN","nO","nP","nS","nSK","nTB","nX","O.","RBF","RBN","SCBO","Se","Si","Sp","Sv","X.","pXC50"
{1 8.65,2 37,3 43.5,4 1.021,5 1.129,6 0.678,7 0.645,8 397.92,9 6.5,10 11,11 46,13 14,14 28,16 48,17 17,18 1,20 11,21 6,22 3,24 20,25 9,26 2,28 3,29 4,31 1,32 26,34 1,35 8.7,36 0.083,37 4,38 36.5,39 46.967,40 51.933,41 31.193,42 29.679,43 2.2,44 6.495}
{0 CHEMBL460141,1 7.704,2 36.7,3 46.9,4 1.011,5 1.131,6 0.655,7 0.62,8 377.51,9 6.1,10 11,11 49,13 14,14 28,16 51,17 18,20 11,21 7,22 3,24 23,25 8,26 1,28 3,29 4,31 1,32 26,35 8.2,36 0.078,37 4,38 36.5,39 49.527,40 55.405,41 32.097,42 30.379,44 4.301}
{0 CHEMBL461187,1 7.802,2 37.5,3 45.8,4 1.009,5 1.131,6 0.664,7 0.628,8 374.51,9 8.3,10 12,11 48,13 15,14 28,16 50,17 18,20 12,21 6,22 3,24 22,25 8,26 1,28 4,29 3,31 1,32 26,35 6.3,36 0.08,37 4,38 37,39 48.418,40 54.278,41 31.887,42 30.158,44 4.301}
{0 CHEMBL462478,1 7.713,2 36.2,3 46.8,4 1.009,5 1.134,6 0.657,7 0.62,8 362.5,9 8.5,10 11,11 47,13 14,14 27,16 49,17 17,20 11,21 6,22 3,24 22,25 8,26 1,28 4,29 3,31 1,32 25,35 6.4,36 0.082,37 4,38 35.5,39 47.418,40 53.278,41 30.887,42 29.158,44 4.301}
{0 CHEMBL462694,1 7.902,2 34.8,3 45.7,4 1.014,5 1.138,6 0.655,7 0.623,8 363.49,9 10.9,10 11,11 46,13 14,14 27,16 48,17 16,20 10,21 6,22 3,24 21,25 9,26 1,28 5,29 3,31 1,32 25,35 6.5,36 0.083,37 4,38 35.5,39 46.636,40 52.361,41 30.131,42 28.653,44 4.301}
{0 CHEMBL466198,1 7.688,2 40.7,3 45.8,4 1.005,5 1.123,6 0.672,7 0.634,8 453.61,9 5.1,10 17,11 59,13 20,14 35,16 62,17 24,20 17,21 7,22 3,24 27,25 8,26 1,28 3,29 4,31 1,32 32,35 6.8,36 0.097,37 6,38 46.5,39 59.294,40 66.235,41 39.62,42 37.432,44 5.602}
{0 CHEMBL467023,1 7.53,2 36.5,3 48.1,4 1.008,5 1.131,6 0.651,7 0.614,8 391.54,9 5.8,10 11,11 52,13 14,14 29,16 54,17 19,20 11,21 8,22 3,24 25,25 8,26 1,28 3,29 4,31 1,32 27,35 7.7,36 0.093,37 5,38 37.5,39 52.411,40 58.82,41 33.858,42 31.905,44 6.398}
{0 CHEMBL468071,1 7.87,2 36,3 46,4 1.017,5 1.132,6 0.651,7 0.622,8 393.51,9 6,10 11,11 50,13 14,14 29,16 52,17 18,20 11,21 7,22 3,24 23,25 9,26 1,28 3,29 5,31 1,32 27,35 10,36 0.096,37 5,38 37.5,39 50.854,40 56.614,41 32.551,42 31.093,44 6.886}
{0 CHEMBL468271,1 7.704,2 36.7,3 46.9,4 1.011,5 1.131,6 0.655,7 0.62,8 377.51,9 6.1,10 11,11 49,13 14,14 28,16 51,17 18,20 11,21 7,22 3,24 23,25 8,26 1,28 3,29 4,31 1,32 26,35 8.2,36 0.098,37 5,38 36.5,39 49.527,40 55.405,41 32.097,42 30.379,44 4.301}
{0 CHEMBL468281,1 7.988,2 34.8,3 45.7,4 1.021,5 1.135,6 0.648,7 0.621,8 367.47,9 6.5,10 11,11 46,13 14,14 26,16 47,17 16,20 11,21 5,22 3,24 21,25 9,26 1,28 3,29 5,31 1,32 25,35 10.9,36 0.149,37 7,38 34.5,39 46.971,40 52.199,41 29.79,42 28.567,44 7.301}
{0 CHEMBL468282,1 8.293,2 35.9,3 43.6,4 1.022,5 1.132,6 0.662,7 0.636,8 323.41,9 7.7,10 11,11 39,13 14,14 23,16 40,17 14,20 11,21 3,22 3,24 17,25 8,26 1,28 3,29 4,31 1,32 22,35 10.3,36 0.1,37 4,38 31.5,39 39.876,40 44.159,41 25.813,42 24.798,44 7}
{0 CHEMBL468910,1 8.407,2 36.7,3 44.9,4 1.017,5 1.13,6 0.673,7 0.637,8 411.95,9 6.1,10 11,11 49,13 14,14 29,16 51,17 18,18 1,20 11,21 7,22 3,24 22,25 9,26 2,28 3,29 4,31 1,32 27,34 1,35 8.2,36 0.078,37 4,38 37.5,39 49.851,40 55.349,41 32.955,42 31.206,43 2,44 4.301}
{0 CHEMBL468911,1 7.92,2 38.6,3 45.5,4 1.012,5 1.125,6 0.667,7 0.633,8 348.46,9 4.5,10 11,11 44,13 14,14 26,16 46,17 17,20 11,21 6,22 3,24 20,25 7,26 1,28 2,29 4,31 1,32 24,35 9.1,36 0.087,37 4,38 34.5,39 44.542,40 49.491,41 29.33,42 27.83,44 4.301}
{0 CHEMBL469114,1 7.885,2 35.4,3 45.8,4 1.016,5 1.135,6 0.653,7 0.622,8 378.5,9 8.3,10 11,11 48,13 14,14 28,16 50,17 17,20 11,21 6,22 3,24 22,25 9,26 1,28 4,29 4,31 1,32 26,35 8.3,36 0.08,37 4,38 36.5,39 48.745,40 54.488,41 31.341,42 29.873,44 6.301}
{0 CHEMBL505390,1 8.65,2 37,3 43.5,4 1.021,5 1.129,6 0.678,7 0.645,8 397.92,9 6.5,10 11,11 46,13 14,14 28,16 48,17 17,18 1,20 11,21 6,22 3,24 20,25 9,26 2,28 3,29 4,31 1,32 26,34 1,35 8.7,36 0.083,37 4,38 36.5,39 46.967,40 51.933,41 31.193,42 29.679,43 2.2,44 6.886}
{0 CHEMBL506964,1 7.989,2 38.3,3 44.7,4 1.014,5 1.127,6 0.667,7 0.635,8 375.49,9 6.4,10 12,11 47,13 15,14 28,16 49,17 18,20 13,21 5,22 3,24 21,25 8,26 1,28 3,29 4,31 1,32 26,35 8.5,36 0.082,37 4,38 37,39 47.643,40 52.989,41 31.335,42 29.852,44 4.301}
{0 CHEMBL512119,1 7.704,2 36.7,3 46.9,4 1.011,5 1.131,6 0.655,7 0.62,8 377.51,9 6.1,10 11,11 49,13 14,14 28,16 51,17 18,20 11,21 7,22 3,24 23,25 8,26 1,28 3,29 4,31 1,32 26,35 8.2,36 0.078,37 4,38 36.5,39 49.527,40 55.405,41 32.097,42 30.379,44 4.796}
{0 CHEMBL512951,1 7.704,2 36.7,3 46.9,4 1.011,5 1.131,6 0.655,7 0.62,8 377.51,9 6.1,10 11,11 49,13 14,14 28,16 51,17 18,20 11,21 7,22 3,24 23,25 8,26 1,28 3,29 4,31 1,32 26,35 8.2,36 0.078,37 4,38 36.5,39 49.527,40 55.405,41 32.097,42 30.379,44 4.301}
{0 CHEMBL513340,1 8.638,2 41.9,3 39.5,4 1.02,5 1.12,6 0.693,7 0.67,8 371.45,9 7,10 17,11 43,13 20,14 28,16 45,17 18,20 17,21 1,22 3,24 17,25 8,26 1,28 3,29 4,31 1,32 26,35 9.3,36 0.111,37 5,38 39.5,39 43.876,40 48.159,41 29.813,42 28.798,44 6.398}
{0 CHEMBL513349,1 7.902,2 37,3 45.7,4 1.014,5 1.13,6 0.659,7 0.627,8 363.48,9 6.5,10 11,11 46,13 14,14 27,16 48,17 17,20 11,21 6,22 3,24 21,25 8,26 1,28 3,29 4,31 1,32 25,35 8.7,36 0.083,37 4,38 35.5,39 46.643,40 51.989,41 30.335,42 28.852,44 7}
{0 CHEMBL513697,1 8.306,2 36.4,3 43.2,4 1.025,5 1.131,6 0.66,7 0.637,8 365.45,9 6.8,10 11,11 44,13 14,14 27,16 46,17 16,20 11,21 5,22 3,24 19,25 9,26 1,28 3,29 5,31 1,32 25,35 11.4,36 0.087,37 4,38 35.5,39 45.087,40 49.784,41 29.029,42 28.04,44 7.398}
{0 CHEMBL517905,1 8.127,2 37.2,3 44.2,4 1.018,5 1.13,6 0.665,7 0.635,8 349.45,9 7,10 11,11 43,13 14,14 26,16 45,17 16,20 11,21 5,22 3,24 19,25 8,26 1,28 3,29 4,31 1,32 24,35 9.3,36 0.089,37 4,38 34.5,39 43.76,40 48.574,41 28.574,42 27.325,44 5.398}
{0 CHEMBL518672,1 7.531,2 36,3 48,4 1.006,5 1.134,6 0.653,7 0.614,8 376.53,9 8,10 11,11 50,13 14,14 28,16 52,17 18,20 11,21 7,22 3,24 24,25 8,26 1,28 4,29 3,31 1,32 26,35 6,36 0.077,37 4,38 36.5,39 50.302,40 56.693,41 32.648,42 30.685,44 4.301}
