{
  "data_features": {
    "feature": [
      {
        "data_type": "nominal",
        "index": "0",
        "is_ignore": "false",
        "is_row_identifier": "true",
        "is_target": "false",
        "name": "molecule_id",
        "nominal_value": [
          "CHEMBL100635",
          "CHEMBL101036",
          "CHEMBL103299",
          "CHEMBL10780",
          "CHEMBL11608",
          "CHEMBL1162428",
          "CHEMBL1182312",
          "CHEMBL1200550",
          "CHEMBL1200705",
          "CHEMBL1201201",
          "CHEMBL1230845",
          "CHEMBL124049",
          "CHEMBL124063",
          "CHEMBL124733",
          "CHEMBL1256819",
          "CHEMBL1300561",
          "CHEMBL1303239",
          "CHEMBL1305907",
          "CHEMBL130703",
          "CHEMBL1307118",
          "CHEMBL1309367",
          "CHEMBL131145",
          "CHEMBL1313769",
          "CHEMBL1315467",
          "CHEMBL1318257",
          "CHEMBL1318522",
          "CHEMBL1323911",
          "CHEMBL1329321",
          "CHEMBL1332279",
          "CHEMBL1336531",
          "CHEMBL1340446",
          "CHEMBL1342198",
          "CHEMBL1345189",
          "CHEMBL1345740",
          "CHEMBL1346716",
          "CHEMBL1348375",
          "CHEMBL1353406",
          "CHEMBL1354425",
          "CHEMBL1360078",
          "CHEMBL1362116",
          "CHEMBL1363380",
          "CHEMBL1364849",
          "CHEMBL1366348",
          "CHEMBL1368074",
          "CHEMBL1372064",
          "CHEMBL1372691",
          "CHEMBL1375903",
          "CHEMBL1376491",
          "CHEMBL1377551",
          "CHEMBL1377675",
          "CHEMBL1378332",
          "CHEMBL1379693",
          "CHEMBL1382433",
          "CHEMBL1383417",
          "CHEMBL1386399",
          "CHEMBL1386679",
          "CHEMBL1391288",
          "CHEMBL1402878",
          "CHEMBL1404043",
          "CHEMBL1404664",
          "CHEMBL1410154",
          "CHEMBL1415470",
          "CHEMBL1417050",
          "CHEMBL1420608",
          "CHEMBL1421450",
          "CHEMBL1423790",
          "CHEMBL1425734",
          "CHEMBL1427061",
          "CHEMBL1428644",
          "CHEMBL1429050",
          "CHEMBL1432152",
          "CHEMBL1435619",
          "CHEMBL1438255",
          "CHEMBL1438915",
          "CHEMBL1447789",
          "CHEMBL1448326",
          "CHEMBL1449262",
          "CHEMBL1451121",
          "CHEMBL1451260",
          "CHEMBL1454674",
          "CHEMBL145584",
          "CHEMBL1457579",
          "CHEMBL1458675",
          "CHEMBL1462723",
          "CHEMBL1463562",
          "CHEMBL1463960",
          "CHEMBL1464201",
          "CHEMBL1467587",
          "CHEMBL1468979",
          "CHEMBL1468992",
          "CHEMBL1469426",
          "CHEMBL1472129",
          "CHEMBL147230",
          "CHEMBL1476474",
          "CHEMBL1476854",
          "CHEMBL1481854",
          "CHEMBL1482973",
          "CHEMBL1486681",
          "CHEMBL1490948",
          "CHEMBL1491982",
          "CHEMBL149652",
          "CHEMBL1500484",
          "CHEMBL1501007",
          "CHEMBL1506119",
          "CHEMBL1507929",
          "CHEMBL1508812",
          "CHEMBL1510163",
          "CHEMBL1511007",
          "CHEMBL1511312",
          "CHEMBL1512974",
          "CHEMBL1521368",
          "CHEMBL1524074",
          "CHEMBL1525419",
          "CHEMBL1526328",
          "CHEMBL1528135",
          "CHEMBL1529081",
          "CHEMBL1532210",
          "CHEMBL1537110",
          "CHEMBL1538734",
          "CHEMBL1540878",
          "CHEMBL1540947",
          "CHEMBL154103",
          "CHEMBL1541755",
          "CHEMBL1542557",
          "CHEMBL1547381",
          "CHEMBL1547425",
          "CHEMBL1550546",
          "CHEMBL1557071",
          "CHEMBL1561828",
          "CHEMBL1562679",
          "CHEMBL1564914",
          "CHEMBL1574",
          "CHEMBL1576496",
          "CHEMBL1578186",
          "CHEMBL1578295",
          "CHEMBL1578371",
          "CHEMBL1579150",
          "CHEMBL1582580",
          "CHEMBL1585945",
          "CHEMBL1589413",
          "CHEMBL1589612",
          "CHEMBL1589687",
          "CHEMBL1593829",
          "CHEMBL1597959",
          "CHEMBL1599142",
          "CHEMBL1599156",
          "CHEMBL1602445",
          "CHEMBL1602864",
          "CHEMBL1603221",
          "CHEMBL1603300",
          "CHEMBL1603785",
          "CHEMBL1606897",
          "CHEMBL1608597",
          "CHEMBL1609487",
          "CHEMBL1609529",
          "CHEMBL1610758",
          "CHEMBL1669632",
          "CHEMBL1669633",
          "CHEMBL1669669",
          "CHEMBL1698898",
          "CHEMBL1699232",
          "CHEMBL1700821",
          "CHEMBL1703117",
          "CHEMBL1704306",
          "CHEMBL1704437",
          "CHEMBL1710088",
          "CHEMBL1710933",
          "CHEMBL1715111",
          "CHEMBL1718277",
          "CHEMBL1718535",
          "CHEMBL1722433",
          "CHEMBL1728498",
          "CHEMBL1732067",
          "CHEMBL1735835",
          "CHEMBL1736439",
          "CHEMBL1788307",
          "CHEMBL1870655",
          "CHEMBL1871423",
          "CHEMBL1873950",
          "CHEMBL1877432",
          "CHEMBL1878125",
          "CHEMBL1878997",
          "CHEMBL1880660",
          "CHEMBL1882311",
          "CHEMBL1882407",
          "CHEMBL1886030",
          "CHEMBL1887682",
          "CHEMBL1891198",
          "CHEMBL1896563",
          "CHEMBL1896865",
          "CHEMBL1905908",
          "CHEMBL1927024",
          "CHEMBL1927025",
          "CHEMBL1927026",
          "CHEMBL1927027",
          "CHEMBL1927028",
          "CHEMBL1927030",
          "CHEMBL19393",
          "CHEMBL195390",
          "CHEMBL1995645",
          "CHEMBL1999268",
          "CHEMBL217315",
          "CHEMBL217680",
          "CHEMBL2206369",
          "CHEMBL2206370",
          "CHEMBL2206371",
          "CHEMBL2206372",
          "CHEMBL2206373",
          "CHEMBL2206374",
          "CHEMBL2206375",
          "CHEMBL2206376",
          "CHEMBL2206377",
          "CHEMBL2206378",
          "CHEMBL2206379",
          "CHEMBL2206380",
          "CHEMBL2206381",
          "CHEMBL2206382",
          "CHEMBL2206383",
          "CHEMBL2206384",
          "CHEMBL2206385",
          "CHEMBL2206386",
          "CHEMBL2206387",
          "CHEMBL2206388",
          "CHEMBL2206389",
          "CHEMBL2206390",
          "CHEMBL2206391",
          "CHEMBL2206392",
          "CHEMBL2206393",
          "CHEMBL2206394",
          "CHEMBL2206395",
          "CHEMBL2206396",
          "CHEMBL2206397",
          "CHEMBL2206398",
          "CHEMBL2206399",
          "CHEMBL2206400",
          "CHEMBL2206401",
          "CHEMBL2206402",
          "CHEMBL2206403",
          "CHEMBL2206404",
          "CHEMBL2206405",
          "CHEMBL2206406",
          "CHEMBL2206407",
          "CHEMBL2206408",
          "CHEMBL2206889",
          "CHEMBL2206890",
          "CHEMBL2354461",
          "CHEMBL2354809",
          "CHEMBL2355110",
          "CHEMBL2355518",
          "CHEMBL2355870",
          "CHEMBL2356177",
          "CHEMBL2356254",
          "CHEMBL2356751",
          "CHEMBL2357051",
          "CHEMBL2357198",
          "CHEMBL2358598",
          "CHEMBL2358672",
          "CHEMBL2359354",
          "CHEMBL2359412",
          "CHEMBL2360906",
          "CHEMBL2361028",
          "CHEMBL257990",
          "CHEMBL274497",
          "CHEMBL287047",
          "CHEMBL292821",
          "CHEMBL316698",
          "CHEMBL345735",
          "CHEMBL348369",
          "CHEMBL367501",
          "CHEMBL379916",
          "CHEMBL407939",
          "CHEMBL420095",
          "CHEMBL442603",
          "CHEMBL443141",
          "CHEMBL445701",
          "CHEMBL446131",
          "CHEMBL446238",
          "CHEMBL446560",
          "CHEMBL447753",
          "CHEMBL448232",
          "CHEMBL448523",
          "CHEMBL448576",
          "CHEMBL449727",
          "CHEMBL450477",
          "CHEMBL450561",
          "CHEMBL451372",
          "CHEMBL452901",
          "CHEMBL452929",
          "CHEMBL453206",
          "CHEMBL453667",
          "CHEMBL45763",
          "CHEMBL46278",
          "CHEMBL468880",
          "CHEMBL476107",
          "CHEMBL476324",
          "CHEMBL476516",
          "CHEMBL476517",
          "CHEMBL476748",
          "CHEMBL476750",
          "CHEMBL477764",
          "CHEMBL478405",
          "CHEMBL478845",
          "CHEMBL478847",
          "CHEMBL494421",
          "CHEMBL505110",
          "CHEMBL505644",
          "CHEMBL506244",
          "CHEMBL508125",
          "CHEMBL508991",
          "CHEMBL509223",
          "CHEMBL509695",
          "CHEMBL510649",
          "CHEMBL525826",
          "CHEMBL546344",
          "CHEMBL553503",
          "CHEMBL560832",
          "CHEMBL589061",
          "CHEMBL610",
          "CHEMBL612",
          "CHEMBL61251",
          "CHEMBL69700",
          "CHEMBL71033",
          "CHEMBL770"
        ],
        "number_of_missing_values": "0"
      },
      {
        "data_type": "numeric",
        "index": "1",
        "is_ignore": "false",
        "is_row_identifier": "false",
        "is_target": "false",
        "name": "AMW",
        "number_of_missing_values": "0"
      },
      {
        "data_type": "numeric",
        "index": "2",
        "is_ignore": "false",
        "is_row_identifier": "false",
        "is_target": "false",
        "name": "C.",
        "number_of_missing_values": "0"
      },
      {
        "data_type": "numeric",
        "index": "3",
        "is_ignore": "false",
        "is_row_identifier": "false",
        "is_target": "false",
        "name": "H.",
        "number_of_missing_values": "0"
      },
      {
        "data_type": "numeric",
        "index": "4",
        "is_ignore": "false",
        "is_row_identifier": "false",
        "is_target": "false",
        "name": "Me",
        "number_of_missing_values": "0"
      },
      {
        "data_type": "numeric",
        "index": "5",
        "is_ignore": "false",
        "is_row_identifier": "false",
        "is_target": "false",
        "name": "Mi",
        "number_of_missing_values": "0"
      },
      {
        "data_type": "numeric",
        "index": "6",
        "is_ignore": "false",
        "is_row_identifier": "false",
        "is_target": "false",
        "name": "Mp",
        "number_of_missing_values": "0"
      },
      {
        "data_type": "numeric",
        "index": "7",
        "is_ignore": "false",
        "is_row_identifier": "false",
        "is_target": "false",
        "name": "Mv",
        "number_of_missing_values": "0"
      },
      {
        "data_type": "numeric",
        "index": "8",
        "is_ignore": "false",
        "is_row_identifier": "false",
        "is_target": "false",
        "name": "MW",
        "number_of_missing_values": "0"
      },
      {
        "data_type": "numeric",
        "index": "9",
        "is_ignore": "false",
        "is_row_identifier": "false",
        "is_target": "false",
        "name": "N.",
        "number_of_missing_values": "0"
      },
      {
        "data_type": "numeric",
        "index": "10",
        "is_ignore": "false",
        "is_row_identifier": "false",
        "is_target": "false",
        "name": "nAB",
        "number_of_missing_values": "0"
      },
      {
        "data_type": "numeric",
        "index": "11",
        "is_ignore": "false",
        "is_row_identifier": "false",
        "is_target": "false",
        "name": "nAT",
        "number_of_missing_values": "0"
      },
      {
        "data_type": "numeric",
        "index": "12",
        "is_ignore": "false",
        "is_row_identifier": "false",
        "is_target": "false",
        "name": "nB",
        "number_of_missing_values": "0"
      },
      {
        "data_type": "numeric",
        "index": "13",
        "is_ignore": "false",
        "is_row_identifier": "false",
        "is_target": "false",
        "name": "nBM",
        "number_of_missing_values": "0"
      },
      {
        "data_type": "numeric",
        "index": "14",
        "is_ignore": "false",
        "is_row_identifier": "false",
        "is_target": "false",
        "name": "nBO",
        "number_of_missing_values": "0"
      },
      {
        "data_type": "numeric",
        "index": "15",
        "is_ignore": "false",
        "is_row_identifier": "false",
        "is_target": "false",
        "name": "nBR",
        "number_of_missing_values": "0"
      },
      {
        "data_type": "numeric",
        "index": "16",
        "is_ignore": "false",
        "is_row_identifier": "false",
        "is_target": "false",
        "name": "nBT",
        "number_of_missing_values": "0"
      },
      {
        "data_type": "numeric",
        "index": "17",
        "is_ignore": "false",
        "is_row_identifier": "false",
        "is_target": "false",
        "name": "nC",
        "number_of_missing_values": "0"
      },
      {
        "data_type": "numeric",
        "index": "18",
        "is_ignore": "false",
        "is_row_identifier": "false",
        "is_target": "false",
        "name": "nCL",
        "number_of_missing_values": "0"
      },
      {
        "data_type": "numeric",
        "index": "19",
        "is_ignore": "false",
        "is_row_identifier": "false",
        "is_target": "false",
        "name": "nCsp",
        "number_of_missing_values": "0"
      },
      {
        "data_type": "numeric",
        "index": "20",
        "is_ignore": "false",
        "is_row_identifier": "false",
        "is_target": "false",
        "name": "nCsp2",
        "number_of_missing_values": "0"
      },
      {
        "data_type": "numeric",
        "index": "21",
        "is_ignore": "false",
        "is_row_identifier": "false",
        "is_target": "false",
        "name": "nCsp3",
        "number_of_missing_values": "0"
      },
      {
        "data_type": "numeric",
        "index": "22",
        "is_ignore": "false",
        "is_row_identifier": "false",
        "is_target": "false",
        "name": "nDB",
        "number_of_missing_values": "0"
      },
      {
        "data_type": "numeric",
        "index": "23",
        "is_ignore": "false",
        "is_row_identifier": "false",
        "is_target": "false",
        "name": "nF",
        "number_of_missing_values": "0"
      },
      {
        "data_type": "numeric",
        "index": "24",
        "is_ignore": "false",
        "is_row_identifier": "false",
        "is_target": "false",
        "name": "nH",
        "number_of_missing_values": "0"
      },
      {
        "data_type": "numeric",
        "index": "25",
        "is_ignore": "false",
        "is_row_identifier": "false",
        "is_target": "false",
        "name": "nHet",
        "number_of_missing_values": "0"
      },
      {
        "data_type": "numeric",
        "index": "26",
        "is_ignore": "false",
        "is_row_identifier": "false",
        "is_target": "false",
        "name": "nHM",
        "number_of_missing_values": "0"
      },
      {
        "data_type": "numeric",
        "index": "27",
        "is_ignore": "false",
        "is_row_identifier": "false",
        "is_target": "false",
        "name": "nI",
        "number_of_missing_values": "0"
      },
      {
        "data_type": "numeric",
        "index": "28",
        "is_ignore": "false",
        "is_row_identifier": "false",
        "is_target": "false",
        "name": "nN",
        "number_of_missing_values": "0"
      },
      {
        "data_type": "numeric",
        "index": "29",
        "is_ignore": "false",
        "is_row_identifier": "false",
        "is_target": "false",
        "name": "nO",
        "number_of_missing_values": "0"
      },
      {
        "data_type": "numeric",
        "index": "30",
        "is_ignore": "false",
        "is_row_identifier": "false",
        "is_target": "false",
        "name": "nP",
        "number_of_missing_values": "0"
      },
      {
        "data_type": "numeric",
        "index": "31",
        "is_ignore": "false",
        "is_row_identifier": "false",
        "is_target": "false",
        "name": "nS",
        "number_of_missing_values": "0"
      },
      {
        "data_type": "numeric",
        "index": "32",
        "is_ignore": "false",
        "is_row_identifier": "false",
        "is_target": "false",
        "name": "nSK",
        "number_of_missing_values": "0"
      },
      {
        "data_type": "numeric",
        "index": "33",
        "is_ignore": "false",
        "is_row_identifier": "false",
        "is_target": "false",
        "name": "nTB",
        "number_of_missing_values": "0"
      },
      {
        "data_type": "numeric",
        "index": "34",
        "is_ignore": "false",
        "is_row_identifier": "false",
        "is_target": "false",
        "name": "nX",
        "number_of_missing_values": "0"
      },
      {
        "data_type": "numeric",
        "index": "35",
        "is_ignore": "false",
        "is_row_identifier": "false",
        "is_target": "false",
        "name": "O.",
        "number_of_missing_values": "0"
      },
      {
        "data_type": "numeric",
        "index": "36",
        "is_ignore": "false",
        "is_row_identifier": "false",
        "is_target": "false",
        "name": "RBF",
        "number_of_missing_values": "0"
      },
      {
        "data_type": "numeric",
        "index": "37",
        "is_ignore": "false",
        "is_row_identifier": "false",
        "is_target": "false",
        "name": "RBN",
        "number_of_missing_values": "0"
      },
      {
        "data_type": "numeric",
        "index": "38",
        "is_ignore": "false",
        "is_row_identifier": "false",
        "is_target": "false",
        "name": "SCBO",
        "number_of_missing_values": "0"
      },
      {
        "data_type": "numeric",
        "index": "39",
        "is_ignore": "false",
        "is_row_identifier": "false",
        "is_target": "false",
        "name": "Se",
        "number_of_missing_values": "0"
      },
      {
        "data_type": "numeric",
        "index": "40",
        "is_ignore": "false",
        "is_row_identifier": "false",
        "is_target": "false",
        "name": "Si",
        "number_of_missing_values": "0"
      },
      {
        "data_type": "numeric",
        "index": "41",
        "is_ignore": "false",
        "is_row_identifier": "false",
        "is_target": "false",
        "name": "Sp",
        "number_of_missing_values": "0"
      },
      {
        "data_type": "numeric",
        "index": "42",
        "is_ignore": "false",
        "is_row_identifier": "false",
        "is_target": "false",
        "name": "Sv",
        "number_of_missing_values": "0"
      },
      {
        "data_type": "numeric",
        "index": "43",
        "is_ignore": "false",
        "is_row_identifier": "false",
        "is_target": "false",
        "name": "X.",
        "number_of_missing_values": "0"
      },
      {
        "data_type": "numeric",
        "index": "44",
        "is_ignore": "false",
        "is_row_identifier": "false",
        "is_target": "true",
        "name": "pXC50",
        "number_of_missing_values": "0"
      }
    ]
  }
}