{
  "data_set_description": {
    "collection_date": "November 2013",
    "creator": "Dr Jeremy Besnard, Dr Ivan Olier, Dr Noureddin Sadawi, Dr Larisa Soldatova, Dr Crina Grosan, Prof Ross King, Dr Richard Bickerton, Prof Andrew Hopkins and Dr Willem van Hoorn",
    "default_target_attribute": "pXC50",
    "description": "This dataset contains QSAR data (from ChEMBL version 17) showing activity values (unit is pseudo-pCI50) of several compounds on drug target ChEMBL_ID: CHEMBL1743125 (TID: 104066), and it has 46 rows and 1224 features (not including molecule IDs and class feature: molecule_id and pXC50). The features represent Molecular Descriptors which were generated from SMILES strings. Missing value imputation was applied to this dataset (By choosing the Median).",
    "description_version": "1",
    "file_id": "3322661",
    "format": "ARFF",
    "id": "27172",
    "licence": "Public",
    "md5_checksum": "5d0dfbf4ad78290fff8009d18f22c157",
    "minio_url": "https://data.openml.org/datasets/0002/27172/dataset_27172.pq",
    "name": "QSAR-DATASET-FOR-DRUG-TARGET-CHEMBL1743125",
    "original_data_url": "https://www.ebi.ac.uk/chembl/target/inspect/CHEMBL1743125",
    "parquet_url": "https://data.openml.org/datasets/0002/27172/dataset_27172.pq",
    "processing_date": "2018-10-04 00:09:43",
    "row_id_attribute": "molecule_id",
    "status": "deactivated",
    "tag": [
      "MetaQSAR",
      "study_13"
    ],
    "upload_date": "2016-07-14T20:57:01",
    "url": "https://api.openml.org/data/v1/download/3322661/QSAR-DATASET-FOR-DRUG-TARGET-CHEMBL1743125.arff",
    "version": "7",
    "visibility": "public"
  }
}